"Index";"Time";"TC"
1;2.46484375;00:00:02:55;0.2492564917;0.6409341693;-0.21850954;-0;0;-0;0;0;0;1
2;2.47265625;00:00:02:56;0.2491151839;0.6410120726;-0.2185619622;-0;0;-0;0;0;0;1
3;2.48046875;00:00:02:57;0.2489915341;0.6410828829;-0.2186191976;-0;0;-0;0;0;0;1
4;2.4921875;00:00:02:59;0.2488680482;0.6411592364;-0.2186723948;-0;0;-0;0;0;0;1
5;2.5;00:00:02:60;0.248729527;0.6412466168;-0.2187121063;-0;0;-0;0;0;0;1
6;2.5078125;00:00:02:60;0.2486054003;0.6413210034;-0.2187582254;-0;0;-0;0;0;0;1
7;2.515625;00:00:02:61;0.2484935522;0.6413841844;-0.2188076228;-0;0;-0;0;0;0;1
8;2.5234375;00:00:02:62;0.2484094799;0.6414343119;-0.2188512683;-0;0;-0;0;0;0;1
9;2.53125;00:00:02:63;0.2483332157;0.6414859295;-0.218870163;-0;0;-0;0;0;0;1
10;2.5390625;00:00:02:64;0.2482509762;0.6415410638;-0.2188761085;-0;0;-0;0;0;0;1
11;2.546875;00:00:02:65;0.2481841296;0.6415823102;-0.2188659012;-0;0;-0;0;0;0;1
12;2.55859375;00:00:02:67;0.2481371313;0.6416118145;-0.2188581079;-0;0;-0;0;0;0;1
13;2.56640625;00:00:02:67;0.2480993569;0.6416381598;-0.2188525796;-0;0;-0;0;0;0;1
14;2.57421875;00:00:02:68;0.2480677217;0.6416633129;-0.2188486755;-0;0;-0;0;0;0;1
15;2.58203125;00:00:02:69;0.2480441779;0.6416978836;-0.2188556194;-0;0;-0;0;0;0;1
16;2.58984375;00:00:02:70;0.2480202317;0.6417283416;-0.2188708186;-0;0;-0;0;0;0;1
17;2.59765625;00:00:02:71;0.2479996085;0.6417733431;-0.2188715488;-0;0;-0;0;0;0;1
18;2.60546875;00:00:02:72;0.2479856908;0.6418162584;-0.2188723832;-0;0;-0;0;0;0;1
19;2.6171875;00:00:02:74;0.2479908764;0.641851902;-0.2188698202;-0;0;-0;0;0;0;1
20;2.625;00:00:02:75;0.2480025589;0.6418966651;-0.2188666612;-0;0;-0;0;0;0;1
21;2.6328125;00:00:02:75;0.248024255;0.6419264078;-0.2188622206;-0;0;-0;0;0;0;1
22;2.640625;00:00:02:76;0.2480588406;0.6419541836;-0.2188631892;-0;0;-0;0;0;0;1
23;2.6484375;00:00:02:77;0.248104319;0.6419772506;-0.2188629657;-0;0;-0;0;0;0;1
24;2.65625;00:00:02:78;0.2481458932;0.6419835091;-0.2188768983;-0;0;-0;0;0;0;1
25;2.6640625;00:00:02:79;0.2481988668;0.6419858336;-0.2188752741;-0;0;-0;0;0;0;1
26;2.671875;00:00:02:80;0.2482374907;0.6419829726;-0.2188628167;-0;0;-0;0;0;0;1
27;2.68359375;00:00:02:82;0.2482758462;0.6419955492;-0.2188663781;-0;0;-0;0;0;0;1
28;2.69140625;00:00:02:82;0.2483074516;0.6419974566;-0.2188852727;-0;0;-0;0;0;0;1
29;2.69921875;00:00:02:83;0.2483431995;0.6419948339;-0.2189000398;-0;0;-0;0;0;0;1
30;2.70703125;00:00:02:84;0.2483724952;0.6419827342;-0.2188952565;-0;0;-0;0;0;0;1
31;2.71484375;00:00:02:85;0.2484105378;0.6419692039;-0.2188972235;-0;0;-0;0;0;0;1
32;2.72265625;00:00:02:86;0.2484569997;0.6419451237;-0.2188878059;-0;0;-0;0;0;0;1
33;2.73046875;00:00:02:87;0.2484951764;0.6419194341;-0.218892023;-0;0;-0;0;0;0;1
34;2.7421875;00:00:02:89;0.2485277206;0.6418992877;-0.2189206183;-0;0;-0;0;0;0;1
35;2.75;00:00:02:90;0.2485627234;0.6418871284;-0.2189475745;-0;0;-0;0;0;0;1
36;2.7578125;00:00:02:90;0.2485931367;0.6418729424;-0.2189801037;-0;0;-0;0;0;0;1
37;2.765625;00:00:02:91;0.2486386895;0.6418607235;-0.2189919204;-0;0;-0;0;0;0;1
38;2.7734375;00:00:02:92;0.2486872077;0.641849041;-0.2190026194;-0;0;-0;0;0;0;1
39;2.78125;00:00:02:93;0.2487577498;0.6418296695;-0.219015047;-0;0;-0;0;0;0;1
40;2.7890625;00:00:02:94;0.2488313764;0.6418029666;-0.2190130502;-0;0;-0;0;0;0;1
41;2.796875;00:00:02:95;0.248893559;0.6417847872;-0.2190238088;-0;0;-0;0;0;0;1
42;2.80859375;00:00:02:97;0.2489514053;0.641770184;-0.2190344185;-0;0;-0;0;0;0;1
43;2.81640625;00:00:02:97;0.248993665;0.6417630911;-0.2190610021;-0;0;-0;0;0;0;1
44;2.82421875;00:00:02:98;0.2490336895;0.641752243;-0.219081834;-0;0;-0;0;0;0;1
45;2.83203125;00:00:02:99;0.2490661889;0.6417437792;-0.2190859914;-0;0;-0;0;0;0;1
46;2.83984375;00:00:02:100;0.2490927726;0.6417369843;-0.2191024274;-0;0;-0;0;0;0;1
47;2.84765625;00:00:02:101;0.2491155863;0.6417328119;-0.219108969;-0;0;-0;0;0;0;1
48;2.85546875;00:00:02:102;0.2491213977;0.641731739;-0.2191275954;-0;0;-0;0;0;0;1
49;2.8671875;00:00:02:104;0.249125585;0.6417310834;-0.2191350609;-0;0;-0;0;0;0;1
50;2.875;00:00:02:105;0.249129355;0.6417293549;-0.2191602886;-0;0;-0;0;0;0;1
51;2.8828125;00:00:02:105;0.249128744;0.6417289376;-0.2192026526;-0;0;-0;0;0;0;1
52;2.890625;00:00:02:106;0.2491201907;0.6417188644;-0.2192328423;-0;0;-0;0;0;0;1
53;2.8984375;00:00:02:107;-0.3160814047;0.07462298125;-0.1385543793;-0;0;-0;0;0;0;1
54;2.90625;00:00:02:108;0.2491131127;0.6417008042;-0.2192762047;-0;0;-0;0;0;0;1
55;2.9140625;00:00:02:109;0.2490948141;0.6416929364;-0.2193301171;-0;0;-0;0;0;0;1
56;2.921875;00:00:02:110;0.2490577102;0.641702652;-0.2194050699;-0;0;-0;0;0;0;1
57;2.93359375;00:00:02:112;0.2490195483;0.6417158842;-0.2194969654;-0;0;-0;0;0;0;1
58;2.94140625;00:00:02:112;0.2489771247;0.6417198777;-0.2195860893;-0;0;-0;0;0;0;1
59;2.94921875;00:00:02:113;0.2489450425;0.6417253017;-0.2196718305;-0;0;-0;0;0;0;1
60;2.95703125;00:00:02:114;0.2489228696;0.6417235732;-0.2197553962;-0;0;-0;0;0;0;1
61;2.96484375;00:00:02:115;0.2488991171;0.6417269111;-0.2198511362;-0;0;-0;0;0;0;1
62;2.97265625;00:00:02:116;0.2488634884;0.6417303085;-0.2199605703;-0;0;-0;0;0;0;1
63;2.98046875;00:00:02:117;0.2488120645;0.6417391896;-0.220081687;-0;0;-0;0;0;0;1
64;2.9921875;00:00:02:119;0.2487396896;0.6417646408;-0.2202152461;-0;0;-0;0;0;0;1
65;3;00:00:03:00;0.2486642152;0.6417909265;-0.2203519642;-0;0;-0;0;0;0;1
66;3.0078125;00:00:03:00;0.2485857606;0.64181602;-0.2204841226;-0;0;-0;0;0;0;1
67;3.015625;00:00:03:01;0.248498261;0.6418326497;-0.2206059992;-0;0;-0;0;0;0;1
68;3.0234375;00:00:03:02;0.24840343;0.6418557167;-0.2207298577;-0;0;-0;0;0;0;1
69;3.03125;00:00:03:03;0.2482934445;0.6418722868;-0.2208593935;-0;0;-0;0;0;0;1
70;3.0390625;00:00:03:04;0.2481960654;0.6418853998;-0.2210000157;-0;0;-0;0;0;0;1
71;3.046875;00:00:03:05;0.2480984181;0.6418863535;-0.2211455405;-0;0;-0;0;0;0;1
72;3.05859375;00:00:03:07;0.2480042428;0.6418979168;-0.2212975919;-0;0;-0;0;0;0;1
73;3.06640625;00:00:03:07;0.2479099184;0.6419238448;-0.2214434296;-0;0;-0;0;0;0;1
74;3.07421875;00:00:03:08;0.2478111684;0.6419506073;-0.2215969414;-0;0;-0;0;0;0;1
75;3.08203125;00:00:03:09;0.2477055788;0.6419854164;-0.2217244357;-0;0;-0;0;0;0;1
76;3.08984375;00:00:03:10;0.2476113737;0.6420253515;-0.2218598276;-0;0;-0;0;0;0;1
77;3.09765625;00:00:03:11;0.2475070059;0.642064631;-0.2219832242;-0;0;-0;0;0;0;1
78;3.10546875;00:00:03:12;0.2474339008;0.6420999765;-0.2221075743;-0;0;-0;0;0;0;1
79;3.1171875;00:00:03:14;0.2473623008;0.642141521;-0.2222285718;-0;0;-0;0;0;0;1
80;3.125;00:00:03:15;0.2472899854;0.6421943307;-0.2223114818;-0;0;-0;0;0;0;1
81;3.1328125;00:00:03:15;0.2472251952;0.6422436833;-0.2223990858;-0;0;-0;0;0;0;1
82;3.140625;00:00:03:16;0.2471595705;0.6422968507;-0.2224690616;-0;0;-0;0;0;0;1
83;3.1484375;00:00:03:17;0.2470919192;0.6423506737;-0.2225378603;-0;0;-0;0;0;0;1
84;3.15625;00:00:03:18;0.2470348924;0.6424098015;-0.2225887179;-0;0;-0;0;0;0;1
85;3.1640625;00:00:03:19;0.2469733208;0.6424678564;-0.2226258367;-0;0;-0;0;0;0;1
86;3.171875;00:00:03:20;0.246911481;0.6425305605;-0.2226626873;-0;0;-0;0;0;0;1
87;3.18359375;00:00:03:22;0.2468484789;0.6425840259;-0.2226987183;-0;0;-0;0;0;0;1
88;3.19140625;00:00:03:22;0.246790275;0.6426345706;-0.2227055132;-0;0;-0;0;0;0;1
89;3.19921875;00:00:03:23;0.2467422485;0.6426738501;-0.2227131724;-0;0;-0;0;0;0;1
90;3.20703125;00:00:03:24;0.2466788292;0.642716825;-0.2227151245;-0;0;-0;0;0;0;1
91;3.21484375;00:00:03:25;0.2466209084;0.6427651644;-0.2227171063;-0;0;-0;0;0;0;1
92;3.22265625;00:00:03:26;0.2465659678;0.6428121328;-0.2227157503;-0;0;-0;0;0;0;1
93;3.23046875;00:00:03:27;0.2464945018;0.6428510547;-0.2227054834;-0;0;-0;0;0;0;1
94;3.2421875;00:00:03:29;0.2464205921;0.6428799033;-0.2226846218;-0;0;-0;0;0;0;1
95;3.25;00:00:03:30;0.2463575304;0.6428955793;-0.2226536423;-0;0;-0;0;0;0;1
96;3.2578125;00:00:03:30;0.2462923229;0.6428992152;-0.2226336002;-0;0;-0;0;0;0;1
97;3.265625;00:00:03:31;0.2462352812;0.6429150105;-0.2226106524;-0;0;-0;0;0;0;1
98;3.2734375;00:00:03:32;0.2461690903;0.6429300904;-0.2225835025;-0;0;-0;0;0;0;1
99;3.28125;00:00:03:33;0.2461128384;0.642937541;-0.2225589603;-0;0;-0;0;0;0;1
100;3.2890625;00:00:03:34;0.246054098;0.6429318786;-0.2225442976;-0;0;-0;0;0;0;1
101;3.296875;00:00:03:35;0.2459979504;0.642916739;-0.2225408256;-0;0;-0;0;0;0;1
102;3.30859375;00:00:03:37;0.2459603995;0.6428954601;-0.2225341946;-0;0;-0;0;0;0;1
103;3.31640625;00:00:03:37;0.2459154874;0.6428650022;-0.2225484997;-0;0;-0;0;0;0;1
104;3.32421875;00:00:03:38;0.2458608449;0.6428447962;-0.2225680202;-0;0;-0;0;0;0;1
105;3.33203125;00:00:03:39;0.2457988262;0.6428154111;-0.2225780636;-0;0;-0;0;0;0;1
106;3.33984375;00:00:03:40;0.2457228452;0.6427667737;-0.2225981504;-0;0;-0;0;0;0;1
107;3.34765625;00:00:03:41;0.2456472218;0.6427186131;-0.2226228118;-0;0;-0;0;0;0;1
108;3.35546875;00:00:03:42;0.2455672026;0.6426607966;-0.2226384729;-0;0;-0;0;0;0;1
109;3.3671875;00:00:03:44;0.2454826981;0.6426001787;-0.222659722;-0;0;-0;0;0;0;1
110;3.375;00:00:03:45;0.2453817874;0.6425437927;-0.2226822823;-0;0;-0;0;0;0;1
111;3.3828125;00:00:03:45;0.2453024238;0.6424787045;-0.2227028906;-0;0;-0;0;0;0;1
112;3.390625;00:00:03:46;0.245210439;0.6423977613;-0.2227359414;-0;0;-0;0;0;0;1
113;3.3984375;00:00:03:47;0.2451320887;0.6423124671;-0.2227842361;-0;0;-0;0;0;0;1
114;3.40625;00:00:03:48;0.2450320423;0.6422350407;-0.2228420228;-0;0;-0;0;0;0;1
115;3.4140625;00:00:03:49;0.2449487746;0.6421692371;-0.2228946239;-0;0;-0;0;0;0;1
116;3.421875;00:00:03:50;0.2448657155;0.642085731;-0.2229401767;-0;0;-0;0;0;0;1
117;3.43359375;00:00:03:52;0.2448019385;0.6419947743;-0.2229647338;-0;0;-0;0;0;0;1
118;3.44140625;00:00:03:52;0.244746238;0.6418893337;-0.2229868174;-0;0;-0;0;0;0;1
119;3.44921875;00:00:03:53;0.2447185814;0.6417791247;-0.2230091244;-0;0;-0;0;0;0;1
120;3.45703125;00:00:03:54;0.2447101921;0.6416602135;-0.2230216265;-0;0;-0;0;0;0;1
121;3.46484375;00:00:03:55;0.2446992546;0.6415535212;-0.2230410427;-0;0;-0;0;0;0;1
122;3.47265625;00:00:03:56;0.2446844876;0.6414484978;-0.2230617702;-0;0;-0;0;0;0;1
123;3.48046875;00:00:03:57;0.2446832508;0.6413505673;-0.2230843008;-0;0;-0;0;0;0;1
124;3.4921875;00:00:03:59;0.2446858436;0.6412389874;-0.2231106311;-0;0;-0;0;0;0;1
125;3.5;00:00:03:60;0.2446935326;0.6411315203;-0.2231307924;-0;0;-0;0;0;0;1
126;3.5078125;00:00:03:60;0.2447071671;0.6410367489;-0.2231526524;-0;0;-0;0;0;0;1
127;3.515625;00:00:03:61;0.2447489798;0.6409401894;-0.2231615186;-0;0;-0;0;0;0;1
128;3.5234375;00:00:03:62;0.2447840571;0.640852809;-0.223174274;-0;0;-0;0;0;0;1
129;3.53125;00:00:03:63;0.2448271066;0.6407662034;-0.2231972367;-0;0;-0;0;0;0;1
130;3.5390625;00:00:03:64;0.2448887527;0.6406676173;-0.2232039124;-0;0;-0;0;0;0;1
131;3.546875;00:00:03:65;0.2449539155;0.6405638456;-0.223204717;-0;0;-0;0;0;0;1
132;3.55859375;00:00:03:67;0.2450202405;0.6404696703;-0.2232107222;-0;0;-0;0;0;0;1
133;3.56640625;00:00:03:67;0.2450769991;0.6403810382;-0.2232237458;-0;0;-0;0;0;0;1
134;3.57421875;00:00:03:68;0.2451228052;0.6402982473;-0.2232502252;-0;0;-0;0;0;0;1
135;3.58203125;00:00:03:69;0.2451725602;0.6402053833;-0.2232681662;-0;0;-0;0;0;0;1
136;3.58984375;00:00:03:70;0.2452276945;0.6401215196;-0.2232685387;-0;0;-0;0;0;0;1
137;3.59765625;00:00:03:71;0.2452736795;0.6400375962;-0.223273322;-0;0;-0;0;0;0;1
138;3.60546875;00:00:03:72;0.2453099489;0.6399646401;-0.2232757807;-0;0;-0;0;0;0;1
139;3.6171875;00:00:03:74;0.2453310043;0.63990134;-0.2232650071;-0;0;-0;0;0;0;1
140;3.625;00:00:03:75;0.2453518063;0.6398350596;-0.2232646793;-0;0;-0;0;0;0;1
141;3.6328125;00:00:03:75;0.2453622371;0.6397749186;-0.22326307;-0;0;-0;0;0;0;1
142;3.640625;00:00:03:76;0.2453661561;0.6397185922;-0.2232590616;-0;0;-0;0;0;0;1
143;3.6484375;00:00:03:77;0.2453531027;0.6396757364;-0.2232669592;-0;0;-0;0;0;0;1
144;3.65625;00:00:03:78;0.2453244627;0.6396449208;-0.2232877612;-0;0;-0;0;0;0;1
145;3.6640625;00:00:03:79;0.2452930063;0.6396043301;-0.2233194709;-0;0;-0;0;0;0;1
146;3.671875;00:00:03:80;0.2452688068;0.6395602226;-0.2233466804;-0;0;-0;0;0;0;1
147;3.68359375;00:00:03:82;0.245237425;0.639508009;-0.2233616412;-0;0;-0;0;0;0;1
148;3.69140625;00:00:03:82;0.2451860756;0.6394726634;-0.2233673185;-0;0;-0;0;0;0;1
149;3.69921875;00:00:03:83;0.2451200187;0.6394448876;-0.2234036475;-0;0;-0;0;0;0;1
150;3.70703125;00:00:03:84;0.2450330257;0.6394228935;-0.2234646976;-0;0;-0;0;0;0;1
151;3.71484375;00:00:03:85;0.2449187785;0.6394147277;-0.2235543877;-0;0;-0;0;0;0;1
152;3.72265625;00:00:03:86;0.2447878569;0.6394156218;-0.2236424536;-0;0;-0;0;0;0;1
153;3.73046875;00:00:03:87;0.2446333766;0.6394135356;-0.2237545252;-0;0;-0;0;0;0;1
154;3.7421875;00:00:03:89;0.2444856763;0.6394138932;-0.2239016443;-0;0;-0;0;0;0;1
155;3.75;00:00:03:90;0.2443223894;0.6394295096;-0.2240971178;-0;0;-0;0;0;0;1
156;3.7578125;00:00:03:90;0.2441582084;0.6394463778;-0.2243095934;-0;0;-0;0;0;0;1
157;3.765625;00:00:03:91;0.2439957261;0.6394907832;-0.2245491147;-0;0;-0;0;0;0;1
158;3.7734375;00:00:03:92;0.2438269854;0.639537394;-0.2248407155;-0;0;-0;0;0;0;1
159;3.78125;00:00:03:93;0.2436767817;0.6396017671;-0.2251380086;-0;0;-0;0;0;0;1
160;3.7890625;00:00:03:94;0.2435074151;0.6396771669;-0.2254424393;-0;0;-0;0;0;0;1
161;3.796875;00:00:03:95;0.2433194965;0.639762938;-0.2257983387;-0;0;-0;0;0;0;1
162;3.80859375;00:00:03:97;0.2431347519;0.6398552656;-0.226153776;-0;0;-0;0;0;0;1
163;3.81640625;00:00:03:97;0.2429945469;0.6399561763;-0.2265112698;-0;0;-0;0;0;0;1
164;3.82421875;00:00:03:98;0.2428641915;0.6400515437;-0.2268818915;-0;0;-0;0;0;0;1
165;3.83203125;00:00:03:99;0.2427413911;0.6401557922;-0.2272568792;-0;0;-0;0;0;0;1
166;3.83984375;00:00:03:100;0.2426341474;0.6402544975;-0.2276341468;-0;0;-0;0;0;0;1
167;3.84765625;00:00:03:101;0.242561236;0.6403610706;-0.2280126065;-0;0;-0;0;0;0;1
168;3.85546875;00:00:03:102;0.2425104827;0.6404701471;-0.228385374;-0;0;-0;0;0;0;1
169;3.8671875;00:00:03:104;0.2424591631;0.6405769587;-0.2287774831;-0;0;-0;0;0;0;1
170;3.875;00:00:03:105;0.2424079925;0.6406715512;-0.2291580886;-0;0;-0;0;0;0;1
171;3.8828125;00:00:03:105;0.2423518896;0.6407708526;-0.2295169234;-0;0;-0;0;0;0;1
172;3.890625;00:00:03:106;0.2422970533;0.6408717632;-0.2298609465;-0;0;-0;0;0;0;1
173;3.8984375;00:00:03:107;0.2422482669;0.6409834623;-0.2302164733;-0;0;-0;0;0;0;1
174;3.90625;00:00:03:108;0.2422061116;0.6410773993;-0.2305528075;-0;0;-0;0;0;0;1
175;3.9140625;00:00:03:109;0.2421563864;0.6411802173;-0.2308745235;-0;0;-0;0;0;0;1
176;3.921875;00:00:03:110;0.2421056032;0.641274333;-0.2311810851;-0;0;-0;0;0;0;1
177;3.93359375;00:00:03:112;0.2420524806;0.6413766146;-0.2314664721;-0;0;-0;0;0;0;1
178;3.94140625;00:00:03:112;0.2420084476;0.6414619088;-0.2317353785;-0;0;-0;0;0;0;1
179;3.94921875;00:00:03:113;0.2419485003;0.6415412426;-0.2319971621;-0;0;-0;0;0;0;1
180;3.95703125;00:00:03:114;0.2418932617;0.6416102052;-0.2322418094;-0;0;-0;0;0;0;1
181;3.96484375;00:00:03:115;0.2418439686;0.6416531205;-0.2324609756;-0;0;-0;0;0;0;1
182;3.97265625;00:00:03:116;0.2418061644;0.6416879296;-0.232670024;-0;0;-0;0;0;0;1
183;3.98046875;00:00:03:117;0.2417577505;0.6417170167;-0.2328505218;-0;0;-0;0;0;0;1
184;3.9921875;00:00:03:119;0.2417123616;0.6417313218;-0.2330004424;-0;0;-0;0;0;0;1
185;4;00:00:04:00;0.241671592;0.6417520642;-0.2331302166;-0;0;-0;0;0;0;1
186;4.0078125;00:00:04:00;0.241611436;0.6417723298;-0.2332426459;-0;0;-0;0;0;0;1
187;4.015625;00:00:04:01;0.2415481955;0.6417898536;-0.233337298;-0;0;-0;0;0;0;1
188;4.0234375;00:00:04:02;0.2414864898;0.6417905092;-0.2334247231;-0;0;-0;0;0;0;1
189;4.03125;00:00:04:03;0.2414295673;0.6417909265;-0.2334713936;-0;0;-0;0;0;0;1
190;4.0390625;00:00:04:04;0.241367057;0.6417906284;-0.2335053533;-0;0;-0;0;0;0;1
191;4.046875;00:00:04:05;0.2413052171;0.641782999;-0.2335484028;-0;0;-0;0;0;0;1
192;4.05859375;00:00:04:07;0.2412567437;0.6417773962;-0.2335587293;-0;0;-0;0;0;0;1
193;4.06640625;00:00:04:07;0.2412243336;0.6417670846;-0.2335482687;-0;0;-0;0;0;0;1
194;4.07421875;00:00:04:08;0.2411963195;0.641759932;-0.2335313112;-0;0;-0;0;0;0;1
195;4.08203125;00:00:04:09;0.2411823124;0.6417572498;-0.2335188091;-0;0;-0;0;0;0;1
196;4.08984375;00:00:04:10;0.2411863059;0.6417605281;-0.2334796935;-0;0;-0;0;0;0;1
197;4.09765625;00:00:04:11;0.241200611;0.6417576075;-0.23342444;-0;0;-0;0;0;0;1
198;4.10546875;00:00:04:12;0.2412266731;0.6417653561;-0.2333643585;-0;0;-0;0;0;0;1
199;4.1171875;00:00:04:14;0.2412782758;0.6417548656;-0.2333136201;-0;0;-0;0;0;0;1
200;4.125;00:00:04:15;0.2413553149;0.6417486072;-0.2332414985;-0;0;-0;0;0;0;1
201;4.1328125;00:00:04:15;0.2414485961;0.6417430043;-0.2331582457;-0;0;-0;0;0;0;1
202;4.140625;00:00:04:16;0.2415480018;0.6417451501;-0.2330527306;-0;0;-0;0;0;0;1
203;4.1484375;00:00:04:17;0.2416680455;0.6417397857;-0.232943207;-0;0;-0;0;0;0;1
204;4.15625;00:00:04:18;0.2417991906;0.6417284012;-0.232831955;-0;0;-0;0;0;0;1
205;4.1640625;00:00:04:19;0.2419328839;0.6417144537;-0.2327235788;-0;0;-0;0;0;0;1
206;4.171875;00:00:04:20;0.2420713603;0.6416990161;-0.2326074541;-0;0;-0;0;0;0;1
207;4.18359375;00:00:04:22;0.2422123253;0.6416808367;-0.2324713767;-0;0;-0;0;0;0;1
208;4.19140625;00:00:04:22;0.2423573881;0.6416458488;-0.2323318273;-0;0;-0;0;0;0;1
209;4.19921875;00:00:04:23;0.2424950451;0.6416146755;-0.2322061509;-0;0;-0;0;0;0;1
210;4.20703125;00:00:04:24;0.2426155508;0.6415782571;-0.2320972234;-0;0;-0;0;0;0;1
211;4.21484375;00:00:04:25;0.2427345365;0.6415470243;-0.2320019156;-0;0;-0;0;0;0;1
212;4.22265625;00:00:04:26;0.2428389192;0.6415237784;-0.2318957448;-0;0;-0;0;0;0;1
213;4.23046875;00:00:04:27;0.2429416627;0.6414941549;-0.231777966;-0;0;-0;0;0;0;1
214;4.2421875;00:00:04:29;0.2430493385;0.641458869;-0.2316503823;-0;0;-0;0;0;0;1
215;4.25;00:00:04:30;0.243142128;0.6414144039;-0.2315165699;-0;0;-0;0;0;0;1
216;4.2578125;00:00:04:30;0.2432212234;0.6413691044;-0.2313802689;-0;0;-0;0;0;0;1
217;4.265625;00:00:04:31;0.2432717532;0.6413372755;-0.2312475443;-0;0;-0;0;0;0;1
218;4.2734375;00:00:04:32;0.243317008;0.6413049698;-0.2311253697;-0;0;-0;0;0;0;1
219;4.28125;00:00:04:33;0.243365705;0.6412672997;-0.2310142815;-0;0;-0;0;0;0;1
220;4.2890625;00:00:04:34;0.2434149832;0.6412251592;-0.2309186459;-0;0;-0;0;0;0;1
221;4.296875;00:00:04:35;0.243458271;0.6411835551;-0.2308151275;-0;0;-0;0;0;0;1
222;4.30859375;00:00:04:37;0.24351044;0.6411464214;-0.2306943536;-0;0;-0;0;0;0;1
223;4.31640625;00:00:04:37;0.2435650527;0.6411045194;-0.23058182;-0;0;-0;0;0;0;1
224;4.32421875;00:00:04:38;0.2436131388;0.6410625577;-0.2304898053;-0;0;-0;0;0;0;1
225;4.33203125;00:00:04:39;0.243645817;0.6410271525;-0.2304095775;-0;0;-0;0;0;0;1
226;4.33984375;00:00:04:40;0.2436803579;0.6409910321;-0.2303216904;-0;0;-0;0;0;0;1
227;4.34765625;00:00:04:41;0.2437200993;0.6409473419;-0.2302379161;-0;0;-0;0;0;0;1
228;4.35546875;00:00:04:42;0.2437489182;0.6409109235;-0.2301598042;-0;0;-0;0;0;0;1
229;4.3671875;00:00:04:44;0.2437546253;0.6408617496;-0.2300816774;-0;0;-0;0;0;0;1
230;4.375;00:00:04:45;0.243777886;0.6408081055;-0.2300069481;-0;0;-0;0;0;0;1
231;4.3828125;00:00:04:45;0.243790105;0.6407559514;-0.2299477011;-0;0;-0;0;0;0;1
232;4.390625;00:00:04:46;0.2438128591;0.6406990886;-0.2298980653;-0;0;-0;0;0;0;1
233;4.3984375;00:00:04:47;0.2438217402;0.6406531334;-0.2298615426;-0;0;-0;0;0;0;1
234;4.40625;00:00:04:48;0.2438227385;0.6406134963;-0.2298299968;-0;0;-0;0;0;0;1
235;4.4140625;00:00:04:49;0.2438354343;0.640570879;-0.2298117876;-0;0;-0;0;0;0;1
236;4.421875;00:00:04:50;0.2438549399;0.6405215263;-0.229786709;-0;0;-0;0;0;0;1
237;4.43359375;00:00:04:52;0.2438517809;0.6404824853;-0.2297442406;-0;0;-0;0;0;0;1
238;4.44140625;00:00:04:52;0.2438451201;0.6404546499;-0.2296846956;-0;0;-0;0;0;0;1
239;4.44921875;00:00:04:53;0.243830815;0.6404227018;-0.229598403;-0;0;-0;0;0;0;1
240;4.45703125;00:00:04:54;0.2438292652;0.6403956413;-0.2295076251;-0;0;-0;0;0;0;1
241;4.46484375;00:00:04:55;0.2438228726;0.6403890252;-0.2293637544;-0;0;-0;0;0;0;1
242;4.47265625;00:00:04:56;0.2438114583;0.6403805017;-0.2291790992;-0;0;-0;0;0;0;1
243;4.48046875;00:00:04:57;0.243785888;0.6404093504;-0.2289343923;-0;0;-0;0;0;0;1
244;4.4921875;00:00:04:59;0.243771553;0.6404554844;-0.228624016;-0;0;-0;0;0;0;1
245;4.5;00:00:04:60;0.2437554449;0.6405391693;-0.2282063514;-0;0;-0;0;0;0;1
246;4.5078125;00:00:04:60;0.2437362969;0.6406305432;-0.2276722044;-0;0;-0;0;0;0;1
247;4.515625;00:00:04:61;0.2437315583;0.6407572031;-0.2270128578;-0;0;-0;0;0;0;1
248;4.5234375;00:00:04:62;0.2437147796;0.6409432888;-0.2262190729;-0;0;-0;0;0;0;1
249;4.53125;00:00:04:63;0.2436825037;0.6411736608;-0.2252296656;-0;0;-0;0;0;0;1
250;4.5390625;00:00:04:64;0.2436362505;0.6413968205;-0.2239986807;-0;0;-0;0;0;0;1
251;4.546875;00:00:04:65;0.2435799092;0.6416322589;-0.2225393951;-0;0;-0;0;0;0;1
252;4.55859375;00:00:04:67;0.2435280085;0.641936779;-0.2207922488;-0;0;-0;0;0;0;1
253;4.56640625;00:00:04:67;0.2434729487;0.6422967911;-0.2185617834;-0;0;-0;0;0;0;1
254;4.57421875;00:00:04:68;0.2434573025;0.6426259279;-0.2162614465;-0;0;-0;0;0;0;1
255;4.58203125;00:00:04:69;0.2433470041;0.6430444121;-0.213698402;-0;0;-0;0;0;0;1
256;4.58984375;00:00:04:70;0.2433325797;0.6435069442;-0.2107057273;-0;0;-0;0;0;0;1
257;4.59765625;00:00:04:71;0.2433125675;0.6440138817;-0.2073070407;-0;0;-0;0;0;0;1
258;4.60546875;00:00:04:72;0.2434227467;0.6446269155;-0.2034557462;-0;0;-0;0;0;0;1
259;4.6171875;00:00:04:74;0.2434128523;0.645242691;-0.199178651;-0;0;-0;0;0;0;1
260;4.625;00:00:04:75;0.2437322736;0.6459562182;-0.1943610162;-0;0;-0;0;0;0;1
261;4.6328125;00:00:04:75;0.2440356165;0.6467443109;-0.1890210658;-0;0;-0;0;0;0;1
262;4.640625;00:00:04:76;0.24408409;0.6477525234;-0.1831972599;-0;0;-0;0;0;0;1
263;4.6484375;00:00:04:77;0.2442849576;0.6488285065;-0.1767812371;-0;0;-0;0;0;0;1
264;4.65625;00:00:04:78;0.2448935211;0.649935782;-0.169564262;-0;0;-0;0;0;0;1
265;4.6640625;00:00:04:79;0.2455609888;0.6511732936;-0.1616314799;-0;0;-0;0;0;0;1
266;4.671875;00:00:04:80;0.2465797812;0.6524691582;-0.1529945582;-0;0;-0;0;0;0;1
267;4.68359375;00:00:04:82;0.2473650724;0.6540352702;-0.143739447;-0;0;-0;0;0;0;1
268;4.69140625;00:00:04:82;0.2486274242;0.6556956768;-0.1336849481;-0;0;-0;0;0;0;1
269;4.69921875;00:00:04:83;0.2498712391;0.6576547623;-0.1229052618;-0;0;-0;0;0;0;1
270;4.70703125;00:00:04:84;0.2513307631;0.6598646641;-0.1114076823;-0;0;-0;0;0;0;1
271;4.71484375;00:00:04:85;0.2530004084;0.6623443365;-0.0991358459;-0;0;-0;0;0;0;1
272;4.72265625;00:00:04:86;0.2549395263;0.6651298404;-0.08609823883;-0;0;-0;0;0;0;1
273;4.73046875;00:00:04:87;0.2571621239;0.6682658792;-0.07215773314;-0;0;-0;0;0;0;1
274;4.7421875;00:00:04:89;0.2598072588;0.6716031432;-0.0575218685;-0;0;-0;0;0;0;1
275;4.75;00:00:04:90;0.2629074454;0.675424993;-0.0418987684;-0;0;-0;0;0;0;1
276;4.7578125;00:00:04:90;0.2665098608;0.6796474457;-0.0254090596;-0;0;-0;0;0;0;1
277;4.765625;00:00:04:91;0.2704342902;0.6843243837;-0.008238086477;-0;0;-0;0;0;0;1
278;4.7734375;00:00:04:92;0.2749722004;0.6894503832;0.009707133286;-0;0;-0;0;0;0;1
279;4.78125;00:00:04:93;0.2801221311;0.6951902509;0.02855909988;-0;0;-0;0;0;0;1
280;4.7890625;00:00:04:94;0.2859450877;0.7015148997;0.0481191501;-0;0;-0;0;0;0;1
281;4.796875;00:00:04:95;0.2927086353;0.7083334327;0.06838651747;-0;0;-0;0;0;0;1
282;4.80859375;00:00:04:97;0.3000773191;0.7159923911;0.08928760141;-0;0;-0;0;0;0;1
283;4.81640625;00:00:04:97;0.3084211648;0.7242946625;0.1108349934;-0;0;-0;0;0;0;1
284;4.82421875;00:00:04:98;0.317679882;0.7333394885;0.1328803003;-0;0;-0;0;0;0;1
285;4.83203125;00:00:04:99;0.3279742599;0.7432028651;0.1552957147;-0;0;-0;0;0;0;1
286;4.83984375;00:00:04:100;0.3394584358;0.7538260818;0.1780284792;-0;0;-0;0;0;0;1
287;4.84765625;00:00:04:101;0.3518855274;0.7655088902;0.201038301;-0;0;-0;0;0;0;1
288;4.85546875;00:00:04:102;0.365386039;0.7782512307;0.2242229134;-0;0;-0;0;0;0;1
289;4.8671875;00:00:04:104;0.3803033233;0.7917588353;0.2472345382;-0;0;-0;0;0;0;1
290;4.875;00:00:04:105;0.3963270485;0.8064914942;0.270262748;-0;0;-0;0;0;0;1
291;4.8828125;00:00:04:105;0.4136300385;0.8222982287;0.2929679155;-0;0;-0;0;0;0;1
292;4.890625;00:00:04:106;0.4321410358;0.8392522335;0.315361172;-0;0;-0;0;0;0;1
293;4.8984375;00:00:04:107;0.4519941807;0.8574915528;0.3371866047;-0;0;-0;0;0;0;1
294;4.90625;00:00:04:108;0.4730208516;0.8769460917;0.3582548797;-0;0;-0;0;0;0;1
295;4.9140625;00:00:04:109;0.4953593612;0.8977195621;0.3785748482;-0;0;-0;0;0;0;1
296;4.921875;00:00:04:110;0.5185986161;0.9197608829;0.3978810608;-0;0;-0;0;0;0;1
297;4.93359375;00:00:04:112;0.5431658626;0.9429412484;0.4158706665;-0;0;-0;0;0;0;1
298;4.94140625;00:00:04:112;0.5688142776;0.9671628475;0.432477504;-0;0;-0;0;0;0;1
299;4.94921875;00:00:04:113;0.59550035;0.9924064279;0.4474375546;-0;0;-0;0;0;0;1
300;4.95703125;00:00:04:114;0.6229209304;1.018864155;0.4608190656;-0;0;-0;0;0;0;1
301;4.96484375;00:00:04:115;0.6512085199;1.046251655;0.472278893;-0;0;-0;0;0;0;1
302;4.97265625;00:00:04:116;0.6800521612;1.074525714;0.4817199707;-0;0;-0;0;0;0;1
303;4.98046875;00:00:04:117;0.7094541788;1.10364151;0.4889633358;-0;0;-0;0;0;0;1
304;4.9921875;00:00:04:119;0.7390962243;1.133405805;0.4940218925;-0;0;-0;0;0;0;1
305;5;00:00:05:00;0.7688778639;1.163832307;0.4966819882;-0;0;-0;0;0;0;1
306;5.0078125;00:00:05:00;0.7986508608;1.194615364;0.4970183969;-0;0;-0;0;0;0;1
307;5.015625;00:00:05:01;0.8283703327;1.225530505;0.4947455823;-0;0;-0;0;0;0;1
308;5.0234375;00:00:05:02;0.8577532768;1.256910086;0.4900048673;-0;0;-0;0;0;0;1
309;5.03125;00:00:05:03;0.8865705729;1.28818059;0.4826641977;-0;0;-0;0;0;0;1
310;5.0390625;00:00:05:04;0.9147773385;1.319210291;0.4728944898;-0;0;-0;0;0;0;1
311;5.046875;00:00:05:05;0.9422028065;1.350211978;0.4605797231;-0;0;-0;0;0;0;1
312;5.05859375;00:00:05:07;0.9686002135;1.380878925;0.44574067;-0;0;-0;0;0;0;1
313;5.06640625;00:00:05:07;0.9938353896;1.411224484;0.4285526872;-0;0;-0;0;0;0;1
314;5.07421875;00:00:05:08;1.01780057;1.440998435;0.409026891;-0;0;-0;0;0;0;1
315;5.08203125;00:00:05:09;1.040236831;1.469991684;0.3872868121;-0;0;-0;0;0;0;1
316;5.08984375;00:00:05:10;1.061249137;1.498140335;0.3635645211;-0;0;-0;0;0;0;1
317;5.09765625;00:00:05:11;1.080666661;1.525298834;0.3379391134;-0;0;-0;0;0;0;1
318;5.10546875;00:00:05:12;1.09811461;1.551339984;0.3106439114;-0;0;-0;0;0;0;1
319;5.1171875;00:00:05:14;1.113913059;1.576088548;0.281770736;-0;0;-0;0;0;0;1
320;5.125;00:00:05:15;1.128036261;1.599566698;0.2514294088;-0;0;-0;0;0;0;1
321;5.1328125;00:00:05:15;1.140238881;1.621281624;0.220338732;-0;0;-0;0;0;0;1
322;5.140625;00:00:05:16;1.150425434;1.641614199;0.1878600717;-0;0;-0;0;0;0;1
323;5.1484375;00:00:05:17;1.158632398;1.66032052;0.1549060792;-0;0;-0;0;0;0;1
324;5.15625;00:00:05:18;1.165013909;1.677467227;0.121395953;-0;0;-0;0;0;0;1
325;5.1640625;00:00:05:19;1.169564605;1.692909122;0.08776168525;-0;0;-0;0;0;0;1
326;5.171875;00:00:05:20;1.172266603;1.70674932;0.05398887768;-0;0;-0;0;0;0;1
327;5.18359375;00:00:05:22;1.173112392;1.718887925;0.02029496245;-0;0;-0;0;0;0;1
328;5.19140625;00:00:05:22;1.172058702;1.72949636;-0.01330668014;-0;0;-0;0;0;0;1
329;5.19921875;00:00:05:23;1.169520378;1.738461375;-0.04628067464;-0;0;-0;0;0;0;1
330;5.20703125;00:00:05:24;1.165310264;1.745883346;-0.07873716205;-0;0;-0;0;0;0;1
331;5.21484375;00:00:05:25;1.159514904;1.751773477;-0.1103650704;-0;0;-0;0;0;0;1
332;5.22265625;00:00:05:26;1.152268529;1.756337166;-0.1411348134;-0;0;-0;0;0;0;1
333;5.23046875;00:00:05:27;1.143245935;1.759499192;-0.1711573303;-0;0;-0;0;0;0;1
334;5.2421875;00:00:05:29;1.133174658;1.761298418;-0.2000737637;-0;0;-0;0;0;0;1
335;5.25;00:00:05:30;1.121856689;1.761780858;-0.2278890461;-0;0;-0;0;0;0;1
336;5.2578125;00:00:05:30;1.109426975;1.761027813;-0.2544457614;-0;0;-0;0;0;0;1
337;5.265625;00:00:05:31;1.095910311;1.759147525;-0.2797721028;-0;0;-0;0;0;0;1
338;5.2734375;00:00:05:32;1.081391335;1.756172538;-0.3037590981;-0;0;-0;0;0;0;1
339;5.28125;00:00:05:33;1.066084027;1.752125859;-0.326281637;-0;0;-0;0;0;0;1
340;5.2890625;00:00:05:34;1.049784541;1.747194409;-0.3473829329;-0;0;-0;0;0;0;1
341;5.296875;00:00:05:35;1.032810211;1.741329432;-0.3670211732;-0;0;-0;0;0;0;1
342;5.30859375;00:00:05:37;1.015280962;1.734683037;-0.3851124048;-0;0;-0;0;0;0;1
343;5.31640625;00:00:05:37;0.9972007871;1.727377772;-0.4016479254;-0;0;-0;0;0;0;1
344;5.32421875;00:00:05:38;0.9788659811;1.719468713;-0.4165156484;-0;0;-0;0;0;0;1
345;5.33203125;00:00:05:39;0.9601491094;1.710932732;-0.4298568666;-0;0;-0;0;0;0;1
346;5.33984375;00:00:05:40;0.9411863089;1.701890945;-0.4413742423;-0;0;-0;0;0;0;1
347;5.34765625;00:00:05:41;0.9221016765;1.6925596;-0.451271981;-0;0;-0;0;0;0;1
348;5.35546875;00:00:05:42;0.9033372402;1.683026195;-0.4595551193;-0;0;-0;0;0;0;1
349;5.3671875;00:00:05:44;0.8845111728;1.672784567;-0.4663301408;-0;0;-0;0;0;0;1
350;5.375;00:00:05:45;0.8658208847;1.662619233;-0.4715501964;-0;0;-0;0;0;0;1
351;5.3828125;00:00:05:45;0.8477544188;1.652405381;-0.4751826227;-0;0;-0;0;0;0;1
352;5.390625;00:00:05:46;0.8298307657;1.642333627;-0.4773488343;-0;0;-0;0;0;0;1
353;5.3984375;00:00:05:47;0.8126139641;1.632532239;-0.478131026;-0;0;-0;0;0;0;1
354;5.40625;00:00:05:48;0.7963677645;1.622858882;-0.4776461422;-0;0;-0;0;0;0;1
355;5.4140625;00:00:05:49;0.781088531;1.61332202;-0.4760451615;-0;0;-0;0;0;0;1
356;5.421875;00:00:05:50;0.7662217021;1.604289532;-0.4731759131;-0;0;-0;0;0;0;1
357;5.43359375;00:00:05:52;0.7524393797;1.595810175;-0.4695486724;-0;0;-0;0;0;0;1
358;5.44140625;00:00:05:52;0.7393319011;1.587750912;-0.4647804797;-0;0;-0;0;0;0;1
359;5.44921875;00:00:05:53;0.7269316912;1.580019355;-0.4592711926;-0;0;-0;0;0;0;1
360;5.45703125;00:00:05:54;0.7160493731;1.573212981;-0.4536203146;-0;0;-0;0;0;0;1
361;5.46484375;00:00:05:55;0.7054651976;1.566817999;-0.446962148;-0;0;-0;0;0;0;1
362;5.47265625;00:00:05:56;0.6959973574;1.560778975;-0.4398494065;-0;0;-0;0;0;0;1
363;5.48046875;00:00:05:57;0.6874750853;1.555529833;-0.4327126741;-0;0;-0;0;0;0;1
364;5.4921875;00:00:05:59;0.6796309948;1.550839424;-0.4251263738;-0;0;-0;0;0;0;1
365;5.5;00:00:05:60;0.6729524136;1.546892881;-0.4176109433;-0;0;-0;0;0;0;1
366;5.5078125;00:00:05:60;0.6671500802;1.543462753;-0.4100451171;-0;0;-0;0;0;0;1
367;5.515625;00:00:05:61;0.6616869569;1.540608406;-0.4024107456;-0;0;-0;0;0;0;1
368;5.5234375;00:00:05:62;0.6570332646;1.538194776;-0.3946842551;-0;0;-0;0;0;0;1
369;5.53125;00:00:05:63;0.6531416774;1.536168575;-0.3870601952;-0;0;-0;0;0;0;1
370;5.5390625;00:00:05:64;0.6497280002;1.53470552;-0.3799834251;-0;0;-0;0;0;0;1
371;5.546875;00:00:05:65;0.6470653415;1.53360796;-0.3731788695;-0;0;-0;0;0;0;1
372;5.55859375;00:00:05:67;0.6449803114;1.53288269;-0.3668333888;-0;0;-0;0;0;0;1
373;5.56640625;00:00:05:67;0.6431539059;1.532483578;-0.3609535098;-0;0;-0;0;0;0;1
374;5.57421875;00:00:05:68;0.6418787241;1.532555938;-0.3560979962;-0;0;-0;0;0;0;1
375;5.58203125;00:00:05:69;0.6407458186;1.532454848;-0.350777477;-0;0;-0;0;0;0;1
376;5.58984375;00:00:05:70;0.6396977901;1.532645583;-0.3461582959;-0;0;-0;0;0;0;1
377;5.59765625;00:00:05:71;0.6393982172;1.532919765;-0.3419338167;-0;0;-0;0;0;0;1
378;5.60546875;00:00:05:72;0.6391960382;1.533319592;-0.3385754526;-0;0;-0;0;0;0;1
379;5.6171875;00:00:05:74;0.6389689445;1.53374207;-0.3353805542;-0;0;-0;0;0;0;1
380;5.625;00:00:05:75;0.6389049292;1.534149528;-0.3325392306;-0;0;-0;0;0;0;1
381;5.6328125;00:00:05:75;0.6391178966;1.534609556;-0.3303626478;-0;0;-0;0;0;0;1
382;5.640625;00:00:05:76;0.6395571232;1.535181522;-0.3288419545;-0;0;-0;0;0;0;1
383;5.6484375;00:00:05:77;0.6401606202;1.535873055;-0.3277772665;-0;0;-0;0;0;0;1
384;5.65625;00:00:05:78;0.6410027146;1.53663671;-0.3273429275;-0;0;-0;0;0;0;1
385;5.6640625;00:00:05:79;0.6422249079;1.537468314;-0.3273609579;-0;0;-0;0;0;0;1
386;5.671875;00:00:05:80;0.6436997056;1.538412333;-0.3278908432;-0;0;-0;0;0;0;1
387;5.68359375;00:00:05:82;0.6454495192;1.539450884;-0.3287810683;-0;0;-0;0;0;0;1
388;5.69140625;00:00:05:82;0.6476011276;1.540631056;-0.3301858604;-0;0;-0;0;0;0;1
389;5.69921875;00:00:05:83;0.6499180198;1.541775703;-0.3313622475;-0;0;-0;0;0;0;1
390;5.70703125;00:00:05:84;0.6526036263;1.543079734;-0.3330954015;-0;0;-0;0;0;0;1
391;5.71484375;00:00:05:85;0.6556714773;1.544441819;-0.3349884152;-0;0;-0;0;0;0;1
392;5.72265625;00:00:05:86;0.6589387059;1.546105146;-0.3368818462;-0;0;-0;0;0;0;1
393;5.73046875;00:00:05:87;0.662869215;1.54782629;-0.3392991424;-0;0;-0;0;0;0;1
394;5.7421875;00:00:05:89;0.6670408845;1.549883246;-0.341468066;-0;0;-0;0;0;0;1
395;5.75;00:00:05:90;0.6722883582;1.552027822;-0.3440141976;-0;0;-0;0;0;0;1
396;5.7578125;00:00:05:90;0.6773130894;1.554568887;-0.3462693095;-0;0;-0;0;0;0;1
397;5.765625;00:00:05:91;0.6832108498;1.55736959;-0.3486085832;-0;0;-0;0;0;0;1
398;5.7734375;00:00:05:92;0.6900556684;1.560314178;-0.3506512642;-0;0;-0;0;0;0;1
399;5.78125;00:00:05:93;0.6974847317;1.563307643;-0.3527002037;-0;0;-0;0;0;0;1
400;5.7890625;00:00:05:94;0.7055550218;1.566530466;-0.3540008664;-0;0;-0;0;0;0;1
401;5.796875;00:00:05:95;0.714064002;1.569813728;-0.3551537097;-0;0;-0;0;0;0;1
402;5.80859375;00:00:05:97;0.723454535;1.573215842;-0.3553566039;-0;0;-0;0;0;0;1
403;5.81640625;00:00:05:97;0.7326725125;1.576538801;-0.3548127413;-0;0;-0;0;0;0;1
404;5.82421875;00:00:05:98;0.7433977127;1.580189705;-0.3540272415;-0;0;-0;0;0;0;1
405;5.83203125;00:00:05:99;0.7540864944;1.583820224;-0.3523530662;-0;0;-0;0;0;0;1
406;5.83984375;00:00:05:100;0.7657096386;1.587631822;-0.3497010171;-0;0;-0;0;0;0;1
407;5.84765625;00:00:05:101;0.777739048;1.591336608;-0.3457282782;-0;0;-0;0;0;0;1
408;5.85546875;00:00:05:102;0.7900258303;1.594970822;-0.3404718041;-0;0;-0;0;0;0;1
409;5.8671875;00:00:05:104;0.8031314611;1.598567009;-0.3340153098;-0;0;-0;0;0;0;1
410;5.875;00:00:05:105;0.8163318038;1.602156401;-0.3261459768;-0;0;-0;0;0;0;1
411;5.8828125;00:00:05:105;0.8298999071;1.605302572;-0.3164077699;-0;0;-0;0;0;0;1
412;5.890625;00:00:05:106;0.8436306715;1.608129621;-0.3050191998;-0;0;-0;0;0;0;1
413;5.8984375;00:00:05:107;0.8573627472;1.610679269;-0.2920314372;-0;0;-0;0;0;0;1
414;5.90625;00:00:05:108;0.8710276484;1.612537384;-0.2767764628;-0;0;-0;0;0;0;1
415;5.9140625;00:00:05:109;0.8845253587;1.613696098;-0.2596843839;-0;0;-0;0;0;0;1
416;5.921875;00:00:05:110;0.8975629807;1.61382544;-0.2405112386;-0;0;-0;0;0;0;1
417;5.93359375;00:00:05:112;0.9097977281;1.612825871;-0.219193697;-0;0;-0;0;0;0;1
418;5.94140625;00:00:05:112;0.921564579;1.610292912;-0.1956187636;-0;0;-0;0;0;0;1
419;5.94921875;00:00:05:113;0.9319478869;1.605936408;-0.1699534804;-0;0;-0;0;0;0;1
420;5.95703125;00:00:05:114;0.9409509897;1.599498391;-0.1419966221;-0;0;-0;0;0;0;1
421;5.96484375;00:00:05:115;0.9482512474;1.590582252;-0.1119735166;-0;0;-0;0;0;0;1
422;5.97265625;00:00:05:116;0.9534546137;1.578920841;-0.08001869917;-0;0;-0;0;0;0;1
423;5.98046875;00:00:05:117;0.9566630721;1.56394124;-0.04585052282;-0;0;-0;0;0;0;1
424;5.9921875;00:00:05:119;0.9568462372;1.545121551;-0.0101671014;-0;0;-0;0;0;0;1
425;6;00:00:06:00;0.953733027;1.521940827;0.02677805535;-0;0;-0;0;0;0;1
426;6.0078125;00:00:06:00;0.9468992352;1.493714571;0.06467935443;-0;0;-0;0;0;0;1
427;6.015625;00:00:06:01;0.9353397489;1.460260749;0.1025203541;-0;0;-0;0;0;0;1
428;6.0234375;00:00:06:02;0.9184142947;1.421188235;0.1392792761;-0;0;-0;0;0;0;1
429;6.03125;00:00:06:03;0.895914793;1.376446724;0.1737966686;-0;0;-0;0;0;0;1
430;6.0390625;00:00:06:04;0.867333293;1.325890779;0.2051697224;-0;0;-0;0;0;0;1
431;6.046875;00:00:06:05;0.8320875168;1.270333767;0.2313987166;-0;0;-0;0;0;0;1
432;6.05859375;00:00:06:07;0.7906343937;1.210181355;0.2503336072;-0;0;-0;0;0;0;1
433;6.06640625;00:00:06:07;0.7436249852;1.146648765;0.2606619895;-0;0;-0;0;0;0;1
434;6.07421875;00:00:06:08;0.6917037368;1.081554055;0.260497123;-0;0;-0;0;0;0;1
435;6.08203125;00:00:06:09;0.6359254122;1.016507983;0.2488516271;-0;0;-0;0;0;0;1
436;6.08984375;00:00:06:10;0.5779872537;0.9526218772;0.2246435285;-0;0;-0;0;0;0;1
437;6.09765625;00:00:06:11;0.5188983679;0.8912008405;0.1874994636;-0;0;-0;0;0;0;1
438;6.10546875;00:00:06:12;0.459779948;0.8340949416;0.1364298314;-0;0;-0;0;0;0;1
439;6.1171875;00:00:06:14;0.404199928;0.7833298445;0.07174723595;-0;0;-0;0;0;0;1
440;6.125;00:00:06:15;0.3537333012;0.7420257926;-0.005229356699;-0;0;-0;0;0;0;1
441;6.1328125;00:00:06:15;0.3099085093;0.712577939;-0.09325091541;-0;0;-0;0;0;0;1
442;6.140625;00:00:06:16;0.2749518454;0.6967083812;-0.1887864321;-0;0;-0;0;0;0;1
443;6.1484375;00:00:06:17;0.2499408722;0.6955549717;-0.288551718;-0;0;-0;0;0;0;1
444;6.15625;00:00:06:18;0.2357876748;0.7093464136;-0.3905990124;-0;0;-0;0;0;0;1
445;6.1640625;00:00:06:19;0.2327903062;0.7389230132;-0.4924424887;-0;0;-0;0;0;0;1
446;6.171875;00:00:06:20;0.2405181229;0.7841773033;-0.5899759531;-0;0;-0;0;0;0;1
447;6.18359375;00:00:06:22;0.2598275542;0.8417857885;-0.6802884936;-0;0;-0;0;0;0;1
448;6.19140625;00:00:06:22;0.2889329195;0.9086340666;-0.7605491281;-0;0;-0;0;0;0;1
449;6.19921875;00:00:06:23;0.3262735009;0.9827427268;-0.8295108676;-0;0;-0;0;0;0;1
450;6.20703125;00:00:06:24;0.3694985509;1.062977552;-0.8862617612;-0;0;-0;0;0;0;1
451;6.21484375;00:00:06:25;0.4180532992;1.145746589;-0.9290771484;-0;0;-0;0;0;0;1
452;6.22265625;00:00:06:26;0.4698709846;1.228906989;-0.9581695199;-0;0;-0;0;0;0;1
453;6.23046875;00:00:06:27;0.5235798359;1.310353756;-0.9734272361;-0;0;-0;0;0;0;1
454;6.2421875;00:00:06:29;0.5778898001;1.388829112;-0.9761467576;-0;0;-0;0;0;0;1
455;6.25;00:00:06:30;0.6320325136;1.46336031;-0.9671939611;-0;0;-0;0;0;0;1
456;6.2578125;00:00:06:30;0.6843203306;1.533372164;-0.9478234649;-0;0;-0;0;0;0;1
457;6.265625;00:00:06:31;0.733625114;1.598316669;-0.9188959002;-0;0;-0;0;0;0;1
458;6.2734375;00:00:06:32;0.7793428898;1.657007933;-0.881801784;-0;0;-0;0;0;0;1
459;6.28125;00:00:06:33;0.8213437796;1.708690763;-0.8374018669;-0;0;-0;0;0;0;1
460;6.2890625;00:00:06:34;0.8591461778;1.752850413;-0.7875209451;-0;0;-0;0;0;0;1
461;6.296875;00:00:06:35;0.8918524384;1.789785743;-0.7336145043;-0;0;-0;0;0;0;1
462;6.30859375;00:00:06:37;0.9191695452;1.819693804;-0.6770793796;-0;0;-0;0;0;0;1
463;6.31640625;00:00:06:37;0.9409134388;1.843090296;-0.61940974;-0;0;-0;0;0;0;1
464;6.32421875;00:00:06:38;0.9572405815;1.860401392;-0.5617406964;-0;0;-0;0;0;0;1
465;6.33203125;00:00:06:39;0.9682747722;1.87195003;-0.5051635504;-0;0;-0;0;0;0;1
466;6.33984375;00:00:06:40;0.9742409587;1.878156662;-0.4490896463;-0;0;-0;0;0;0;1
467;6.34765625;00:00:06:41;0.9750870466;1.879642963;-0.3949917853;-0;0;-0;0;0;0;1
468;6.35546875;00:00:06:42;0.9709379673;1.87709558;-0.3436202407;-0;0;-0;0;0;0;1
469;6.3671875;00:00:06:44;0.9625872374;1.870527744;-0.2952644229;-0;0;-0;0;0;0;1
470;6.375;00:00:06:45;0.9506700039;1.86070919;-0.2506777346;-0;0;-0;0;0;0;1
471;6.3828125;00:00:06:45;0.9350817204;1.847694516;-0.209678337;-0;0;-0;0;0;0;1
472;6.390625;00:00:06:46;0.9167352915;1.832255721;-0.1729620546;-0;0;-0;0;0;0;1
473;6.3984375;00:00:06:47;0.8959667683;1.814907193;-0.1403176039;-0;0;-0;0;0;0;1
474;6.40625;00:00:06:48;0.873564899;1.795824051;-0.1114706546;-0;0;-0;0;0;0;1
475;6.4140625;00:00:06:49;0.8503237963;1.775683641;-0.08695036173;-0;0;-0;0;0;0;1
476;6.421875;00:00:06:50;0.8265003562;1.754648447;-0.06614349037;-0;0;-0;0;0;0;1
477;6.43359375;00:00:06:52;0.8025615811;1.733296752;-0.0490771085;-0;0;-0;0;0;0;1
478;6.44140625;00:00:06:52;0.7787334323;1.711852908;-0.03567336127;-0;0;-0;0;0;0;1
479;6.44921875;00:00:06:53;0.7553904057;1.690759659;-0.02567821555;-0;0;-0;0;0;0;1
480;6.45703125;00:00:06:54;0.7328595519;1.670277119;-0.01906402968;-0;0;-0;0;0;0;1
481;6.46484375;00:00:06:55;0.710639894;1.651072979;-0.01562168729;-0;0;-0;0;0;0;1
482;6.47265625;00:00:06:56;0.689561367;1.633352757;-0.0148423491;-0;0;-0;0;0;0;1
483;6.48046875;00:00:06:57;0.6696164608;1.617254972;-0.0162674766;-0;0;-0;0;0;0;1
484;6.4921875;00:00:06:59;0.650467515;1.602182269;-0.02015680075;-0;0;-0;0;0;0;1
485;6.5;00:00:06:60;0.6319184899;1.588269114;-0.02617815137;-0;0;-0;0;0;0;1
486;6.5078125;00:00:06:60;0.6142840385;1.575595975;-0.03399094939;-0;0;-0;0;0;0;1
487;6.515625;00:00:06:61;0.597746253;1.564341068;-0.04320629314;-0;0;-0;0;0;0;1
488;6.5234375;00:00:06:62;0.5820516348;1.554754972;-0.05292794108;-0;0;-0;0;0;0;1
489;6.53125;00:00:06:63;0.5672369003;1.54644382;-0.06391339749;-0;0;-0;0;0;0;1
490;6.5390625;00:00:06:64;0.5531412959;1.538980484;-0.07573973387;-0;0;-0;0;0;0;1
491;6.546875;00:00:06:65;0.5400487185;1.532815099;-0.08848766983;-0;0;-0;0;0;0;1
492;6.55859375;00:00:06:67;0.5278129578;1.527635336;-0.1009615436;-0;0;-0;0;0;0;1
493;6.56640625;00:00:06:67;0.5167123079;1.523524165;-0.113696456;-0;0;-0;0;0;0;1
494;6.57421875;00:00:06:68;0.5061272979;1.520571828;-0.1264949888;-0;0;-0;0;0;0;1
495;6.58203125;00:00:06:69;0.4971428514;1.518180847;-0.1388842613;-0;0;-0;0;0;0;1
496;6.58984375;00:00:06:70;0.4885540307;1.516893148;-0.1509874463;-0;0;-0;0;0;0;1
497;6.59765625;00:00:06:71;0.4812209904;1.5166713;-0.1619615108;-0;0;-0;0;0;0;1
498;6.60546875;00:00:06:72;0.4746211469;1.517051339;-0.1725112945;-0;0;-0;0;0;0;1
499;6.6171875;00:00:06:74;0.4687262177;1.518149614;-0.1824638397;-0;0;-0;0;0;0;1
500;6.625;00:00:06:75;0.4633906484;1.519759178;-0.191904217;-0;0;-0;0;0;0;1
501;6.6328125;00:00:06:75;0.4587790668;1.521807432;-0.2005876452;-0;0;-0;0;0;0;1
502;6.640625;00:00:06:76;0.4545091987;1.523995757;-0.209110871;-0;0;-0;0;0;0;1
503;6.6484375;00:00:06:77;0.4507400393;1.526453376;-0.2161276042;-0;0;-0;0;0;0;1
504;6.65625;00:00:06:78;0.4474612772;1.52877152;-0.2228682935;-0;0;-0;0;0;0;1
505;6.6640625;00:00:06:79;0.4445100427;1.531079769;-0.2289819121;-0;0;-0;0;0;0;1
506;6.671875;00:00:06:80;0.4418459833;1.533382654;-0.2342126369;-0;0;-0;0;0;0;1
507;6.68359375;00:00:06:82;0.4393815398;1.535669923;-0.2383630574;-0;0;-0;0;0;0;1
508;6.69140625;00:00:06:82;0.4369957745;1.538125992;-0.2416593879;-0;0;-0;0;0;0;1
509;6.69921875;00:00:06:83;0.434802264;1.540547848;-0.2444265783;-0;0;-0;0;0;0;1
510;6.70703125;00:00:06:84;0.4328330755;1.543030024;-0.2464025319;-0;0;-0;0;0;0;1
511;6.71484375;00:00:06:85;0.4309755862;1.545353055;-0.2477155626;-0;0;-0;0;0;0;1
512;6.72265625;00:00:06:86;0.4293338954;1.547237158;-0.2483619153;-0;0;-0;0;0;0;1
513;6.73046875;00:00:06:87;0.4276950955;1.548845768;-0.2485640347;-0;0;-0;0;0;0;1
514;6.7421875;00:00:06:89;0.4258590937;1.550450206;-0.2491570711;-0;0;-0;0;0;0;1
515;6.75;00:00:06:90;0.4243310094;1.551734447;-0.2488632202;-0;0;-0;0;0;0;1
516;6.7578125;00:00:06:90;0.4228710532;1.552886486;-0.2481811196;-0;0;-0;0;0;0;1
517;6.765625;00:00:06:91;0.42151317;1.55399096;-0.2471274137;-0;0;-0;0;0;0;1
518;6.7734375;00:00:06:92;0.4203530252;1.555009961;-0.2456572652;-0;0;-0;0;0;0;1
519;6.78125;00:00:06:93;0.41933164;1.55603385;-0.2438273579;-0;0;-0;0;0;0;1
520;6.7890625;00:00:06:94;0.4186118841;1.556967616;-0.2418034375;-0;0;-0;0;0;0;1
521;6.796875;00:00:06:95;0.4180268049;1.557813287;-0.2396711707;-0;0;-0;0;0;0;1
522;6.80859375;00:00:06:97;0.417719692;1.558704972;-0.2372062206;-0;0;-0;0;0;0;1
523;6.81640625;00:00:06:97;0.4176507294;1.559568286;-0.2346393913;-0;0;-0;0;0;0;1
524;6.82421875;00:00:06:98;0.41773206;1.560424566;-0.2319890857;-0;0;-0;0;0;0;1
525;6.83203125;00:00:06:99;0.4179889858;1.561264515;-0.2291502953;-0;0;-0;0;0;0;1
526;6.83984375;00:00:06:100;0.4185208082;1.56210053;-0.2263977677;-0;0;-0;0;0;0;1
527;6.84765625;00:00:06:101;0.4191397727;1.563046813;-0.2234582752;-0;0;-0;0;0;0;1
528;6.85546875;00:00:06:102;0.4199538529;1.563792825;-0.2207366675;-0;0;-0;0;0;0;1
529;6.8671875;00:00:06:104;0.421066463;1.564316034;-0.217914179;-0;0;-0;0;0;0;1
530;6.875;00:00:06:105;0.4223776758;1.564810991;-0.2150922567;-0;0;-0;0;0;0;1
531;6.8828125;00:00:06:105;0.4236824512;1.565330625;-0.2122303396;-0;0;-0;0;0;0;1
532;6.890625;00:00:06:106;0.4250800312;1.565830946;-0.2093973309;-0;0;-0;0;0;0;1
533;6.8984375;00:00:06:107;0.426546216;1.566310525;-0.2066844851;-0;0;-0;0;0;0;1
534;6.90625;00:00:06:108;0.4282697737;1.566688061;-0.2040286809;-0;0;-0;0;0;0;1
535;6.9140625;00:00:06:109;0.4298847616;1.567149401;-0.2014840096;-0;0;-0;0;0;0;1
536;6.921875;00:00:06:110;0.4316996038;1.567460775;-0.1989348829;-0;0;-0;0;0;0;1
537;6.93359375;00:00:06:112;0.4334971309;1.567883611;-0.1963466257;-0;0;-0;0;0;0;1
538;6.94140625;00:00:06:112;0.4354684651;1.568203568;-0.1937664449;-0;0;-0;0;0;0;1
539;6.94921875;00:00:06:113;0.4376547635;1.568544388;-0.1911881566;-0;0;-0;0;0;0;1
540;6.95703125;00:00:06:114;0.43952474;1.568981528;-0.1888478696;-0;0;-0;0;0;0;1
541;6.96484375;00:00:06:115;0.4416392744;1.569341421;-0.1864261329;-0;0;-0;0;0;0;1
542;6.97265625;00:00:06:116;0.443825841;1.56962955;-0.1840193123;-0;0;-0;0;0;0;1
543;6.98046875;00:00:06:117;0.4458954334;1.57000649;-0.1817698777;-0;0;-0;0;0;0;1
544;6.9921875;00:00:06:119;0.4479474723;1.570356011;-0.1795433015;-0;0;-0;0;0;0;1
545;7;00:00:07:00;0.4501102865;1.570675969;-0.1774269789;-0;0;-0;0;0;0;1
546;7.0078125;00:00:07:00;0.4521337152;1.570994973;-0.1754565388;-0;0;-0;0;0;0;1
547;7.015625;00:00:07:01;0.4541848898;1.571270227;-0.173575148;-0;0;-0;0;0;0;1
548;7.0234375;00:00:07:02;0.4562194347;1.571547985;-0.1717861593;-0;0;-0;0;0;0;1
549;7.03125;00:00:07:03;0.4582555592;1.571778774;-0.1701104343;-0;0;-0;0;0;0;1
550;7.0390625;00:00:07:04;0.4602056742;1.572027087;-0.1687027514;-0;0;-0;0;0;0;1
551;7.046875;00:00:07:05;0.4621103704;1.572335005;-0.1673361808;-0;0;-0;0;0;0;1
552;7.05859375;00:00:07:07;0.4640237987;1.572668672;-0.1660407037;-0;0;-0;0;0;0;1
553;7.06640625;00:00:07:07;0.4658880234;1.573015332;-0.1648321897;-0;0;-0;0;0;0;1
554;7.07421875;00:00:07:08;0.4677919149;1.573348165;-0.1636577994;-0;0;-0;0;0;0;1
555;7.08203125;00:00:07:09;0.4695761204;1.573752999;-0.1625406593;-0;0;-0;0;0;0;1
556;7.08984375;00:00:07:10;0.4714686275;1.574160218;-0.1615392864;-0;0;-0;0;0;0;1
557;7.09765625;00:00:07:11;0.4730640352;1.574376702;-0.1606627554;-0;0;-0;0;0;0;1
558;7.10546875;00:00:07:12;0.4744419456;1.574748039;-0.1598698348;-0;0;-0;0;0;0;1
559;7.1171875;00:00:07:14;0.4757253528;1.57498014;-0.1593118012;-0;0;-0;0;0;0;1
560;7.125;00:00:07:15;0.4771710932;1.575270057;-0.1585263014;-0;0;-0;0;0;0;1
561;7.1328125;00:00:07:15;0.478382051;1.575433731;-0.1579325795;-0;0;-0;0;0;0;1
562;7.140625;00:00:07:16;0.4793330133;1.575568676;-0.1574451327;-0;0;-0;0;0;0;1
563;7.1484375;00:00:07:17;0.4801535308;1.575662494;-0.1569653898;-0;0;-0;0;0;0;1
564;7.15625;00:00:07:18;0.480997771;1.575626612;-0.1563983858;-0;0;-0;0;0;0;1
565;7.1640625;00:00:07:19;0.4816450775;1.575575352;-0.1559423357;-0;0;-0;0;0;0;1
566;7.171875;00:00:07:20;0.4821618199;1.575521231;-0.1555137634;-0;0;-0;0;0;0;1
567;7.18359375;00:00:07:22;0.4826352894;1.575393438;-0.1551008821;-0;0;-0;0;0;0;1
568;7.19140625;00:00:07:22;0.4831001461;1.575215578;-0.1546974331;-0;0;-0;0;0;0;1
569;7.19921875;00:00:07:23;0.4837544262;1.5748595;-0.1541473716;-0;0;-0;0;0;0;1
570;7.20703125;00:00:07:24;0.4840463698;1.574700117;-0.153823331;-0;0;-0;0;0;0;1
571;7.21484375;00:00:07:25;0.4843384326;1.574533343;-0.1535319686;-0;0;-0;0;0;0;1
572;7.22265625;00:00:07:26;0.4845801592;1.574370623;-0.1533028185;-0;0;-0;0;0;0;1
573;7.23046875;00:00:07:27;0.4847752154;1.574201465;-0.1531841308;-0;0;-0;0;0;0;1
574;7.2421875;00:00:07:29;0.4849525392;1.574035406;-0.1530673206;-0;0;-0;0;0;0;1
575;7.25;00:00:07:30;0.4852961004;1.573686957;-0.1529835165;-0;0;-0;0;0;0;1
576;7.2578125;00:00:07:30;0.4855042398;1.57341671;-0.1529955566;-0;0;-0;0;0;0;1
577;7.265625;00:00:07:31;0.4858902097;1.573089004;-0.1529803276;-0;0;-0;0;0;0;1
578;7.2734375;00:00:07:32;0.4860235453;1.572777629;-0.1531546861;-0;0;-0;0;0;0;1
579;7.28125;00:00:07:33;0.4861629009;1.572427869;-0.1534111798;-0;0;-0;0;0;0;1
580;7.2890625;00:00:07:34;0.4863341749;1.572035313;-0.1537217796;-0;0;-0;0;0;0;1
581;7.296875;00:00:07:35;0.4865601063;1.571643114;-0.1540290266;-0;0;-0;0;0;0;1
582;7.30859375;00:00:07:37;0.4868523777;1.571213126;-0.1543752253;-0;0;-0;0;0;0;1
583;7.31640625;00:00:07:37;0.4871618748;1.570800185;-0.1547094733;-0;0;-0;0;0;0;1
584;7.32421875;00:00:07:38;0.4874821901;1.570376873;-0.1550119817;-0;0;-0;0;0;0;1
585;7.33203125;00:00:07:39;0.4878560305;1.569915891;-0.1553700566;-0;0;-0;0;0;0;1
586;7.33984375;00:00:07:40;0.4882100821;1.569437504;-0.1557631195;-0;0;-0;0;0;0;1
587;7.34765625;00:00:07:41;0.4885698557;1.568952918;-0.1561182737;-0;0;-0;0;0;0;1
588;7.35546875;00:00:07:42;0.4889832139;1.568442941;-0.1564971209;-0;0;-0;0;0;0;1
589;7.3671875;00:00:07:44;0.4894257188;1.56786716;-0.1568475813;-0;0;-0;0;0;0;1
590;7.375;00:00:07:45;0.4898877144;1.5673002;-0.1571364403;-0;0;-0;0;0;0;1
591;7.3828125;00:00:07:45;0.4903478324;1.566720843;-0.1574568301;-0;0;-0;0;0;0;1
592;7.390625;00:00:07:46;0.490822494;1.566166401;-0.1577732712;-0;0;-0;0;0;0;1
593;7.3984375;00:00:07:47;0.4913281202;1.565621734;-0.1580662876;-0;0;-0;0;0;0;1
594;7.40625;00:00:07:48;0.4918959439;1.565079927;-0.1582994163;-0;0;-0;0;0;0;1
595;7.4140625;00:00:07:49;0.4924854636;1.564612627;-0.1584395766;-0;0;-0;0;0;0;1
596;7.421875;00:00:07:50;0.4930909574;1.564230919;-0.1585171968;-0;0;-0;0;0;0;1
597;7.43359375;00:00:07:52;0.4937039316;1.563880205;-0.1586156338;-0;0;-0;0;0;0;1
598;7.44140625;00:00:07:52;0.4943960011;1.563512564;-0.158706367;-0;0;-0;0;0;0;1
599;7.44921875;00:00:07:53;0.4950209558;1.563185453;-0.158789292;-0;0;-0;0;0;0;1
600;7.45703125;00:00:07:54;0.4955716431;1.562917709;-0.1588240713;-0;0;-0;0;0;0;1
601;7.46484375;00:00:07:55;0.4961602986;1.562679052;-0.1588939279;-0;0;-0;0;0;0;1
602;7.47265625;00:00:07:56;0.4967260361;1.562470555;-0.1589452177;-0;0;-0;0;0;0;1
603;7.48046875;00:00:07:57;0.4972539544;1.562318921;-0.1590179652;-0;0;-0;0;0;0;1
604;7.4921875;00:00:07:59;0.4977826476;1.562222242;-0.1590979844;-0;0;-0;0;0;0;1
605;7.5;00:00:07:60;0.4983146191;1.562189698;-0.1592051685;-0;0;-0;0;0;0;1
606;7.5078125;00:00:07:60;0.4988484383;1.562244534;-0.1593301892;-0;0;-0;0;0;0;1
607;7.515625;00:00:07:61;0.4993836582;1.562379241;-0.1595039219;-0;0;-0;0;0;0;1
608;7.5234375;00:00:07:62;0.4998899996;1.562560916;-0.1596578211;-0;0;-0;0;0;0;1
609;7.53125;00:00:07:63;0.5004184842;1.56280458;-0.159839794;-0;0;-0;0;0;0;1
610;7.5390625;00:00:07:64;0.5009781718;1.563135147;-0.1600025892;-0;0;-0;0;0;0;1
611;7.546875;00:00:07:65;0.5015679002;1.563542485;-0.1600895673;-0;0;-0;0;0;0;1
612;7.55859375;00:00:07:67;0.5022392869;1.564092159;-0.1603188068;-0;0;-0;0;0;0;1
613;7.56640625;00:00:07:67;0.5029438138;1.564649582;-0.1605087221;-0;0;-0;0;0;0;1
614;7.57421875;00:00:07:68;0.503701508;1.565286756;-0.1607036889;-0;0;-0;0;0;0;1
615;7.58203125;00:00:07:69;0.5044075251;1.565921187;-0.160858959;-0;0;-0;0;0;0;1
616;7.58984375;00:00:07:70;0.5052675605;1.566713691;-0.1611557156;-0;0;-0;0;0;0;1
617;7.59765625;00:00:07:71;0.5063188076;1.567409039;-0.1611882299;-0;0;-0;0;0;0;1
618;7.60546875;00:00:07:72;0.5072074533;1.568290114;-0.1613088101;-0;0;-0;0;0;0;1
619;7.6171875;00:00:07:74;0.5081619024;1.56920743;-0.1615265459;-0;0;-0;0;0;0;1
620;7.625;00:00:07:75;0.5091096163;1.570078135;-0.1615906954;-0;0;-0;0;0;0;1
621;7.6328125;00:00:07:75;0.5101301074;1.571048856;-0.1616294682;-0;0;-0;0;0;0;1
622;7.640625;00:00:07:76;0.5110985637;1.571967959;-0.1616382003;-0;0;-0;0;0;0;1
623;7.6484375;00:00:07:77;0.5120087266;1.572945595;-0.1615812927;-0;0;-0;0;0;0;1
624;7.65625;00:00:07:78;0.5130515099;1.573812604;-0.1615846902;-0;0;-0;0;0;0;1
625;7.6640625;00:00:07:79;0.5140172243;1.574596167;-0.1616055071;-0;0;-0;0;0;0;1
626;7.671875;00:00:07:80;0.5150058866;1.575356245;-0.1615325212;-0;0;-0;0;0;0;1
627;7.68359375;00:00:07:82;0.5159106255;1.576200247;-0.1615805179;-0;0;-0;0;0;0;1
628;7.69140625;00:00:07:82;0.5168529749;1.576940656;-0.1614350528;-0;0;-0;0;0;0;1
629;7.69921875;00:00:07:83;0.5177720785;1.577704668;-0.1613255143;-0;0;-0;0;0;0;1
630;7.70703125;00:00:07:84;0.5187843442;1.578553438;-0.1610813737;-0;0;-0;0;0;0;1
631;7.71484375;00:00:07:85;0.5197709203;1.579238772;-0.1608715951;-0;0;-0;0;0;0;1
632;7.72265625;00:00:07:86;0.5206726193;1.580050945;-0.1606594026;-0;0;-0;0;0;0;1
633;7.73046875;00:00:07:87;0.5215982795;1.580928683;-0.1604456455;-0;0;-0;0;0;0;1
634;7.7421875;00:00:07:89;0.5224980116;1.58179152;-0.1602032483;-0;0;-0;0;0;0;1
635;7.75;00:00:07:90;0.5227364302;1.583233237;-0.1604551971;-0;0;-0;0;0;0;1
636;7.7578125;00:00:07:90;0.524818778;1.583720803;-0.1595156938;-0;0;-0;0;0;0;1
637;7.765625;00:00:07:91;0.525218606;1.584980011;-0.1598184705;-0;0;-0;0;0;0;1
638;7.7734375;00:00:07:92;0.5271565914;1.585664153;-0.1588557214;-0;0;-0;0;0;0;1
639;7.78125;00:00:07:93;0.5271220207;1.587162495;-0.1594636589;-0;0;-0;0;0;0;1
640;7.7890625;00:00:07:94;0.5293647647;1.587596297;-0.1582236886;-0;0;-0;0;0;0;1
641;7.796875;00:00:07:95;0.5299047828;1.58893013;-0.1589161456;-0;0;-0;0;0;0;1
642;7.80859375;00:00:07:97;0.5311572552;1.589874983;-0.1577075422;-0;0;-0;0;0;0;1
643;7.81640625;00:00:07:97;0.5320999026;1.591008067;-0.1581412703;-0;0;-0;0;0;0;1
644;7.82421875;00:00:07:98;0.5334866643;1.59178555;-0.1572220325;-0;0;-0;0;0;0;1
645;7.83203125;00:00:07:99;0.5346258283;1.59266305;-0.1568948328;-0;0;-0;0;0;0;1
646;7.83984375;00:00:07:100;0.535615623;1.593498826;-0.1566493809;-0;0;-0;0;0;0;1
647;7.84765625;00:00:07:101;0.5367765427;1.59425211;-0.1563162953;-0;0;-0;0;0;0;1
648;7.85546875;00:00:07:102;0.5377619267;1.594944954;-0.1560433954;-0;0;-0;0;0;0;1
649;7.8671875;00:00:07:104;0.5389438868;1.595646381;-0.1556043178;-0;0;-0;0;0;0;1
650;7.875;00:00:07:105;0.5400549173;1.596294641;-0.1552014053;-0;0;-0;0;0;0;1
651;7.8828125;00:00:07:105;0.5410885215;1.596877933;-0.1548063606;-0;0;-0;0;0;0;1
652;7.890625;00:00:07:106;0.5420237184;1.597396135;-0.1544061303;-0;0;-0;0;0;0;1
653;7.8984375;00:00:07:107;0.5430556536;1.597917914;-0.1539720893;-0;0;-0;0;0;0;1
654;7.90625;00:00:07:108;0.5440240502;1.598454118;-0.1535125524;-0;0;-0;0;0;0;1
655;7.9140625;00:00:07:109;0.5449857712;1.598955274;-0.1530258358;-0;0;-0;0;0;0;1
656;7.921875;00:00:07:110;0.5459242463;1.599364161;-0.1525207162;-0;0;-0;0;0;0;1
657;7.93359375;00:00:07:112;0.5468221903;1.599743366;-0.1520493925;-0;0;-0;0;0;0;1
658;7.94140625;00:00:07:112;0.5472612977;1.6005584;-0.1516934931;-0;0;-0;0;0;0;1
659;7.94921875;00:00:07:113;0.5483400226;1.600950718;-0.1510766298;-0;0;-0;0;0;0;1
660;7.95703125;00:00:07:114;0.5491954684;1.601321936;-0.1505445391;-0;0;-0;0;0;0;1
661;7.96484375;00:00:07:115;0.5500732064;1.60170567;-0.1500316411;-0;0;-0;0;0;0;1
662;7.97265625;00:00:07:116;0.5508903861;1.602092743;-0.1495538652;-0;0;-0;0;0;0;1
663;7.98046875;00:00:07:117;0.5516757965;1.602510571;-0.1490712464;-0;0;-0;0;0;0;1
664;7.9921875;00:00:07:119;0.5523840189;1.603024006;-0.1485332251;-0;0;-0;0;0;0;1
665;8;00:00:08:00;0.5531291962;1.603428364;-0.1481229514;-0;0;-0;0;0;0;1
666;8.0078125;00:00:08:00;0.5538092256;1.603823662;-0.1477239877;-0;0;-0;0;0;0;1
667;8.015625;00:00:08:01;0.5544784665;1.604229093;-0.1473743469;-0;0;-0;0;0;0;1
668;8.0234375;00:00:08:02;0.5551096201;1.604627728;-0.147041589;-0;0;-0;0;0;0;1
669;8.03125;00:00:08:03;0.5558283329;1.604865432;-0.1466702223;-0;0;-0;0;0;0;1
670;8.0390625;00:00:08:04;0.5564613342;1.605072618;-0.1463813037;-0;0;-0;0;0;0;1
671;8.046875;00:00:08:05;0.5571145415;1.60530436;-0.1460302919;-0;0;-0;0;0;0;1
672;8.05859375;00:00:08:07;0.5574226379;1.605771184;-0.145799011;-0;0;-0;0;0;0;1
