Index;Time;Time Code;Original Y;Training;Testing
0;0;0;0.9142207;0;0
1;0;0;0.9142207;0;0
2;0;0;0.91428727;0;0
3;0;0;0.9144114;0;0
4;0;0;0.91434836;0;0
5;0;0;0.91416866;0;0
6;0;0;0.91407305;0;0
7;0;0;0.9141043;0;0
8;0;0;0.9141707;0;0
9;0;0;0.91430473;0;0
10;0;0;0.9142878;0.90590817;0
11;0;0;0.914297;0.9058567;0
12;0;0;0.91441846;0.90573716;0
13;0;0;0.91439027;0.9058075;0
14;0;0;0.9143257;0.9058028;0
15;0;0;0.9143994;0.9056848;0
16;0;0;0.9143056;0.9057579;0
17;0;0;0.9142121;0.90571165;0
18;0;0;0.9141532;0.90555257;0
19;0;0;0.9140218;0.9054764;0
20;0;0;0.9140358;0.90541446;0
21;0;0;0.9140196;0.9054448;0
22;0;0;0.9139745;0.90548575;0
23;0;0;0.9138963;0.9055008;0
24;0;0;0.91381603;0.90531415;0
25;0;0;0.9136498;0.90521467;0
26;0;0;0.9131942;0.9050075;0
27;0;0;0.91200787;0.90439355;0
28;0;0;0.9100735;0.90282553;0
29;0;0;0.90842986;0.9002851;0
30;0;0;0.9061634;0.8985155;0
31;0;0;0.902732;0.89647156;0
32;0;0;0.90025806;0.89294887;0
33;0;0;0.8967537;0.8906326;0
34;0;0;0.8926803;0.88754416;0
35;0;0;0.8888047;0.88354695;0
36;0;0;0.884953;0.8794272;0
37;0;0;0.8845718;0.8763802;0
38;0;0;0.8863717;0.8778482;0
39;0;0;0.8904169;0.8822086;0
40;0;0;0.8958307;0.8889892;0
41;0;0;0.90472555;0.89460975;0
42;0;0;0.9213717;0.9039252;0
43;0;0;0.9350789;0.9240706;0
44;0;0;0.9485158;0.93982416;0
45;0;0;0.9658153;0.9518728;0
46;0;0;0.97539914;0.96770626;0
47;0;0;0.98061657;0.97501427;0
48;0;0;0.9831898;0.97364116;0
49;0;0;0.9847988;0.9703718;0
50;0;0;0.9832651;0.972301;0
51;0;0;0.97843236;0.96889937;0
52;0;0;0.97073555;0.9635141;0
53;0;0;0.96268725;0.95523065;0
54;0;0;0.95026124;0.94585717;0
55;0;0;0.9457966;0.9323479;0
56;0;0;0.9443585;0.93212575;0
57;0;0;0.94511306;0.9374073;0
58;0;0;0.94741994;0.94420767;0
59;0;0;0.9505223;0.94672704;0
60;0;0;0.9532416;0.94898033;0
61;0;0;0.9518549;0.94974107;0
62;0;0;0.94996154;0.9433503;0
63;0;0;0.94389206;0.9390052;0
64;0;0;0.93631655;0.9294142;0
65;0;0;0.92617536;0.9199695;0
66;0;0;0.91492254;0.90877694;0
67;0;0;0.90994334;0.8989659;0
68;0;0;0.90708566;0.89830816;0
69;0;0;0.8983963;0.9012643;0
70;0;0;0.8829125;0.89430654;0
71;0;0;0.87532896;0.8720031;0
72;0;0;0.8730862;0.862476;0
73;0;0;0.878378;0.865492;0
74;0;0;0.8955213;0.87988174;0
75;0;0;0.9366643;0.90644497;0
76;0;0;0.97952;0.96307886;0
77;0;0;1.024579;1.0178102;0
78;0;0;1.088839;1.0631189;0
79;0;0;1.1313995;1.1300311;0
80;0;0;1.1637609;1.1675459;0
81;0;0;1.1864794;1.1827401;0
82;0;0;1.2017266;1.1874977;0
83;0;0;1.1975963;1.1959442;0
84;0;0;1.1721925;1.1766481;0
85;0;0;1.1411785;1.1367704;0
86;0;0;1.1075451;1.097887;0
87;0;0;1.0531039;1.0587661;0
88;0;0;1.0074456;1.0033575;0
89;0;0;0.97049516;0.9669761;0
90;0;0;0.9418432;0.94020534;0
91;0;0;0.92228645;0.92488945;0
92;0;0;0.91959995;0.91032904;0
93;0;0;0.92502815;0.9212726;0
94;0;0;0.93276197;0.9374239;0
95;0;0;0.9426558;0.94393975;0
96;0;0;0.95305854;0.9507886;0
97;0;0;0.96436465;0.95786065;0
98;0;0;0.97050923;0.96572316;0
99;0;0;0.97262543;0.96626234;0
100;0;0;0.96691096;0.96411455;0
101;0;0;0.9570522;0.9510655;0
102;0;0;0.94788224;0.9355482;0
103;0;0;0.9413184;0.9250276;0
104;0;0;0.92916936;0.9232025;0
105;0;0;0.90860045;0.9156269;0
106;0;0;0.88605565;0.8924148;0
107;0;0;0.8788491;0.865858;0
108;0;0;0.8782909;0.8646887;0
109;0;0;0.89194393;0.8776321;0
110;0;0;0.9174973;0.9061907;0
111;0;0;0.9707675;0.9416842;0
112;0;0;1.0183189;1.0109602;0
113;0;0;1.0674856;1.0643414;0
114;0;0;1.1291362;1.1106424;0
115;0;0;1.1627684;1.1663582;0
116;0;0;1.1878568;1.1896377;0
117;0;0;1.2029591;1.1969382;0
118;0;0;1.1953831;1.1943948;0
119;0;0;1.1804727;1.1748558;0
120;0;0;1.1465812;1.1449621;0
121;0;0;1.1141032;1.1046611;0
122;0;0;1.0702853;1.0689243;0
123;0;0;1.0056779;1.019331;0
124;0;0;0.96797246;0.9620544;0
125;0;0;0.94078004;0.92894;0
126;0;0;0.920531;0.9168831;0
127;0;0;0.9191721;0.915611;0
128;0;0;0.92452294;0.920345;0
129;0;0;0.93275374;0.93999475;0
130;0;0;0.9461598;0.9480648;0
131;0;0;0.95526546;0.95078737;0
132;0;0;0.9601797;0.9613775;0
133;0;0;0.96575975;0.95830685;0
134;0;0;0.9631389;0.95628077;0
135;0;0;0.9514057;0.95089006;0
136;0;0;0.9442539;0.9312247;0
137;0;0;0.9377368;0.9209119;0
138;0;0;0.91775626;0.91979074;0
139;0;0;0.89628667;0.9002577;0
140;0;0;0.8798393;0.87463456;0
141;0;0;0.8687135;0.86111534;0
142;0;0;0.87306035;0.8590298;0
143;0;0;0.8874359;0.8751121;0
144;0;0;0.92917806;0.90415734;0
145;0;0;0.9788174;0.9626478;0
146;0;0;1.0366656;1.0226951;0
147;0;0;1.1046613;1.0886343;0
148;0;0;1.1952682;1.1559126;0
149;0;0;1.2574954;1.2576816;0
150;0;0;1.3201154;1.3137885;0
151;0;0;1.3479955;1.3596255;0
152;0;0;1.3554527;1.3621017;0
153;0;0;1.3364232;1.3479441;0
154;0;0;1.3012899;1.303055;0
155;0;0;1.2459549;1.2514664;0
156;0;0;1.1835649;1.1836478;0
157;0;0;1.1299685;1.1097094;0
158;0;0;1.0826017;1.0708115;0
159;0;0;1.0315274;1.0417907;0
160;0;0;1.0012511;1.0072209;0
161;0;0;0.9882099;0.9811872;0
162;0;0;0.9770343;0.9800025;0
163;0;0;0.97093576;0.9739656;0
164;0;0;0.9724104;0.9679415;0
165;0;0;0.9764695;0.97132754;0
166;0;0;0.9814559;0.97786593;0
167;0;0;0.9858407;0.9783697;0
168;0;0;0.99182504;0.98587584;0
169;0;0;0.9933768;0.99094945;0
170;0;0;0.9917862;0.98776245;0
171;0;0;0.97940606;0.98192245;0
172;0;0;0.9584834;0.96178675;0
173;0;0;0.9347309;0.93177986;0
174;0;0;0.9146096;0.9025358;0
175;0;0;0.9054981;0.888065;0
176;0;0;0.90510637;0.89312166;0
177;0;0;0.91254616;0.9079535;0
178;0;0;0.9211106;0.9270157;0
179;0;0;0.92991465;0.9361578;0
180;0;0;0.9403454;0.9389415;0
181;0;0;0.94802165;0.94216084;0
182;0;0;0.95377004;0.94545615;0
183;0;0;0.9591467;0.94766545;0
184;0;0;0.96157223;0.95062333;0
185;0;0;0.9607848;0.95244855;0
186;0;0;0.95811266;0.9489627;0
187;0;0;0.9566244;0.9440655;0
188;0;0;0.95355546;0.9435497;0
189;0;0;0.9484345;0.9411958;0
190;0;0;0.94246215;0.9359961;0
191;0;0;0.9393773;0.9293286;0
192;0;0;0.94100523;0.9278801;0
193;0;0;0.950512;0.93357706;0
194;0;0;0.95920336;0.9498686;0
195;0;0;0.9698749;0.96325135;0
196;0;0;0.9799082;0.9744061;0
197;0;0;0.9819093;0.981394;0
198;0;0;0.97226584;0.9774258;0
199;0;0;0.96445864;0.9555416;0
200;0;0;0.9619089;0.94095707;0
201;0;0;0.9601367;0.94285387;0
202;0;0;0.9594592;0.9485572;0
203;0;0;0.9589365;0.9528033;0
204;0;0;0.95634115;0.9546864;0
205;0;0;0.95306575;0.95021677;0
206;0;0;0.9495391;0.94236803;0
207;0;0;0.94263184;0.93769133;0
208;0;0;0.93622214;0.9298452;0
209;0;0;0.9302447;0.9226529;0
210;0;0;0.9318213;0.91776025;0
211;0;0;0.93888915;0.9246992;0
212;0;0;0.9420207;0.938028;0
213;0;0;0.94313574;0.9435581;0
214;0;0;0.9423731;0.94007045;0
215;0;0;0.9393505;0.93341845;0
216;0;0;0.93654853;0.9268727;0
217;0;0;0.9370135;0.9217982;0
218;0;0;0.93956417;0.925575;0
219;0;0;0.9458513;0.9330802;0
220;0;0;0.9527991;0.9430377;0
221;0;0;0.95999604;0.95227796;0
222;0;0;0.9702504;0.9596956;0
223;0;0;0.9773624;0.96941984;0
224;0;0;0.9811421;0.9753732;0
225;0;0;0.9840292;0.9757848;0
226;0;0;0.97699153;0.9747351;0
227;0;0;0.9795093;0.96272296;0
228;0;0;0.9850042;0.96532923;0
229;0;0;0.9848951;0.9765149;0
230;0;0;0.9801408;0.981627;0
231;0;0;0.9756525;0.97078836;0
232;0;0;0.9691885;0.96292806;0
233;0;0;0.9640482;0.9549617;0
234;0;0;0.9595594;0.94853354;0
235;0;0;0.9568419;0.94768095;0
236;0;0;0.9543324;0.94882846;0
237;0;0;0.95126426;0.94708633;0
238;0;0;0.94837165;0.94366306;0
239;0;0;0.94509673;0.9400123;0
240;0;0;0.9403276;0.9354694;0
241;0;0;0.9377962;0.9299111;0
242;0;0;0.93306977;0.92743534;0
243;0;0;0.9270026;0.92320055;0
244;0;0;0.9250703;0.91665584;0
245;0;0;0.92686486;0.91512555;0
246;0;0;0.92440677;0.9210808;0
247;0;0;0.9176953;0.91974956;0
248;0;0;0.91664505;0.90858465;0
249;0;0;0.918132;0.9061092;0
250;0;0;0.91357803;0.9102489;0
251;0;0;0.9158738;0.9061022;0
252;0;0;0.9236281;0.9087316;0
253;0;0;0.9345366;0.9209347;0
254;0;0;0.9466912;0.9368251;0
255;0;0;0.9602351;0.949417;0
256;0;0;0.97859424;0.9647512;0
257;0;0;0.98926216;0.98459786;0
258;0;0;1.0007284;0.99081856;0
259;0;0;1.0006083;0.99912566;0
260;0;0;0.9955839;0.9911228;0
261;0;0;0.98135144;0.9789627;0
262;0;0;0.96923333;0.9549526;0
263;0;0;0.9632198;0.9429617;0
264;0;0;0.9535242;0.9435335;0
265;0;0;0.94429064;0.9411167;0
266;0;0;0.93696374;0.93639356;0
267;0;0;0.93237305;0.9285956;0
268;0;0;0.9249368;0.9268414;0
269;0;0;0.9248693;0.9176067;0
270;0;0;0.9274944;0.91959256;0
271;0;0;0.92998654;0.92604285;0
272;0;0;0.9334135;0.9296603;0
273;0;0;0.9360606;0.93064296;0
274;0;0;0.9355588;0.9314405;0
275;0;0;0.93323004;0.92781425;0
276;0;0;0.9289796;0.9206856;0
277;0;0;0.9179208;0.91495144;0
278;0;0;0.90599155;0.90082663;0
279;0;0;0.8968805;0.8868652;0
280;0;0;0.89500946;0.8802992;0
281;0;0;0.89836675;0.88682485;0
282;0;0;0.89644766;0.89845866;0
283;0;0;0.8965661;0.8987297;0
284;0;0;0.89771664;0.89550966;0
285;0;0;0.9005185;0.89200515;0
286;0;0;0.90941656;0.8948312;0
287;0;0;0.92229515;0.90537417;0
288;0;0;0.9445514;0.9237825;0
289;0;0;0.9643314;0.95436;0
290;0;0;0.98485124;0.9756698;0
291;0;0;1.0037097;0.9955057;0
292;0;0;1.0350993;1.0097864;0
293;0;0;1.0600855;1.0470752;0
294;0;0;1.0917118;1.0757644;0
295;0;0;1.1062347;1.1090788;0
296;0;0;1.1145582;1.1148283;0
297;0;0;1.120873;1.1122805;0
298;0;0;1.1195742;1.1099309;0
299;0;0;1.1057484;1.1079838;0
300;0;0;1.0789596;1.0856689;0
301;0;0;1.0531344;1.0448908;0
302;0;0;1.0203984;1.0168902;0
303;0;0;0.9776037;0.9837933;0
304;0;0;0.9492726;0.9441891;0
305;0;0;0.9287763;0.92308074;0
306;0;0;0.91725695;0.91552526;0
307;0;0;0.919325;0.9158213;0
308;0;0;0.92783415;0.92517054;0
309;0;0;0.9425294;0.94414157;0
310;0;0;0.9521979;0.95869374;0
311;0;0;0.95869493;0.9596289;0
312;0;0;0.95947266;0.96078634;0
313;0;0;0.96181965;0.94999284;0
314;0;0;0.96189725;0.94834924;0
315;0;0;0.95318365;0.9481745;0
316;0;0;0.936659;0.9372409;0
317;0;0;0.9166739;0.91408026;0
318;0;0;0.88670236;0.8894706;0
319;0;0;0.86908513;0.8578186;0
320;0;0;0.8589011;0.8459174;0
321;0;0;0.871581;0.8502266;0
322;0;0;0.903532;0.8852716;0
323;0;0;0.9470921;0.9349022;0
324;0;0;0.9963295;0.99150616;0
325;0;0;1.071548;1.0436145;0
326;0;0;1.1298109;1.1256249;0
327;0;0;1.2010927;1.182297;0
328;0;0;1.2475567;1.2493806;0
329;0;0;1.2812545;1.2800635;0
330;0;0;1.3045125;1.299157;0
331;0;0;1.3037977;1.2987612;0
332;0;0;1.3051702;1.2878908;0
333;0;0;1.3019664;1.2798612;0
334;0;0;1.296171;1.2732941;0
335;0;0;1.2881464;1.2755711;0
336;0;0;1.2793863;1.2691259;0
337;0;0;1.2801706;1.2639441;0
338;0;0;1.2763181;1.2756174;0
339;0;0;1.2726178;1.2756741;0
340;0;0;1.2737101;1.2741932;0
341;0;0;1.27653;1.2737129;0
342;0;0;1.2749827;1.2802181;0
343;0;0;1.268942;1.2763019;0
344;0;0;1.2578001;1.2638891;0
345;0;0;1.2460952;1.2475967;0
346;0;0;1.2327201;1.2312948;0
347;0;0;1.2199283;1.216867;0
348;0;0;1.2063326;1.2073969;0
349;0;0;1.201063;1.1955885;0
350;0;0;1.1978619;1.1953388;0
351;0;0;1.1938244;1.1964315;0
352;0;0;1.1872011;1.1940193;0
353;0;0;1.180625;1.1839129;0
354;0;0;1.1710905;1.1747968;0
355;0;0;1.1655173;1.1619574;0
356;0;0;1.1690906;1.1563034;0
357;0;0;1.1757364;1.1676202;0
358;0;0;1.177076;1.1827159;0
359;0;0;1.1773903;1.1839942;0
360;0;0;1.1760888;1.1787525;0
361;0;0;1.1750896;1.1725872;0
362;0;0;1.1736593;1.1689227;0
363;0;0;1.167592;1.1670197;0
364;0;0;1.156244;1.1610842;0
365;0;0;1.1376407;1.1456687;0
366;0;0;1.1157393;1.1195416;0
367;0;0;1.1161422;1.0925853;0
368;0;0;1.1228724;1.102749;0
369;0;0;1.1324208;1.1272917;0
370;0;0;1.1412957;1.1490612;0
371;0;0;1.1533571;1.1556443;0
372;0;0;1.1766295;1.1657597;0
373;0;0;1.1960814;1.1889746;0
374;0;0;1.2198311;1.2105434;0
375;0;0;1.2510662;1.2396926;0
376;0;0;1.2731726;1.272313;0
377;0;0;1.2896686;1.2935026;0
378;0;0;1.305012;1.3005792;0
379;0;0;1.3128774;1.3081844;0
380;0;0;1.3164389;1.3123889;0
381;0;0;1.3176512;1.3114086;0
382;0;0;1.3150315;1.3104073;0
383;0;0;1.3001916;1.3076344;0
384;0;0;1.2781832;1.2869192;0
385;0;0;1.262549;1.2559392;0
386;0;0;1.2441477;1.2408137;0
387;0;0;1.2298951;1.2278029;0
388;0;0;1.2094482;1.2215089;0
389;0;0;1.2013288;1.1985316;0
390;0;0;1.2021793;1.1944095;0
391;0;0;1.1989932;1.200211;0
392;0;0;1.1918745;1.2014009;0
393;0;0;1.1851364;1.1897868;0
394;0;0;1.1858549;1.1781284;0
395;0;0;1.1931264;1.1818666;0
396;0;0;1.2020637;1.1944852;0
397;0;0;1.2156591;1.2112763;0
398;0;0;1.2273363;1.2293229;0
399;0;0;1.2341774;1.239703;0
400;0;0;1.2381465;1.2418786;0
401;0;0;1.2327518;1.2386566;0
402;0;0;1.2094402;1.2262398;0
403;0;0;1.1839341;1.1886171;0
404;0;0;1.1557399;1.1504425;0
405;0;0;1.1155264;1.1209005;0
406;0;0;1.0857517;1.082181;0
407;0;0;1.056917;1.0547796;0
408;0;0;1.0270218;1.0330836;0
409;0;0;1.0085915;1.0083565;0
410;0;0;0.99399036;0.9885849;0
411;0;0;0.988507;0.9828038;0
412;0;0;0.9908458;0.98483443;0
413;0;0;0.99632525;0.9903339;0
414;0;0;1.0031633;1.0029052;0
415;0;0;1.0099567;1.0079503;0
416;0;0;1.0127962;1.0131915;0
417;0;0;1.0143934;1.0114746;0
418;0;0;1.0144343;1.0069025;0
419;0;0;1.0138758;1.0041962;0
420;0;0;1.015479;1.0036094;0
421;0;0;1.0108557;1.0065979;0
422;0;0;1.0149201;1.0015702;0
423;0;0;1.0342534;1.0081582;0
424;0;0;1.0502645;1.0377465;0
425;0;0;1.0677239;1.0637239;0
426;0;0;1.0862079;1.0809181;0
427;0;0;1.1177769;1.0960706;0
428;0;0;1.1482732;1.1354234;0
429;0;0;1.1905822;1.169962;0
430;0;0;1.2249104;1.2192315;0
431;0;0;1.2619374;1.2515126;0
432;0;0;1.3050853;1.2850943;0
433;0;0;1.3327802;1.3281822;0
434;0;0;1.3550098;1.3548541;0
435;0;0;1.3660805;1.3672975;0
436;0;0;1.368148;1.366823;0
437;0;0;1.3510983;1.3571309;0
438;0;0;1.3130722;1.323704;0
439;0;0;1.2661059;1.2762526;0
440;0;0;1.2114135;1.2180411;0
441;0;0;1.1416584;1.1532558;0
442;0;0;1.0913937;1.0854414;0
443;0;0;1.0406015;1.0416385;0
444;0;0;0.9857579;1.0079575;0
445;0;0;0.9569663;0.9628437;0
446;0;0;0.9339381;0.93529975;0
447;0;0;0.92432016;0.92416656;0
448;0;0;0.9247575;0.9221986;0
449;0;0;0.9351864;0.9227387;0
450;0;0;0.9551039;0.9479161;0
451;0;0;0.9707774;0.970242;0
452;0;0;0.98468417;0.9819434;0
453;0;0;1.0003988;0.9946549;0
454;0;0;1.0041397;1.0017452;0
455;0;0;1.0008932;0.99886733;0
456;0;0;0.98275363;0.9855735;0
457;0;0;0.9628686;0.9544116;0
458;0;0;0.94583976;0.92994;0
459;0;0;0.9303452;0.9131716;0
460;0;0;0.90043056;0.9100258;0
461;0;0;0.88641226;0.8841952;0
462;0;0;0.8903402;0.87348646;0
463;0;0;0.9046867;0.8916267;0
464;0;0;0.9357538;0.9218395;0
465;0;0;0.9916262;0.9642222;0
466;0;0;1.0410345;1.0368799;0
467;0;0;1.0942317;1.0934557;0
468;0;0;1.161817;1.1376683;0
469;0;0;1.2037392;1.202283;0
470;0;0;1.2424831;1.2407662;0
471;0;0;1.2759976;1.2621325;0
472;0;0;1.2873049;1.2794335;0
473;0;0;1.2833853;1.2833166;0
474;0;0;1.260451;1.2564319;0
475;0;0;1.2381003;1.2204459;0
476;0;0;1.1990645;1.1959801;0
477;0;0;1.122972;1.1523072;0
478;0;0;1.0589786;1.0652851;0
479;0;0;0.99658424;0.99655557;0
480;0;0;0.9339338;0.94299275;0
481;0;0;0.90490013;0.8976495;0
482;0;0;0.8948144;0.88192505;0
483;0;0;0.90800065;0.9000919;0
484;0;0;0.9299362;0.93190616;0
485;0;0;0.9553331;0.95242685;0
486;0;0;0.9869029;0.98550475;0
487;0;0;1.0065297;1.0085235;0
488;0;0;1.0228981;1.0199347;0
489;0;0;1.0273823;1.0258696;0
490;0;0;1.0187593;1.0179564;0
491;0;0;1.0030113;1.0001643;0
492;0;0;0.98912376;0.97050935;0
493;0;0;0.9568128;0.95518064;0
494;0;0;0.92157906;0.92198855;0
495;0;0;0.88018584;0.8867094;0
496;0;0;0.8677008;0.84667027;0
497;0;0;0.870443;0.8529932;0
498;0;0;0.8903229;0.8764445;0
499;0;0;0.94579566;0.91993153;0
500;0;0;1.0024666;0.9955952;0
501;0;0;1.0756797;1.0643922;0
502;0;0;1.1295652;1.142388;0
503;0;0;1.1835854;1.177843;0
504;0;0;1.2419686;1.2217588;0
505;0;0;1.2748286;1.2663345;0
506;0;0;1.2971685;1.29384;0
507;0;0;1.3038251;1.2963005;0
508;0;0;1.2995014;1.2870559;0
509;0;0;1.2837759;1.2735962;0
510;0;0;1.2404232;1.2482873;0
511;0;0;1.1933715;1.1944524;0
512;0;0;1.127517;1.1386944;0
513;0;0;1.0404383;1.065393;0
514;0;0;0.9854248;0.98065;0
515;0;0;0.9337919;0.9293007;0
516;0;0;0.90612006;0.9020822;0
517;0;0;0.9027122;0.9024296;0
518;0;0;0.9168435;0.90776277;0
519;0;0;0.94419026;0.94149595;0
520;0;0;0.9669501;0.9712392;0
521;0;0;0.9890292;0.98843217;0
522;0;0;1.0046717;1.0067444;0
523;0;0;1.0242512;1.0086313;0
524;0;0;1.0288951;1.0242677;0
525;0;0;1.0289013;1.0232583;0
526;0;0;1.0130358;1.017333;0
527;0;0;0.99342847;0.9873791;0
528;0;0;0.96557075;0.95944655;0
529;0;0;0.92653495;0.92681813;0
530;0;0;0.89259934;0.8885541;0
531;0;0;0.8662813;0.8613392;0
532;0;0;0.86484045;0.84696615;0
533;0;0;0.8823842;0.8672405;0
534;0;0;0.91813064;0.9044955;0
535;0;0;0.9856586;0.95986855;0
536;0;0;1.0447477;1.0427029;0
537;0;0;1.1235201;1.108771;0
538;0;0;1.1823921;1.1864488;0
539;0;0;1.2332984;1.2319887;0
540;0;0;1.2855793;1.2697693;0
541;0;0;1.3087184;1.3041234;0
542;0;0;1.3196493;1.3164493;0
543;0;0;1.3156767;1.3102986;0
544;0;0;1.3010695;1.2892274;0
545;0;0;1.2697968;1.2669023;0
546;0;0;1.225878;1.2282445;0
547;0;0;1.1394947;1.1763647;0
548;0;0;1.068922;1.0730609;0
549;0;0;1.0123802;0.99912846;0
550;0;0;0.9437937;0.9557687;0
551;0;0;0.9165438;0.91243935;0
552;0;0;0.9124137;0.9014997;0
553;0;0;0.9232008;0.9190615;0
554;0;0;0.9342863;0.9481345;0
555;0;0;0.95319325;0.94716877;0
556;0;0;0.9675236;0.9713979;0
557;0;0;0.9771773;0.9760291;0
558;0;0;0.9832205;0.9751665;0
559;0;0;0.98566836;0.97546756;0
560;0;0;0.98657256;0.97356886;0
561;0;0;0.98395973;0.9727747;0
562;0;0;0.9674831;0.96839374;0
563;0;0;0.9500302;0.94730425;0
564;0;0;0.9136082;0.9228999;0
565;0;0;0.88683087;0.87908953;0
566;0;0;0.8725766;0.85535115;0
567;0;0;0.8682289;0.85369164;0
568;0;0;0.8812258;0.8727542;0
569;0;0;0.9084817;0.9001948;0
570;0;0;0.9581374;0.9388493;0
571;0;0;1.0028373;1.0016327;0
572;0;0;1.0480095;1.0460874;0
573;0;0;1.1079009;1.0869262;0
574;0;0;1.15103;1.142773;0
575;0;0;1.1894654;1.181588;0
576;0;0;1.227617;1.2106987;0
577;0;0;1.2452178;1.2377055;0
578;0;0;1.2541556;1.245058;0
579;0;0;1.2495538;1.2379351;0
580;0;0;1.2292293;1.2227886;0
581;0;0;1.2037802;1.1963788;0
582;0;0;1.1579123;1.1648582;0
583;0;0;1.1074328;1.1102918;0
584;0;0;1.057131;1.0564386;0
585;0;0;1.0177338;1.0105982;0
586;0;0;0.98157763;0.98599905;0
587;0;0;0.9710616;0.95904624;0
588;0;0;0.97080415;0.9614041;0
589;0;0;0.9757637;0.97614455;0
590;0;0;0.982464;0.98785645;0
591;0;0;0.9949217;0.9907587;0
592;0;0;1.0072676;1.0003729;0
593;0;0;1.0201045;1.0130539;0
594;0;0;1.0367178;1.0228567;0
595;0;0;1.0500553;1.0408175;0
596;0;0;1.0610604;1.0542312;0
597;0;0;1.0727032;1.0630469;0
598;0;0;1.0783905;1.0722418;0
599;0;0;1.082536;1.0765277;0
600;0;0;1.0810311;1.0768403;0
601;0;0;1.0766621;1.0706786;0
602;0;0;1.0634421;1.0639563;0
603;0;0;1.0455345;1.0444925;0
604;0;0;1.0350769;1.0221242;0
605;0;0;1.0279046;1.013908;0
606;0;0;1.0230278;1.0147523;0
607;0;0;1.0192242;1.0177127;0
608;0;0;1.0183059;1.0160618;0
609;0;0;1.0130978;1.0173296;0
610;0;0;1.0074476;1.0081624;0
611;0;0;1.0085744;0.9979325;0
612;0;0;1.019303;1.0005263;0
613;0;0;1.0323805;1.0198603;0
614;0;0;1.0473732;1.0403998;0
615;0;0;1.0803988;1.0581865;0
616;0;0;1.1065837;1.0993111;0
617;0;0;1.1385596;1.1294029;0
618;0;0;1.1753078;1.1630712;0
619;0;0;1.1924282;1.1980021;0
620;0;0;1.2007602;1.2095389;0
621;0;0;1.2169445;1.2000874;0
622;0;0;1.2121543;1.2114724;0
623;0;0;1.1814349;1.2049556;0
624;0;0;1.1396124;1.154872;0
625;0;0;1.0828366;1.0893255;0
626;0;0;1.037529;1.0207983;0
627;0;0;0.9828796;0.9837564;0
628;0;0;0.9503491;0.9434731;0
629;0;0;0.9260324;0.930267;0
630;0;0;0.90682304;0.9123067;0
631;0;0;0.89645195;0.9030054;0
632;0;0;0.9021833;0.89260036;0
633;0;0;0.92129993;0.9057531;0
634;0;0;0.93515563;0.9385035;0
635;0;0;0.955479;0.94997954;0
636;0;0;0.97626364;0.97093284;0
637;0;0;0.9922633;0.98686296;0
638;0;0;1.008541;0.9980809;0
639;0;0;1.0157362;1.0084158;0
640;0;0;1.0078181;1.012392;0
641;0;0;0.9971159;0.994156;0
642;0;0;0.9765416;0.9696617;0
643;0;0;0.94395334;0.94384116;0
644;0;0;0.92515534;0.9061144;0
645;0;0;0.924317;0.89343214;0
646;0;0;0.92122924;0.9156453;0
647;0;0;0.92356503;0.9307668;0
648;0;0;0.9245231;0.93480486;0
649;0;0;0.9253757;0.9325739;0
650;0;0;0.9303741;0.9268847;0
651;0;0;0.9488182;0.923427;0
652;0;0;0.9777327;0.9505032;0
653;0;0;1.0123649;0.99390316;0
654;0;0;1.0588975;1.03768;0
655;0;0;1.0988214;1.0936382;0
656;0;0;1.1444409;1.13267;0
657;0;0;1.1880438;1.1735951;0
658;0;0;1.2359153;1.2119939;0
659;0;0;1.2679725;1.2641009;0
660;0;0;1.2938682;1.2857372;0
661;0;0;1.2857308;1.3008103;0
662;0;0;1.2446158;1.267934;0
663;0;0;1.1748047;1.1987975;0
664;0;0;1.124443;1.1016612;0
665;0;0;1.0678883;1.0522922;0
666;0;0;1.0095677;1.0123938;0
667;0;0;0.97539234;0.9783599;0
668;0;0;0.94390136;0.95446193;0
669;0;0;0.9233549;0.9331131;0
670;0;0;0.9225395;0.91859937;0
671;0;0;0.92684597;0.91647774;0
672;0;0;0.9490405;0.93698186;0
673;0;0;0.96717054;0.96610385;0
674;0;0;0.98434067;0.98215955;0
675;0;0;1.0103389;1.0014127;0
676;0;0;1.0229021;1.0196176;0
677;0;0;1.0191195;1.0276855;0
678;0;0;1.0035001;1.0105805;0
679;0;0;0.99591917;0.9743019;0
680;0;0;0.97457165;0.96600145;0
681;0;0;0.9484165;0.9431577;0
682;0;0;0.9191165;0.9179742;0
683;0;0;0.90075034;0.89162016;0
684;0;0;0.888198;0.88342166;0
685;0;0;0.9037512;0.8809129;0
686;0;0;0.918975;0.91490453;0
687;0;0;0.9409293;0.9450315;0
688;0;0;0.9607523;0.96810764;0
689;0;0;0.983102;0.9772736;0
690;0;0;1.0004654;0.99526215;0
691;0;0;1.0193472;1.0042521;0
692;0;0;1.034424;1.0212245;0
693;0;0;1.0550785;1.0377516;0
694;0;0;1.0656624;1.0598817;0
695;0;0;1.0732932;1.0684757;0
696;0;0;1.0795219;1.071279;0
697;0;0;1.0870532;1.0725391;0
698;0;0;1.1033232;1.081601;0
699;0;0;1.1296523;1.1044371;0
700;0;0;1.1494634;1.1431881;0
701;0;0;1.1648177;1.1700221;0
702;0;0;1.1780651;1.178647;0
703;0;0;1.1878757;1.184421;0
704;0;0;1.2092748;1.1903358;0
705;0;0;1.2297944;1.2142519;0
706;0;0;1.2456912;1.2417586;0
707;0;0;1.255991;1.2571453;0
708;0;0;1.2629857;1.2592586;0
709;0;0;1.271729;1.2629006;0
710;0;0;1.2876836;1.2711496;0
711;0;0;1.3048667;1.2915894;0
712;0;0;1.3323107;1.3145835;0
713;0;0;1.3562626;1.3487186;0
714;0;0;1.3783547;1.3774598;0
715;0;0;1.4062107;1.3942037;0
716;0;0;1.4259104;1.4212383;0
717;0;0;1.4464157;1.4434528;0
718;0;0;1.4554433;1.4618659;0
719;0;0;1.4650629;1.4640701;0
720;0;0;1.4692309;1.4646336;0
721;0;0;1.4668425;1.4618404;0
722;0;0;1.4547507;1.4587275;0
723;0;0;1.4272323;1.4382254;0
724;0;0;1.3915875;1.397043;0
725;0;0;1.3434472;1.3527349;0
726;0;0;1.2730253;1.3019129;0
727;0;0;1.2241553;1.2199681;0
728;0;0;1.1782112;1.1714604;0
729;0;0;1.1211966;1.1344991;0
730;0;0;1.0875609;1.0820369;0
731;0;0;1.0567405;1.0541586;0
732;0;0;1.0185721;1.0334721;0
733;0;0;0.9938105;0.99868596;0
734;0;0;0.9698394;0.96398336;0
735;0;0;0.9449597;0.9494625;0
736;0;0;0.9240942;0.92658806;0
737;0;0;0.9046473;0.90155053;0
738;0;0;0.8912879;0.8917845;0
739;0;0;0.8905573;0.8829584;0
740;0;0;0.8935496;0.88764876;0
741;0;0;0.8975767;0.901863;0
742;0;0;0.90059745;0.9072995;0
743;0;0;0.90597403;0.9054251;0
744;0;0;0.91284984;0.9056951;0
745;0;0;0.91635746;0.90838146;0
746;0;0;0.92023176;0.9100136;0
747;0;0;0.92716616;0.912824;0
748;0;0;0.9300593;0.92027617;0
749;0;0;0.9309303;0.92337275;0
750;0;0;0.92873394;0.92135113;0
751;0;0;0.9226006;0.9159585;0
752;0;0;0.9149955;0.9072376;0
753;0;0;0.90446883;0.89665765;0
754;0;0;0.8973128;0.88652116;0
755;0;0;0.88882345;0.8833772;0
756;0;0;0.8836243;0.8777449;0
757;0;0;0.8861901;0.87686056;0
758;0;0;0.8909552;0.8841145;0
759;0;0;0.89431196;0.8940313;0
760;0;0;0.88730055;0.89721;0
761;0;0;0.88677895;0.88112915;0
762;0;0;0.88767433;0.875589;0
763;0;0;0.8882849;0.8759403;0
764;0;0;0.8946542;0.8810597;0
765;0;0;0.90987396;0.89065105;0
766;0;0;0.92284995;0.91289914;0
767;0;0;0.9387095;0.9296422;0
768;0;0;0.95945585;0.9434657;0
769;0;0;0.97355086;0.9660598;0
770;0;0;0.9861054;0.97869945;0
771;0;0;0.99605054;0.985321;0
772;0;0;0.9995209;0.99132854;0
773;0;0;0.99821526;0.99240875;0
774;0;0;0.9922288;0.9837916;0
775;0;0;0.97919434;0.97323936;0
776;0;0;0.97531796;0.95741457;0
777;0;0;0.96521074;0.9554833;0
778;0;0;0.95449555;0.9495178;0
779;0;0;0.9440831;0.9422106;0
780;0;0;0.9364667;0.9305158;0
781;0;0;0.92934144;0.9268502;0
782;0;0;0.9268878;0.92147076;0
783;0;0;0.9265901;0.92115563;0
784;0;0;0.9276667;0.9255825;0
785;0;0;0.92892814;0.92665344;0
786;0;0;0.9296381;0.92628783;0
787;0;0;0.92885816;0.9245002;0
788;0;0;0.92831933;0.9208492;0
789;0;0;0.92771083;0.91799575;0
790;0;0;0.9271523;0.9173996;0
791;0;0;0.9259002;0.9173225;0
792;0;0;0.92292243;0.916296;0
793;0;0;0.9204787;0.9127555;0
794;0;0;0.9172353;0.90980434;0
795;0;0;0.9135901;0.9064117;0
796;0;0;0.9180573;0.9033474;0
797;0;0;0.9242878;0.9112617;0
798;0;0;0.9326155;0.9225841;0
799;0;0;0.93931466;0.9338482;0
800;0;0;0.9483484;0.93871146;0
801;0;0;0.9627295;0.9472996;0
802;0;0;0.97386247;0.96273875;0
803;0;0;0.985792;0.9746471;0
804;0;0;1.0012451;0.9865496;0
805;0;0;1.0120922;1.0021755;0
806;0;0;1.0226084;1.0134953;0
807;0;0;1.0366528;1.0211568;0
808;0;0;1.0477417;1.0358847;0
809;0;0;1.0613449;1.0497525;0
810;0;0;1.0812064;1.0633547;0
811;0;0;1.0984472;1.0875994;0
812;0;0;1.1222074;1.1096716;0
813;0;0;1.1619334;1.135657;0
814;0;0;1.1939013;1.1843987;0
815;0;0;1.2291468;1.2223315;0
816;0;0;1.2799535;1.2533034;0
817;0;0;1.3194647;1.308395;0
818;0;0;1.3598185;1.3518149;0
819;0;0;1.4092674;1.387772;0
820;0;0;1.4400852;1.4325352;0
821;0;0;1.4683588;1.4630932;0
822;0;0;1.5089276;1.4829026;0
823;0;0;1.5362546;1.5290895;0
824;0;0;1.5678828;1.5619522;0
825;0;0;1.6078742;1.5864989;0
826;0;0;1.6316886;1.6289146;0
827;0;0;1.6435834;1.6566939;0
828;0;0;1.6527729;1.6613061;0
829;0;0;1.656345;1.6609099;0
830;0;0;1.6583025;1.663823;0
831;0;0;1.6563387;1.6661621;0
832;0;0;1.6539699;1.6657324;0
833;0;0;1.6555301;1.6681244;0
834;0;0;1.6669546;1.6729655;0
835;0;0;1.6844714;1.6893162;0
836;0;0;1.7033511;1.7104427;0
837;0;0;1.7202874;1.7317026;0
838;0;0;1.7244349;1.7481099;0
839;0;0;1.7293582;1.7499224;0
840;0;0;1.7311907;1.7486658;0
841;0;0;1.7282116;1.7452089;0
842;0;0;1.7221599;1.742076;0
843;0;0;1.7174308;1.7337681;0
844;0;0;1.7160625;1.7306765;0
845;0;0;1.7076244;1.7314956;0
846;0;0;1.7001573;1.7231933;0
847;0;0;1.7034564;1.7127798;0
848;0;0;1.7161386;1.7180471;0
849;0;0;1.7430887;1.7351626;0
850;0;0;1.7598448;1.7644995;0
851;0;0;1.7658964;1.7848227;0
852;0;0;1.7623909;1.7916714;0
853;0;0;1.7759607;1.7802136;0
854;0;0;1.7848716;1.7902782;0
855;0;0;1.7870464;1.7996789;0
856;0;0;1.7820938;1.8033075;0
857;0;0;1.7776421;1.7945915;0
858;0;0;1.7752533;1.7922739;0
859;0;0;1.7774546;1.7882391;0
860;0;0;1.7814053;1.789955;0
861;0;0;1.7824535;1.7951828;0
862;0;0;1.7657053;1.7980978;0
863;0;0;1.7403793;1.7789617;0
864;0;0;1.7146695;1.7440313;0
865;0;0;1.6992052;1.7063662;0
866;0;0;1.6786597;1.6896877;0
867;0;0;1.6696962;1.6700839;0
868;0;0;1.6561999;1.6699847;0
869;0;0;1.653142;1.6607995;0
870;0;0;1.6599122;1.6637554;0
871;0;0;1.6728647;1.6714678;0
872;0;0;1.6858155;1.6937342;0
873;0;0;1.7090704;1.7109321;0
874;0;0;1.7274042;1.7362523;0
875;0;0;1.7436152;1.7552499;0
876;0;0;1.7616107;1.770027;0
877;0;0;1.7727649;1.7812501;0
878;0;0;1.7804661;1.7916563;0
879;0;0;1.7817056;1.7961612;0
880;0;0;1.7794232;1.795093;0
881;0;0;1.7798607;1.7933528;0
882;0;0;1.774323;1.7923951;0
883;0;0;1.7745762;1.7877922;0
884;0;0;1.7758298;1.7877024;0
885;0;0;1.7730079;1.7895106;0
886;0;0;1.7591368;1.7884369;0
887;0;0;1.7516471;1.7707736;0
888;0;0;1.745625;1.7608167;0
889;0;0;1.7451551;1.7538451;0
890;0;0;1.7466736;1.7565075;0
891;0;0;1.7525916;1.7577363;0
892;0;0;1.7655892;1.7683778;0
893;0;0;1.7741334;1.7823342;0
894;0;0;1.7726967;1.7922869;0
895;0;0;1.7707257;1.7894205;0
896;0;0;1.768943;1.7847552;0
897;0;0;1.7734022;1.7821738;0
898;0;0;1.7828853;1.7870098;0
899;0;0;1.8007369;1.7968364;0
900;0;0;1.7993131;1.8177177;0
901;0;0;1.7894386;1.8187236;0
902;0;0;1.7820637;1.804713;0
903;0;0;1.7706426;1.7909063;0
904;0;0;1.7557275;1.7788078;0
905;0;0;1.7558681;1.7601643;0
906;0;0;1.7534451;1.7642323;0
907;0;0;1.753125;1.766951;0
908;0;0;1.7463689;1.7670022;0
909;0;0;1.7422667;1.7571037;0
910;0;0;1.7276515;1.7551131;0
911;0;0;1.7046598;1.7343034;0
912;0;0;1.6518672;1.7036618;0
913;0;0;1.6001918;1.6308655;0
914;0;0;1.5346494;1.553678;0
915;0;0;1.432199;1.4591807;0
916;0;0;1.3455079;1.3474773;0
917;0;0;1.2623802;1.2586995;0
918;0;0;1.156371;1.1790062;0
919;0;0;1.0889136;1.0937458;0
920;0;0;1.0333617;1.0380951;0
921;0;0;0.9700566;0.9931463;0
922;0;0;0.9351907;0.9388943;0
923;0;0;0.9171443;0.9077889;0
924;0;0;0.9072262;0.90454084;0
925;0;0;0.90025395;0.9036557;0
926;0;0;0.8983934;0.8889326;0
927;0;0;0.90454423;0.8987356;0
928;0;0;0.92206204;0.90804464;0
929;0;0;0.94486547;0.92612815;0
930;0;0;0.99575317;0.96013266;0
931;0;0;1.0433393;1.0272232;0
932;0;0;1.0913051;1.0851687;0
933;0;0;1.1559951;1.1333977;0
934;0;0;1.1965268;1.1934539;0
935;0;0;1.2277374;1.2303035;0
936;0;0;1.2560793;1.2466741;0
937;0;0;1.2640344;1.2559052;0
938;0;0;1.2602797;1.2542112;0
939;0;0;1.2407241;1.2339292;0
940;0;0;1.2011428;1.2040207;0
941;0;0;1.1560391;1.157478;0
942;0;0;1.0886484;1.1000966;0
943;0;0;1.0349854;1.0276501;0
944;0;0;0.9860749;0.9875398;0
945;0;0;0.93427956;0.9474714;0
946;0;0;0.922743;0.91001177;0
947;0;0;0.9231742;0.909158;0
948;0;0;0.9370162;0.929552;0
949;0;0;0.95032275;0.96068126;0
950;0;0;0.96452445;0.9665118;0
951;0;0;0.9746774;0.9795794;0
952;0;0;0.98681843;0.97735846;0
953;0;0;0.9968878;0.9826661;0
954;0;0;1.0041325;0.99314845;0
955;0;0;1.008275;0.9986829;0
956;0;0;1.0047486;1.0010151;0
957;0;0;0.98826617;0.9919368;0
958;0;0;0.96911895;0.9658925;0
959;0;0;0.9530248;0.9382815;0
960;0;0;0.92438924;0.9239055;0
961;0;0;0.90502346;0.8993593;0
962;0;0;0.8860817;0.88550735;0
963;0;0;0.8716134;0.8738583;0
964;0;0;0.8677317;0.8678834;0
965;0;0;0.8783063;0.86687803;0
966;0;0;0.9066059;0.89007103;0
967;0;0;0.9377432;0.93258214;0
968;0;0;0.9732896;0.9667876;0
969;0;0;1.0276048;1.0044985;0
970;0;0;1.0675294;1.0618944;0
971;0;0;1.1056681;1.1025672;0
972;0;0;1.152363;1.129664;0
973;0;0;1.17925;1.1707206;0
974;0;0;1.1951008;1.1965615;0
975;0;0;1.2010444;1.1948845;0
976;0;0;1.1933616;1.1857702;0
977;0;0;1.1805825;1.1711147;0
978;0;0;1.1513698;1.1504966;0
979;0;0;1.1153667;1.1163759;0
980;0;0;1.0708165;1.073128;0
981;0;0;1.0058712;1.0223274;0
982;0;0;0.9671125;0.9601619;0
983;0;0;0.9397253;0.9262771;0
984;0;0;0.921532;0.91555625;0
985;0;0;0.91328156;0.91824645;0
986;0;0;0.9135754;0.91417694;0
987;0;0;0.9197137;0.9232596;0
988;0;0;0.92649925;0.93024915;0
989;0;0;0.9339499;0.92878383;0
990;0;0;0.94423765;0.93764454;0
991;0;0;0.94914156;0.94519395;0
992;0;0;0.95098466;0.9459355;0
993;0;0;0.9554265;0.9425287;0
994;0;0;0.9592584;0.94480383;0
995;0;0;0.9542153;0.9507248;0
996;0;0;0.93542165;0.94236255;0
997;0;0;0.9081136;0.912821;0
998;0;0;0.8860063;0.87576884;0
999;0;0;0.86636645;0.853492;0
1000;0;0;0.8613278;0.84408927;0
1001;0;0;0.87280923;0.8569708;0
1002;0;0;0.90965503;0.88719034;0
1003;0;0;0.9488973;0.9447621;0
1004;0;0;0.9969992;0.99062467;0
1005;0;0;1.0824865;1.040622;0
1006;0;0;1.1420271;1.1390842;0
1007;0;0;1.1897556;1.2001544;0
1008;0;0;1.2469579;1.230483;0
1009;0;0;1.2650552;1.2676587;0
1010;0;0;1.2609806;1.2773567;0
1011;0;0;1.2356358;1.2391549;0
1012;0;0;1.2026532;1.1864983;0
1013;0;0;1.1713597;1.1497438;0
1014;0;0;1.1262395;1.118955;0
1015;0;0;1.0875051;1.0777813;0
1016;0;0;1.049805;1.0523288;0
1017;0;0;1.0080994;1.0210931;0
1018;0;0;0.98938537;0.98321164;0
1019;0;0;0.97792697;0.9670038;0
1020;0;0;0.97433233;0.96795183;0
1021;0;0;0.9786521;0.9776667;0
1022;0;0;0.98667645;0.9822529;0
1023;0;0;1.0010178;0.99600416;0
1024;0;0;1.011399;1.0088824;0
1025;0;0;1.0231516;1.0171324;0
1026;0;0;1.0406208;1.0278577;0
1027;0;0;1.0538858;1.0434047;0
1028;0;0;1.0648822;1.0581167;0
1029;0;0;1.0726601;1.0671364;0
1030;0;0;1.073073;1.0705307;0
1031;0;0;1.0683129;1.0668049;0
1032;0;0;1.0537266;1.0537432;0
1033;0;0;1.0401614;1.0312667;0
1034;0;0;1.0304391;1.0161982;0
1035;0;0;1.0224677;1.0097724;0
1036;0;0;1.0228823;1.0101635;0
1037;0;0;1.0263987;1.0187677;0
1038;0;0;1.0396295;1.0289941;0
1039;0;0;1.0539064;1.0494958;0
1040;0;0;1.069417;1.0650116;0
1041;0;0;1.1003578;1.0812359;0
1042;0;0;1.1264483;1.1161422;0
1043;0;0;1.1522672;1.1474425;0
1044;0;0;1.1783719;1.1740919;0
1045;0;0;1.2100168;1.193345;0
1046;0;0;1.2268744;1.2270688;0
1047;0;0;1.2348319;1.2383115;0
1048;0;0;1.2324697;1.2356073;0
1049;0;0;1.2211683;1.2208866;0
1050;0;0;1.202092;1.2015605;0
1051;0;0;1.1756684;1.1761326;0
1052;0;0;1.1485561;1.1429328;0
1053;0;0;1.1117494;1.1162883;0
1054;0;0;1.0863701;1.0798278;0
1055;0;0;1.0692563;1.0603286;0
1056;0;0;1.0610576;1.0501707;0
1057;0;0;1.0640132;1.0545902;0
1058;0;0;1.071136;1.0652728;0
1059;0;0;1.0825689;1.0795283;0
1060;0;0;1.0956732;1.094162;0
1061;0;0;1.1079339;1.104961;0
1062;0;0;1.1263026;1.117064;0
1063;0;0;1.1401939;1.1337619;0
1064;0;0;1.1507044;1.1477891;0
1065;0;0;1.1645889;1.15671;0
1066;0;0;1.1687775;1.1683121;0
1067;0;0;1.1702785;1.169995;0
1068;0;0;1.1853247;1.1656175;0
1069;0;0;1.2081382;1.1835688;0
1070;0;0;1.2312032;1.2216817;0
1071;0;0;1.2539604;1.2529696;0
1072;0;0;1.2848973;1.2747947;0
1073;0;0;1.3107342;1.3070991;0
1074;0;0;1.3358891;1.3319514;0
1075;0;0;1.3604327;1.355643;0
1076;0;0;1.3795345;1.3765717;0
1077;0;0;1.3874156;1.38926;0
1078;0;0;1.3810784;1.3865314;0
1079;0;0;1.3626003;1.3656275;0
1080;0;0;1.3343577;1.3334614;0
1081;0;0;1.306918;1.3008187;0
1082;0;0;1.2797977;1.2729013;0
1083;0;0;1.2463155;1.2519449;0
1084;0;0;1.2364076;1.2281003;0
1085;0;0;1.2388195;1.2293547;0
1086;0;0;1.2472694;1.2417986;0
1087;0;0;1.2548621;1.2586763;0
1088;0;0;1.2563833;1.2622072;0
1089;0;0;1.2588135;1.2621713;0
1090;0;0;1.2652928;1.2593924;0
1091;0;0;1.2706559;1.2621444;0
1092;0;0;1.2862127;1.2726539;0
1093;0;0;1.296829;1.2962685;0
1094;0;0;1.3062402;1.3103877;0
1095;0;0;1.3162713;1.3196112;0
1096;0;0;1.3249556;1.3245829;0
1097;0;0;1.3262289;1.3334749;0
1098;0;0;1.3189098;1.3300021;0
1099;0;0;1.3080201;1.3133684;0
1100;0;0;1.2949153;1.2959837;0
1101;0;0;1.2817893;1.2793267;0
1102;0;0;1.2662125;1.2685461;0
1103;0;0;1.2491773;1.2547839;0
1104;0;0;1.2319882;1.2396338;0
1105;0;0;1.2252513;1.2213328;0
1106;0;0;1.2278104;1.2180961;0
1107;0;0;1.2323766;1.2296315;0
1108;0;0;1.2313391;1.2417892;0
1109;0;0;1.2260377;1.2382958;0
1110;0;0;1.214425;1.2246283;0
1111;0;0;1.1974581;1.2030803;0
1112;0;0;1.1818178;1.1772313;0
1113;0;0;1.1621066;1.1602224;0
1114;0;0;1.1604228;1.142773;0
1115;0;0;1.165827;1.1529126;0
1116;0;0;1.1768783;1.1713336;0
1117;0;0;1.1990824;1.1936349;0
1118;0;0;1.2243947;1.2209071;0
1119;0;0;1.2602513;1.2509707;0
1120;0;0;1.2877998;1.2919269;0
1121;0;0;1.3060308;1.3176167;0
1122;0;0;1.332047;1.3281701;0
1123;0;0;1.3536826;1.3459651;0
1124;0;0;1.372854;1.3661212;0
1125;0;0;1.3896856;1.3823463;0
1126;0;0;1.3929987;1.3925853;0
1127;0;0;1.382702;1.3881665;0
1128;0;0;1.369916;1.365391;0
1129;0;0;1.3518258;1.3455609;0
1130;0;0;1.3278363;1.327225;0
1131;0;0;1.2995317;1.3013844;0
1132;0;0;1.2718353;1.2755685;0
1133;0;0;1.2703348;1.257874;0
1134;0;0;1.2796028;1.2730558;0
1135;0;0;1.2884312;1.295382;0
1136;0;0;1.3013757;1.3123918;0
1137;0;0;1.3145423;1.3203849;0
1138;0;0;1.3189664;1.3269168;0
1139;0;0;1.3183706;1.3240931;0
1140;0;0;1.3249927;1.3145169;0
1141;0;0;1.3386474;1.3240082;0
1142;0;0;1.3623408;1.3458449;0
1143;0;0;1.397519;1.3793714;0
1144;0;0;1.428334;1.4271085;0
1145;0;0;1.4579653;1.4668998;0
1146;0;0;1.4899305;1.4942322;0
1147;0;0;1.5069814;1.5158565;0
1148;0;0;1.5093572;1.519321;0
1149;0;0;1.4950352;1.5048891;0
1150;0;0;1.4596844;1.4737382;0
1151;0;0;1.4163783;1.4200958;0
1152;0;0;1.3619679;1.3585986;0
1153;0;0;1.3239629;1.3036262;0
1154;0;0;1.302449;1.277728;0
1155;0;0;1.2911787;1.2800764;0
1156;0;0;1.2926812;1.2907068;0
1157;0;0;1.3084992;1.3059678;0
1158;0;0;1.3237749;1.3274422;0
1159;0;0;1.3307364;1.3362013;0
1160;0;0;1.3401229;1.3381354;0
1161;0;0;1.3399283;1.3404561;0
1162;0;0;1.3253074;1.33773;0
1163;0;0;1.3145815;1.3126177;0
1164;0;0;1.3184412;1.2985578;0
1165;0;0;1.3209797;1.3115762;0
1166;0;0;1.3227485;1.3268583;0
1167;0;0;1.3242251;1.3365095;0
1168;0;0;1.3279246;1.3380342;0
1169;0;0;1.3455375;1.3401536;0
1170;0;0;1.3690497;1.3620187;0
1171;0;0;1.3912888;1.3976089;0
1172;0;0;1.4173076;1.4220269;0
1173;0;0;1.4511843;1.446341;0
1174;0;0;1.4720176;1.4832753;0
1175;0;0;1.4813216;1.4949621;0
1176;0;0;1.476259;1.4863328;0
1177;0;0;1.4478401;1.4637126;0
1178;0;0;1.4084411;1.4177505;0
1179;0;0;1.3442333;1.3567363;0
1180;0;0;1.3129845;1.281999;0
1181;0;0;1.2877793;1.2632198;0
1182;0;0;1.2786559;1.2594017;0
1183;0;0;1.2809869;1.2858615;0
1184;0;0;1.2944969;1.2968296;0
1185;0;0;1.3184147;1.3159347;0
1186;0;0;1.3348317;1.3376194;0
1187;0;0;1.3446586;1.3474908;0
1188;0;0;1.3498797;1.352634;0
1189;0;0;1.353798;1.351345;0
1190;0;0;1.3617579;1.3515197;0
1191;0;0;1.3826575;1.360814;0
1192;0;0;1.401566;1.3883331;0
1193;0;0;1.4095768;1.417667;0
1194;0;0;1.4219265;1.4235129;0
1195;0;0;1.4276581;1.4296868;0
1196;0;0;1.4357696;1.4281278;0
1197;0;0;1.4467759;1.4344313;0
1198;0;0;1.4452932;1.4471079;0
1199;0;0;1.4345047;1.4444956;0
1200;0;0;1.408314;1.4244317;0
1201;0;0;1.3713989;1.3818243;0
1202;0;0;1.331184;1.3368969;0
1203;0;0;1.2847809;1.2930874;0
1204;0;0;1.2558184;1.2440575;0
1205;0;0;1.2447916;1.2304517;0
1206;0;0;1.2485826;1.235426;0
1207;0;0;1.255729;1.2563934;0
1208;0;0;1.2642236;1.2677014;0
1209;0;0;1.2857041;1.2732679;0
1210;0;0;1.2965636;1.2906177;0
1211;0;0;1.3053777;1.3011439;0
1212;0;0;1.3114505;1.3139763;0
1213;0;0;1.3146749;1.3124753;0
1214;0;0;1.3277907;1.316474;0
1215;0;0;1.3682996;1.3328775;0
1216;0;0;1.3931618;1.3885831;0
1217;0;0;1.4166524;1.4197742;0
1218;0;0;1.4419497;1.4456497;0
1219;0;0;1.4613082;1.4668255;0
1220;0;0;1.4690506;1.479975;0
1221;0;0;1.463872;1.46907;0
1222;0;0;1.4523302;1.4491498;0
1223;0;0;1.4388196;1.4296513;0
1224;0;0;1.4172478;1.4084085;0
1225;0;0;1.3968453;1.3849732;0
1226;0;0;1.3696938;1.3679429;0
1227;0;0;1.3244052;1.3474343;0
1228;0;0;1.272375;1.3025402;0
1229;0;0;1.2221357;1.2323908;0
1230;0;0;1.1648759;1.1762092;0
1231;0;0;1.1318299;1.1135194;0
1232;0;0;1.1103388;1.0940015;0
1233;0;0;1.0901628;1.0924174;0
1234;0;0;1.088777;1.084787;0
1235;0;0;1.0875845;1.0800937;0
1236;0;0;1.093679;1.0814036;0
1237;0;0;1.1084948;1.0955226;0
1238;0;0;1.1254225;1.11175;0
1239;0;0;1.1582592;1.1407439;0
1240;0;0;1.1738777;1.1807883;0
1241;0;0;1.1937866;1.1923305;0
1242;0;0;1.211601;1.2098776;0
1243;0;0;1.2144705;1.218853;0
1244;0;0;1.2050599;1.2175834;0
1245;0;0;1.1803539;1.1921898;0
1246;0;0;1.1639429;1.1513518;0
1247;0;0;1.1473829;1.132822;0
1248;0;0;1.1480412;1.11884;0
1249;0;0;1.1602604;1.1412579;0
1250;0;0;1.1743873;1.1724281;0
1251;0;0;1.2009815;1.1984832;0
1252;0;0;1.2183676;1.2279838;0
1253;0;0;1.2354996;1.2396067;0
1254;0;0;1.2544343;1.2519636;0
1255;0;0;1.2657826;1.263823;0
1256;0;0;1.2884026;1.2756978;0
1257;0;0;1.3103902;1.2976955;0
1258;0;0;1.3248494;1.3205073;0
1259;0;0;1.3340611;1.336709;0
1260;0;0;1.3469826;1.3381567;0
1261;0;0;1.3504021;1.3494968;0
1262;0;0;1.3621738;1.3486217;0
1263;0;0;1.3664229;1.3615026;0
1264;0;0;1.3554374;1.3633573;0
1265;0;0;1.3351271;1.3488692;0
1266;0;0;1.2969115;1.3173748;0
1267;0;0;1.2648777;1.2647398;0
1268;0;0;1.2339684;1.233488;0
1269;0;0;1.205962;1.2055862;0
1270;0;0;1.195866;1.1884435;0
1271;0;0;1.1943965;1.1861818;0
1272;0;0;1.1916811;1.1952935;0
1273;0;0;1.1832286;1.1944282;0
1274;0;0;1.1852813;1.1777565;0
1275;0;0;1.1954907;1.1828843;0
1276;0;0;1.1961948;1.1976953;0
1277;0;0;1.1891372;1.199731;0
1278;0;0;1.1773801;1.1857679;0
1279;0;0;1.1887193;1.1644284;0
1280;0;0;1.2017825;1.183344;0
1281;0;0;1.2192471;1.2080226;0
1282;0;0;1.2533278;1.2385286;0
1283;0;0;1.2892984;1.2816403;0
1284;0;0;1.332506;1.3262545;0
1285;0;0;1.3635167;1.3741741;0
1286;0;0;1.392288;1.3975472;0
1287;0;0;1.4209936;1.4129268;0
1288;0;0;1.4286578;1.4301251;0
1289;0;0;1.4175754;1.4314069;0
1290;0;0;1.3661559;1.4009221;0
1291;0;0;1.3155689;1.31521;0
1292;0;0;1.2481506;1.2499883;0
1293;0;0;1.1796108;1.1684525;0
1294;0;0;1.0865144;1.1128705;0
1295;0;0;1.0208533;1.0217615;0
1296;0;0;0.9507573;0.96606916;0
1297;0;0;0.9106989;0.91404784;0
1298;0;0;0.88167644;0.89566123;0
1299;0;0;0.86584324;0.87492526;0
1300;0;0;0.86266816;0.8705402;0
1301;0;0;0.86848867;0.8686268;0
1302;0;0;0.87935495;0.8728676;0
1303;0;0;0.8970948;0.89214694;0
1304;0;0;0.9068834;0.906406;0
1305;0;0;0.922876;0.9158323;0
1306;0;0;0.93232846;0.9251297;0
1307;0;0;0.93805945;0.9287731;0
1308;0;0;0.9339471;0.9313034;0
1309;0;0;0.91716254;0.9170951;0
1310;0;0;0.8996095;0.8908885;0
1311;0;0;0.87625873;0.86714494;0
1312;0;0;0.86950934;0.8442326;0
1313;0;0;0.8820922;0.85273117;0
1314;0;0;0.9233365;0.88571346;0
1315;0;0;0.96297944;0.9567027;0
1316;0;0;1.0076811;1.0074717;0
1317;0;0;1.0609065;1.0522249;0
1318;0;0;1.1234703;1.1002989;0
1319;0;0;1.1744459;1.1642578;0
1320;0;0;1.2281687;1.2104666;0
1321;0;0;1.2569788;1.2616062;0
1322;0;0;1.2821467;1.2717471;0
1323;0;0;1.3227324;1.2826313;0
1324;0;0;1.3229703;1.3236276;0
1325;0;0;1.2927511;1.3203546;0
1326;0;0;1.2292836;1.2594465;0
1327;0;0;1.1817167;1.1613547;0
1328;0;0;1.143744;1.1130565;0
1329;0;0;1.117184;1.0897638;0
1330;0;0;1.1101604;1.0973284;0
1331;0;0;1.1126636;1.114639;0
1332;0;0;1.1272607;1.1254328;0
1333;0;0;1.1347368;1.1405458;0
1334;0;0;1.1541127;1.1401205;0
1335;0;0;1.1758393;1.1661804;0
1336;0;0;1.188434;1.190219;0
1337;0;0;1.204451;1.20106;0
1338;0;0;1.2299913;1.2124559;0
1339;0;0;1.2416234;1.2432971;0
1340;0;0;1.2472647;1.2549682;0
1341;0;0;1.2481784;1.2487293;0
1342;0;0;1.2456794;1.2424067;0
1343;0;0;1.2442987;1.2375907;0
1344;0;0;1.239476;1.2339009;0
1345;0;0;1.2372171;1.2306865;0
1346;0;0;1.2366203;1.2324252;0
1347;0;0;1.233036;1.2332637;0
1348;0;0;1.2252369;1.2317103;0
1349;0;0;1.2161442;1.2195814;0
1350;0;0;1.2029706;1.2063437;0
1351;0;0;1.189497;1.1901605;0
1352;0;0;1.1865109;1.1745799;0
1353;0;0;1.2009134;1.1779101;0
1354;0;0;1.2129877;1.2094796;0
1355;0;0;1.2331923;1.2321829;0
1356;0;0;1.2608906;1.2559845;0
1357;0;0;1.2778965;1.2855633;0
1358;0;0;1.2972828;1.3011522;0
1359;0;0;1.3236637;1.312824;0
1360;0;0;1.3388549;1.3391004;0
1361;0;0;1.3444757;1.3542756;0
1362;0;0;1.3502334;1.3492414;0
1363;0;0;1.3457782;1.3454279;0
1364;0;0;1.3187885;1.3350796;0
1365;0;0;1.2847605;1.2982045;0
1366;0;0;1.257914;1.2518325;0
1367;0;0;1.2415239;1.2221477;0
1368;0;0;1.2289511;1.2225478;0
1369;0;0;1.220237;1.2233107;0
1370;0;0;1.2203815;1.2222742;0
1371;0;0;1.2225873;1.2246941;0
1372;0;0;1.2255064;1.2258412;0
1373;0;0;1.2244986;1.2291081;0
1374;0;0;1.222471;1.2243468;0
1375;0;0;1.2209239;1.2202373;0
1376;0;0;1.2184254;1.215191;0
1377;0;0;1.2118084;1.2123941;0
1378;0;0;1.2139802;1.2048912;0
1379;0;0;1.2240362;1.2104064;0
1380;0;0;1.2469351;1.2292651;0
1381;0;0;1.2634857;1.2651511;0
1382;0;0;1.2734075;1.2858655;0
1383;0;0;1.2812624;1.2903738;0
1384;0;0;1.2888405;1.2870597;0
1385;0;0;1.2941885;1.2903409;0
1386;0;0;1.3032975;1.2950522;0
1387;0;0;1.3076305;1.305963;0
1388;0;0;1.3071685;1.3096977;0
1389;0;0;1.3107961;1.3068575;0
1390;0;0;1.313807;1.3102466;0
1391;0;0;1.3141184;1.3151891;0
1392;0;0;1.308384;1.3164948;0
1393;0;0;1.2984427;1.3061086;0
1394;0;0;1.2895148;1.2911365;0
1395;0;0;1.279972;1.2793877;0
1396;0;0;1.2688212;1.2708398;0
1397;0;0;1.2561252;1.2622596;0
1398;0;0;1.242778;1.248589;0
1399;0;0;1.2532423;1.2350178;0
1400;0;0;1.26535;1.2555609;0
1401;0;0;1.2910331;1.280476;0
1402;0;0;1.3234283;1.320354;0
1403;0;0;1.3485516;1.3588736;0
1404;0;0;1.3784621;1.3856788;0
1405;0;0;1.3864138;1.4051075;0
1406;0;0;1.3937979;1.3971441;0
1407;0;0;1.4005581;1.3905087;0
1408;0;0;1.3971554;1.3890611;0
1409;0;0;1.3801556;1.384351;0
1410;0;0;1.3567277;1.358078;0
1411;0;0;1.3321021;1.3281579;0
1412;0;0;1.3048735;1.3012849;0
1413;0;0;1.2457639;1.2786174;0
1414;0;0;1.1878265;1.2105366;0
1415;0;0;1.1324365;1.138942;0
1416;0;0;1.0504335;1.0777829;0
1417;0;0;1.0088959;0.9992116;0
1418;0;0;0.98561877;0.9676854;0
1419;0;0;0.96963185;0.96603394;0
1420;0;0;0.96671414;0.9781488;0
1421;0;0;0.97172713;0.9665614;0
1422;0;0;0.9820906;0.9801009;0
1423;0;0;0.9976922;0.9919923;0
1424;0;0;1.0118663;0.9979445;0
1425;0;0;1.0270629;1.0215244;0
1426;0;0;1.0259999;1.034507;0
1427;0;0;1.0258672;1.0206798;0
1428;0;0;1.0144475;1.0121213;0
1429;0;0;0.98761714;0.99144167;0
1430;0;0;0.96072227;0.95647097;0
1431;0;0;0.9345885;0.9216827;0
1432;0;0;0.91753095;0.90206754;0
1433;0;0;0.90219593;0.90116614;0
1434;0;0;0.88610286;0.89565617;0
1435;0;0;0.89238185;0.8860968;0
1436;0;0;0.9121361;0.89777404;0
1437;0;0;0.96227634;0.9283449;0
1438;0;0;1.0237505;0.9995116;0
1439;0;0;1.0898027;1.0788094;0
1440;0;0;1.1636568;1.1547958;0
1441;0;0;1.2607287;1.2221202;0
1442;0;0;1.3270701;1.3228523;0
1443;0;0;1.4070423;1.3864652;0
1444;0;0;1.4562721;1.4505366;0
1445;0;0;1.4898612;1.4863893;0
1446;0;0;1.5018952;1.5079504;0
1447;0;0;1.4991283;1.4972835;0
1448;0;0;1.4801526;1.4822539;0
1449;0;0;1.4552393;1.4507434;0
1450;0;0;1.3990008;1.4072881;0
1451;0;0;1.3386533;1.3376209;0
1452;0;0;1.2321999;1.2737902;0
1453;0;0;1.1348326;1.150838;0
1454;0;0;1.0482271;1.0530938;0
1455;0;0;0.9589466;0.9721352;0
1456;0;0;0.915487;0.9103506;0
1457;0;0;0.9072711;0.89489263;0
1458;0;0;0.9286934;0.9144227;0
1459;0;0;0.95367396;0.9577003;0
1460;0;0;0.98071486;0.97437537;0
1461;0;0;1.0206132;1.0018767;0
1462;0;0;1.0555398;1.0418246;0
1463;0;0;1.0893615;1.0752411;0
1464;0;0;1.1155269;1.1100836;0
1465;0;0;1.1379373;1.1296299;0
1466;0;0;1.1366782;1.1463877;0
1467;0;0;1.1201029;1.1290965;0
1468;0;0;1.0938551;1.0958128;0
1469;0;0;1.0610864;1.0551155;0
1470;0;0;1.0012192;1.0144705;0
1471;0;0;0.94969606;0.9436649;0
1472;0;0;0.9096411;0.89832693;0
1473;0;0;0.8762169;0.8767123;0
1474;0;0;0.85746264;0.85818017;0
1475;0;0;0.8724258;0.85001224;0
1476;0;0;0.9268675;0.8877596;0
1477;0;0;0.9927296;0.9753078;0
1478;0;0;1.0646567;1.0566778;0
1479;0;0;1.1762633;1.1403323;0
1480;0;0;1.2646219;1.2637951;0
1481;0;0;1.3417182;1.345372;0
1482;0;0;1.4334321;1.4052098;0
1483;0;0;1.4860351;1.4778756;0
1484;0;0;1.5184388;1.5211395;0
1485;0;0;1.5305398;1.5330902;0
1486;0;0;1.5408146;1.5239265;0
1487;0;0;1.5322026;1.5264468;0
1488;0;0;1.5041283;1.5132613;0
1489;0;0;1.4340676;1.4644047;0
1490;0;0;1.3579139;1.3669021;0
1491;0;0;1.240877;1.273109;0
1492;0;0;1.1431757;1.1458961;0
1493;0;0;1.0740436;1.057566;0
1494;0;0;1.0174806;1.0113329;0
1495;0;0;0.97792417;0.9845242;0
1496;0;0;0.9712613;0.9668964;0
1497;0;0;0.9820483;0.97187036;0
1498;0;0;0.99679875;0.98887515;0
1499;0;0;1.0138408;0.99418724;0
1500;0;0;1.0355668;1.0166254;0
1501;0;0;1.0528316;1.047765;0
1502;0;0;1.0673863;1.0617384;0
1503;0;0;1.0778028;1.0688391;0
1504;0;0;1.0785141;1.0767388;0
1505;0;0;1.0743273;1.0722206;0
1506;0;0;1.063928;1.0589361;0
1507;0;0;1.0430266;1.042167;0
1508;0;0;1.0284048;1.0156844;0
1509;0;0;1.0040549;1.0012667;0
1510;0;0;0.98838615;0.9785591;0
1511;0;0;0.9870083;0.97041804;0
1512;0;0;0.9861906;0.97953284;0
1513;0;0;0.98027104;0.9920631;0
1514;0;0;0.97150284;0.9832161;0
1515;0;0;0.9741331;0.96475476;0
1516;0;0;0.99053437;0.96795076;0
1517;0;0;1.009867;0.99192125;0
1518;0;0;1.035008;1.0232095;0
1519;0;0;1.0490386;1.0553524;0
1520;0;0;1.0558982;1.0633992;0
1521;0;0;1.0585108;1.0568299;0
1522;0;0;1.0540189;1.0461117;0
1523;0;0;1.043756;1.0371208;0
1524;0;0;1.0217791;1.0221995;0
1525;0;0;0.998057;0.9924305;0
1526;0;0;0.97521484;0.96700263;0
1527;0;0;0.95094234;0.9454863;0
1528;0;0;0.93668294;0.9296408;0
1529;0;0;0.92926174;0.9254812;0
1530;0;0;0.9234717;0.92742264;0
1531;0;0;0.92368543;0.92753977;0
1532;0;0;0.9301537;0.92680544;0
1533;0;0;0.9379882;0.93567234;0
1534;0;0;0.949898;0.94466966;0
1535;0;0;0.95561326;0.9536813;0
1536;0;0;0.95662737;0.9564113;0
1537;0;0;0.9544748;0.95056635;0
1538;0;0;0.95242935;0.9398471;0
1539;0;0;0.9506758;0.9365198;0
1540;0;0;0.9501393;0.9362125;0
1541;0;0;0.95383507;0.93882346;0
1542;0;0;0.95652175;0.9479697;0
1543;0;0;0.9566075;0.9527595;0
1544;0;0;0.95517;0.95138794;0
1545;0;0;0.95243466;0.9459428;0
1546;0;0;0.94850165;0.9408808;0
1547;0;0;0.9445107;0.9352728;0
1548;0;0;0.9370808;0.93106806;0
1549;0;0;0.92946815;0.92383677;0
1550;0;0;0.92403305;0.91602254;0
1551;0;0;0.92564166;0.9117612;0
1552;0;0;0.92883253;0.9191726;0
1553;0;0;0.93298745;0.92750746;0
1554;0;0;0.9318731;0.9336169;0
1555;0;0;0.9335735;0.9282472;0
1556;0;0;0.9322041;0.92574984;0
1557;0;0;0.9286573;0.9211678;0
1558;0;0;0.92791194;0.9161559;0
1559;0;0;0.9299036;0.9153289;0
1560;0;0;0.9352951;0.9212104;0
1561;0;0;0.9423024;0.931279;0
1562;0;0;0.9509136;0.94044834;0
1563;0;0;0.95944786;0.9516462;0
1564;0;0;0.97266215;0.9590996;0
1565;0;0;0.9799878;0.9730636;0
1566;0;0;0.98512053;0.9788873;0
1567;0;0;0.9857564;0.9802116;0
1568;0;0;0.9818936;0.9749465;0
1569;0;0;0.9714202;0.96735805;0
1570;0;0;0.9716923;0.95108205;0
1571;0;0;0.9724469;0.9547456;0
1572;0;0;0.97018576;0.9637869;0
1573;0;0;0.96515906;0.9651111;0
1574;0;0;0.9632963;0.9563605;0
1575;0;0;0.96033543;0.9539749;0
1576;0;0;0.956676;0.95020133;0
1577;0;0;0.9557683;0.94537306;0
1578;0;0;0.95730686;0.9468516;0
1579;0;0;0.9605593;0.9513837;0
1580;0;0;0.96212536;0;0
1581;0;0;0.96155196;0;0
1582;0;0;0.95925677;0;0
1583;0;0;0.955905;0;0
1584;0;0;0.94918;0;0
1585;0;0;0.942144;0;0
1586;0;0;0.9331819;0;0
1587;0;0;0.9211571;0;0
1588;0;0;0.91744196;0;0
1589;0;0;0.9156076;0;0
1590;0;0;0.9083882;0;0
1591;0;0;0.8984993;0;0.9050982
1592;0;0;0.89318275;0;0.8896277
1593;0;0;0.89354944;0;0.88299376
1594;0;0;0.90053177;0;0.8873223
1595;0;0;0.9220452;0;0.90040034
1596;0;0;0.9705178;0;0.93268484
1597;0;0;1.0225699;0;1.001516
1598;0;0;1.0860164;0;1.0691925
1599;0;0;1.184891;0;1.1392846
1600;0;0;1.2674061;0;1.2499079
1601;0;0;1.3653239;0;1.3384492
1602;0;0;1.4648074;0;1.4253653
1603;0;0;1.5231304;0;1.5121303
1604;0;0;1.5617886;0;1.563856
1605;0;0;1.5716995;0;1.5839703
1606;0;0;1.5740443;0;1.5659322
1607;0;0;1.5769638;0;1.5502787
1608;0;0;1.5775957;0;1.5429273
1609;0;0;1.5734892;0;1.5476665
1610;0;0;1.5639067;0;1.5598745
1611;0;0;1.5578257;0;1.5644348
1612;0;0;1.5584764;0;1.5634705
1613;0;0;1.5661539;0;1.5678352
1614;0;0;1.5835965;0;1.5836154
1615;0;0;1.5939941;0;1.6121315
1616;0;0;1.5973799;0;1.6285948
1617;0;0;1.5967317;0;1.6278034
1618;0;0;1.5974207;0;1.6147544
1619;0;0;1.5947875;0;1.6097016
1620;0;0;1.5908498;0;1.6043519
1621;0;0;1.5819203;0;1.6011187
1622;0;0;1.5720704;0;1.5910063
1623;0;0;1.558566;0;1.580249
1624;0;0;1.552642;0;1.5589119
1625;0;0;1.5567129;0;1.5522207
1626;0;0;1.5535522;0;1.5637314
1627;0;0;1.5325854;0;1.566398
1628;0;0;1.5141935;0;1.5352833
1629;0;0;1.4989841;0;1.5033919
1630;0;0;1.4860499;0;1.4791573
1631;0;0;1.4701731;0;1.4655641
1632;0;0;1.4408897;0;1.4527422
1633;0;0;1.4043804;0;1.4226189
1634;0;0;1.3602624;0;1.3787575
1635;0;0;1.3046261;0;1.3227038
1636;0;0;1.2628986;0;1.2534177
1637;0;0;1.2260206;0;1.2153165
1638;0;0;1.19021;0;1.1911539
1639;0;0;1.1588739;0;1.1644514
1640;0;0;1.121305;0;1.1273147
1641;0;0;1.0748843;0;1.0912681
1642;0;0;1.0183449;0;1.0412421
1643;0;0;0.9889961;0;0.9725174
1644;0;0;0.96645194;0;0.953421
1645;0;0;0.9405584;0;0.94682956
1646;0;0;0.93362767;0;0.9292246
1647;0;0;0.9318829;0;0.9277539
1648;0;0;0.9325056;0;0.93545467
1649;0;0;0.9317323;0;0.938256
1650;0;0;0.9351526;0;0.92856133
1651;0;0;0.9404536;0;0.9361618
1652;0;0;0.9439198;0;0.93922293
1653;0;0;0.94792044;0;0.93902063
1654;0;0;0.95203626;0;0.9431047
1655;0;0;0.953558;0;0.9461702
1656;0;0;0.9496535;0;0.9462867
1657;0;0;0.94427055;0;0.93735856
1658;0;0;0.9347111;0;0.9287345
1659;0;0;0.9237261;0;0.9163594
1660;0;0;0.90952635;0;0.90472746
1661;0;0;0.9052478;0;0.89111173
1662;0;0;0.90315974;0;0.89342695
1663;0;0;0.89439964;0;0.899041
1664;0;0;0.8876083;0;0.89222497
1665;0;0;0.8866649;0;0.88153386
1666;0;0;0.8850015;0;0.8805269
1667;0;0;0.89345384;0;0.8815659
1668;0;0;0.92031455;0;0.89283216
1669;0;0;0.95816505;0;0.9317913
1670;0;0;1.0058571;0;0.9863478
1671;0;0;1.0851017;0;1.0435809
1672;0;0;1.1567655;0;1.1399695
1673;0;0;1.2392552;0;1.2180344
1674;0;0;1.3313222;0;1.3016516
1675;0;0;1.4495897;0;1.3888192
1676;0;0;1.5098655;0;1.5024157
1677;0;0;1.5345517;0;1.5507513
1678;0;0;1.543711;0;1.5623085
1679;0;0;1.5480332;0;1.5298892
1680;0;0;1.5520337;0;1.5207753
1681;0;0;1.552627;0;1.5210857
1682;0;0;1.545807;0;1.5234343
1683;0;0;1.5375543;0;1.529065
1684;0;0;1.5282956;0;1.530844
1685;0;0;1.5274152;0;1.5274483
1686;0;0;1.5295911;0;1.5307105
1687;0;0;1.5361241;0;1.5378776
1688;0;0;1.5426736;0;1.5547191
1689;0;0;1.5446476;0;1.566722
1690;0;0;1.5439184;0;1.5688342
1691;0;0;1.5443189;0;1.5618734
1692;0;0;1.5501534;0;1.5567528
1693;0;0;1.5533096;0;1.563421
1694;0;0;1.5506854;0;1.5694264
1695;0;0;1.5435958;0;1.5665945
1696;0;0;1.535209;0;1.5545645
1697;0;0;1.5331411;0;1.5398864
1698;0;0;1.5354971;0;1.5362704
1699;0;0;1.5413562;0;1.543697
1700;0;0;1.5461414;0;1.5591235
1701;0;0;1.5508455;0;1.5696447
1702;0;0;1.5593652;0;1.5752178
1703;0;0;1.5625904;0;1.5821788
1704;0;0;1.5526767;0;1.5826795
1705;0;0;1.5304686;0;1.5650879
1706;0;0;1.4859062;0;1.5287384
1707;0;0;1.4098287;0;1.4556504
1708;0;0;1.3427107;0;1.3488014
1709;0;0;1.2744616;0;1.2716467
1710;0;0;1.1869328;0;1.2040218
1711;0;0;1.1287842;0;1.1266065
1712;0;0;1.0774822;0;1.0765061
1713;0;0;1.034289;0;1.0383002
1714;0;0;0.9935824;0;1.0058782
1715;0;0;0.9756251;0;0.9669658
1716;0;0;0.96538156;0;0.95992124
1717;0;0;0.96053916;0;0.95241374
1718;0;0;0.95897347;0;0.9508486
1719;0;0;0.95531684;0;0.9571508
1720;0;0;0.95775944;0;0.9538345
1721;0;0;0.96361077;0;0.95306104
1722;0;0;0.97318864;0;0.959243
1723;0;0;1.0008979;0;0.97598696
1724;0;0;1.0317283;0;1.0123981
1725;0;0;1.077828;0;1.0545049
1726;0;0;1.1123983;0;1.1123672
1727;0;0;1.1422889;0;1.1446127
1728;0;0;1.1626749;0;1.1654133
1729;0;0;1.1778553;0;1.1688045
1730;0;0;1.1776528;0;1.1781
1731;0;0;1.1674407;0;1.1689357
1732;0;0;1.1390014;0;1.1473157
1733;0;0;1.1060194;0;1.1067611
1734;0;0;1.0563705;0;1.0618769
1735;0;0;1.0202696;0;1.003094
1736;0;0;0.98606855;0;0.97850937
1737;0;0;0.95432985;0;0.95998573
1738;0;0;0.93959737;0;0.93731576
1739;0;0;0.9267947;0;0.9291583
1740;0;0;0.92188287;0;0.9242271
1741;0;0;0.9264571;0;0.92446464
1742;0;0;0.93006927;0;0.9288053
1743;0;0;0.93483245;0;0.93759966
1744;0;0;0.94025815;0;0.93792444
1745;0;0;0.9511454;0;0.93819684
1746;0;0;0.97162914;0;0.95142066
1747;0;0;0.9932992;0;0.97600013
1748;0;0;1.0291655;0;1.004698
1749;0;0;1.0698528;0;1.049988
1750;0;0;1.122243;0;1.099481
1751;0;0;1.1648138;0;1.1599123
1752;0;0;1.221847;0;1.1983582
1753;0;0;1.2576846;0;1.2561291
1754;0;0;1.2889892;0;1.2845638
1755;0;0;1.3142692;0;1.3049511
1756;0;0;1.3260367;0;1.317081
1757;0;0;1.3246082;0;1.3245738
1758;0;0;1.2887199;0;1.3085397
1759;0;0;1.2456322;0;1.250774
1760;0;0;1.1893568;0;1.1966028
1761;0;0;1.1136612;0;1.1256177
1762;0;0;1.0547284;0;1.052005
1763;0;0;1.0030527;0;1.0000796
1764;0;0;0.9518319;0;0.96549183
1765;0;0;0.92710656;0;0.93244946
1766;0;0;0.91142;0;0.91310114
1767;0;0;0.9072046;0;0.9110797
1768;0;0;0.9125734;0;0.91305035
1769;0;0;0.9201145;0;0.91522336
1770;0;0;0.9299343;0;0.9313738
1771;0;0;0.9432067;0;0.9368938
1772;0;0;0.9561224;0;0.94535774
1773;0;0;0.96922046;0;0.96053684
1774;0;0;0.97405684;0;0.9701251
1775;0;0;0.9778493;0;0.96961594
1776;0;0;0.9741425;0;0.96864784
1777;0;0;0.95517504;0;0.9581202
1778;0;0;0.9398062;0;0.9301339
1779;0;0;0.92388326;0;0.90903413
1780;0;0;0.90985334;0;0.8970748
1781;0;0;0.8876542;0;0.89397275
1782;0;0;0.86051774;0;0.8729724
1783;0;0;0.8520522;0;0.84572065
1784;0;0;0.849996;0;0.8420775
1785;0;0;0.8670964;0;0.850262
1786;0;0;0.89562607;0;0.88517076
1787;0;0;0.93739086;0;0.92435604
1788;0;0;1.0006524;0;0.9752724
1789;0;0;1.05381;0;1.0481421
1790;0;0;1.1204861;0;1.1037152
1791;0;0;1.1789073;0;1.1668751
1792;0;0;1.2646794;0;1.2162962
1793;0;0;1.3179362;0;1.3120823
1794;0;0;1.3547299;0;1.3552884
1795;0;0;1.3613365;0;1.3794295
1796;0;0;1.3567944;0;1.3527681
1797;0;0;1.3388895;0;1.3341651
1798;0;0;1.2873583;0;1.3065853
1799;0;0;1.2333367;0;1.2335654
1800;0;0;1.1348839;0;1.1713821
1801;0;0;1.0621134;0;1.0476594
1802;0;0;1.0001277;0;0.98971176
1803;0;0;0.94600636;0;0.9401797
1804;0;0;0.92250746;0;0.9272197
1805;0;0;0.9148916;0;0.9187436
1806;0;0;0.91366076;0;0.92155975
1807;0;0;0.924965;0;0.9285331
1808;0;0;0.94243735;0;0.92767155
1809;0;0;0.96741456;0;0.95586926
1810;0;0;0.9846288;0;0.9813601
1811;0;0;0.99677664;0;0.9959474
1812;0;0;1.0025983;0;1.0012375
1813;0;0;1.0042831;0;0.9950031
1814;0;0;0.9976482;0;0.99050784
1815;0;0;0.98044056;0;0.9779461
1816;0;0;0.95453215;0;0.95323074
1817;0;0;0.9232977;0;0.9207054
1818;0;0;0.89916074;0;0.8868225
1819;0;0;0.8715714;0;0.87088186
1820;0;0;0.8658222;0;0.85351163
1821;0;0;0.89239806;0;0.8639289
1822;0;0;0.92823905;0;0.9136791
1823;0;0;0.97590315;0;0.9710948
1824;0;0;1.0473717;0;1.0242898
1825;0;0;1.100747;0;1.1050782
1826;0;0;1.1564963;0;1.1563864
1827;0;0;1.2069931;0;1.1943216
1828;0;0;1.2648325;0;1.2346501
1829;0;0;1.2958211;0;1.2939537
1830;0;0;1.3155276;0;1.3093715
1831;0;0;1.3117145;0;1.3171345
1832;0;0;1.2995383;0;1.2922138
1833;0;0;1.2673513;0;1.2650123
1834;0;0;1.2220346;0;1.2246826
1835;0;0;1.1558903;0;1.1712918
1836;0;0;1.0608647;0;1.0935045
1837;0;0;1.0069458;0;0.99059737
1838;0;0;0.95816654;0;0.9465137
1839;0;0;0.9199915;0;0.9231135
1840;0;0;0.9137246;0;0.91654277
1841;0;0;0.9197462;0;0.91685647
1842;0;0;0.9326892;0;0.9381111
1843;0;0;0.95457464;0;0.95177555
1844;0;0;0.9705088;0;0.9660972
1845;0;0;0.989884;0;0.9851865
1846;0;0;0.99782;0;0.9991214
1847;0;0;1.0020988;0;0.99417895
1848;0;0;1.0026513;0;0.99365854
1849;0;0;0.99647677;0;0.98682225
1850;0;0;0.97918785;0;0.97813463
1851;0;0;0.9595204;0;0.95396835
1852;0;0;0.9212319;0;0.9289759
1853;0;0;0.89392716;0;0.88655555
1854;0;0;0.8765053;0;0.86168253
1855;0;0;0.8766077;0;0.8579158
1856;0;0;0.8918821;0;0.88248163
1857;0;0;0.92356515;0;0.91321987
1858;0;0;0.98009723;0;0.95867693
1859;0;0;1.0322502;0;1.0290451
1860;0;0;1.1053232;0;1.0836083
1861;0;0;1.1559173;0;1.1616737
1862;0;0;1.2046442;0;1.1994662
1863;0;0;1.2415304;0;1.2385881
1864;0;0;1.2784765;0;1.2550623
1865;0;0;1.2900872;0;1.2873329
1866;0;0;1.2931355;0;1.2832817
1867;0;0;1.2803304;0;1.2715611
1868;0;0;1.2526245;0;1.2475684
1869;0;0;1.2080034;0;1.2103415
1870;0;0;1.1344243;0;1.1585507
1871;0;0;1.0780239;0;1.069052
1872;0;0;1.0058742;0;1.0174737
1873;0;0;0.974162;0;0.9536054
1874;0;0;0.9607917;0;0.94803196
1875;0;0;0.96791893;0;0.954863
1876;0;0;0.97920954;0;0.98971796
1877;0;0;0.9919664;0;0.99967283
1878;0;0;0.9989892;0;1.0063144
1879;0;0;1.0012592;0;1.0033947
1880;0;0;1.0005141;0;0.9915388
1881;0;0;0.9971692;0;0.9885505
1882;0;0;0.9913226;0;0.9806099
1883;0;0;0.98527175;0;0.9750314
1884;0;0;0.97916776;0;0.9694904
1885;0;0;0.9773668;0;0.96571153
1886;0;0;0.9702426;0;0.96735704
1887;0;0;0.9582206;0;0.96063286
1888;0;0;0.94661045;0;0.94546217
1889;0;0;0.943677;0;0.9299154
1890;0;0;0.9453346;0;0.93130225
1891;0;0;0.9554299;0;0.94119096
1892;0;0;0.97117335;0;0.9596487
1893;0;0;0.99741244;0;0.98201644
1894;0;0;1.0166339;0;1.0152655
1895;0;0;1.0360247;0;1.0324906
1896;0;0;1.054853;0;1.0461075
1897;0;0;1.0625367;0;1.0604519
1898;0;0;1.0657672;0;1.0629916
1899;0;0;1.0612757;0;1.0574688
1900;0;0;1.0514278;0;1.0445637
1901;0;0;1.0369512;0;1.0306319
1902;0;0;1.0111442;0;1.0101185
1903;0;0;0.9923207;0;0.9818926
1904;0;0;0.9743861;0;0.9647307
1905;0;0;0.95613337;0;0.9534654
1906;0;0;0.9457761;0;0.9450456
1907;0;0;0.9340275;0;0.93856347
1908;0;0;0.92459863;0;0.9304439
1909;0;0;0.92369896;0;0.9211983
1910;0;0;0.92516404;0;0.91970044
1911;0;0;0.92645836;0;0.927889
1912;0;0;0.92421675;0;0.9292778
1913;0;0;0.9220405;0;0.92086184
1914;0;0;0.92071056;0;0.9148041
1915;0;0;0.91993153;0;0.9097826
1916;0;0;0.9227026;0;0.90953904
1917;0;0;0.92555475;0;0.9157048
1918;0;0;0.928796;0;0.9207993
1919;0;0;0.9303084;0;0.9246227
1920;0;0;0.93062586;0;0.92360836
1921;0;0;0.9297945;0;0.92199284
1922;0;0;0.92766047;0;0.9188251
1923;0;0;0.9228122;0;0.915381
1924;0;0;0.9177289;0;0.9094208
1925;0;0;0.91116154;0;0.90395045
1926;0;0;0.9021645;0;0.8979284
1927;0;0;0.89355266;0;0.8890552
1928;0;0;0.89426297;0;0.8807357
1929;0;0;0.89944077;0;0.88680005
1930;0;0;0.90225434;0;0.8998424
1931;0;0;0.9041987;0;0.9053281
1932;0;0;0.90811455;0;0.90350676
1933;0;0;0.90621895;0;0.90354246
1934;0;0;0.90652823;0;0.89695865
1935;0;0;0.91032887;0;0.8941776
1936;0;0;0.91493994;0;0.90032065
1937;0;0;0.9203847;0;0.9096773
1938;0;0;0.9264648;0;0.9158311
1939;0;0;0.93315554;0;0.9226482
1940;0;0;0.9373314;0;0.9300121
1941;0;0;0.941265;0;0.9312173
1942;0;0;0.944379;0;0.9336081
1943;0;0;0.9454975;0;0.93569916
1944;0;0;0.94593346;0;0.9358898
1945;0;0;0.9449556;0;0.9351705
1946;0;0;0.94335145;0;0.93368626
1947;0;0;0.945556;0;0.9320658
1948;0;0;0.959287;0;0.9358853
1949;0;0;0.9705277;0;0.95827746
1950;0;0;0.98330617;0;0.9757547
1951;0;0;0.9906539;0;0.9894625
1952;0;0;1.0000669;0;0.99112797
1953;0;0;1.0082613;0;0.99754107
1954;0;0;1.0100082;0;1.0021571
1955;0;0;1.0111254;0;1.0017717
1956;0;0;1.0143148;0;1.000635
1957;0;0;1.0178221;0;1.0038692
1958;0;0;1.0213102;0;1.0111396
1959;0;0;1.0266451;0;1.015538
1960;0;0;1.0299501;0;1.0235074
1961;0;0;1.0332819;0;1.0271497
1962;0;0;1.0396588;0;1.0286095
1963;0;0;1.0436552;0;1.0355139
1964;0;0;1.0494179;0;1.0406668
1965;0;0;1.0621351;0;1.0465429
1966;0;0;1.0769655;0;1.0626062
1967;0;0;1.0993096;0;1.0834565
1968;0;0;1.1538168;0;1.1113689
1969;0;0;1.1998905;0;1.1867682
1970;0;0;1.2491456;0;1.2460309
1971;0;0;1.3278193;0;1.2951686
1972;0;0;1.3875535;0;1.3759775
1973;0;0;1.4394425;0;1.4390814
1974;0;0;1.5081952;0;1.4760809
1975;0;0;1.5548486;0;1.5416248
1976;0;0;1.595583;0;1.5881062
1977;0;0;1.6412306;0;1.6234108
1978;0;0;1.6634054;0;1.6537048
1979;0;0;1.6770622;0;1.676591
1980;0;0;1.6764729;0;1.6776912
1981;0;0;1.6653774;0;1.6666025
1982;0;0;1.6454144;0;1.6559504
1983;0;0;1.6007197;0;1.635036
1984;0;0;1.5526564;0;1.5856066
1985;0;0;1.4915721;0;1.5193416
1986;0;0;1.4020472;0;1.4283582
1987;0;0;1.3371426;0;1.3281358
1988;0;0;1.2696446;0;1.2650002
1989;0;0;1.1882954;0;1.1993932
1990;0;0;1.1451323;0;1.1349655
1991;0;0;1.1092236;0;1.1007558
1992;0;0;1.0617303;0;1.078149
1993;0;0;1.0299745;0;1.0316966
1994;0;0;1.0034714;0;0.99461883
1995;0;0;0.9817468;0;0.9773694
1996;0;0;0.95998895;0;0.95933604
1997;0;0;0.94871473;0;0.93371236
1998;0;0;0.9372987;0;0.9367614
1999;0;0;0.93179035;0;0.9308997
2000;0;0;0.9283407;0;0.925803
2001;0;0;0.925406;0;0.9258558
2002;0;0;0.9212403;0;0.9245974
2003;0;0;0.91693735;0;0.91785574
2004;0;0;0.9075769;0;0.9096292
2005;0;0;0.90580326;0;0.89734644
2006;0;0;0.90994865;0;0.8949074
2007;0;0;0.91403306;0;0.90512854
2008;0;0;0.916291;0;0.91506636
2009;0;0;0.92190135;0;0.91559273
2010;0;0;0.9241941;0;0.91875494
2011;0;0;0.92428267;0;0.91857433
2012;0;0;0.92468387;0;0.9142732
2013;0;0;0.9271806;0;0.9129032
2014;0;0;0.93115383;0;0.9176609
2015;0;0;0.93731683;0;0.92384714
2016;0;0;0.9447634;0;0.9326183
2017;0;0;0.94941884;0;0.9429421
2018;0;0;0.95295006;0;0.9463005
2019;0;0;0.954041;0;0.94666
2020;0;0;0.9534349;0;0.944451
2021;0;0;0.951119;0;0.94190425
2022;0;0;0.945834;0;0.9377608
2023;0;0;0.9402432;0;0.93146884
2024;0;0;0.93423647;0;0.92535967
2025;0;0;0.9301076;0;0.9197714
2026;0;0;0.9282694;0;0.91874677
2027;0;0;0.92836565;0;0.9200514
2028;0;0;0.9323865;0;0.9234514
2029;0;0;0.93534833;0;0.9300317
2030;0;0;0.9388268;0;0.9329858
2031;0;0;0.94478226;0;0.935191
2032;0;0;0.94917035;0;0.9402607
2033;0;0;0.9536611;0;0.944691
2034;0;0;0.95965624;0;0.9480704
2035;0;0;0.96315277;0;0.9538386
2036;0;0;0.9647704;0;0.9576354
2037;0;0;0.96475214;0;0.9566853
2038;0;0;0.96347016;0;0.9542569
2039;0;0;0.9622475;0;0.9522601
2040;0;0;0.9611889;0;0.9503715
2041;0;0;0.9599642;0;0.950415
2042;0;0;0.95886356;0;0.9507177
2043;0;0;0.95718056;0;0.9499529
2044;0;0;0.9553601;0;0.94825727
2045;0;0;0.9532614;0;0.94606954
2046;0;0;0.9504808;0;0.94344795
2047;0;0;0.94728976;0;0.9403531
2048;0;0;0.94418913;0;0.93663347
2049;0;0;0.93842316;0;0.93337166
2050;0;0;0.93346846;0;0.927101
2051;0;0;0.9318827;0;0.92174464
2052;0;0;0.93188614;0;0.9220068
2053;0;0;0.9309947;0;0.9255917
2054;0;0;0.92949426;0;0.9257745
2055;0;0;0.9303404;0;0.9229879
2056;0;0;0.9330031;0;0.92323047
2057;0;0;0.9347924;0;0.9261458
2058;0;0;0.9448324;0;0.92859685
2059;0;0;0.95562696;0;0.9423846
2060;0;0;0.9596639;0;0.95721835
2061;0;0;0.9687589;0;0.95935893
2062;0;0;0.9776986;0;0.9646574
2063;0;0;0.9869071;0;0.9742345
2064;0;0;1.0029771;0;0.98495334
2065;0;0;1.0166582;0;1.0028317
2066;0;0;1.0320318;0;1.0214884
2067;0;0;1.0585393;0;1.0376545
2068;0;0;1.0822504;0;1.0678686
2069;0;0;1.1079019;0;1.0988868
2070;0;0;1.1497469;0;1.1256946
2071;0;0;1.1855078;0;1.1716771
2072;0;0;1.2235785;0;1.2131448
2073;0;0;1.2782739;0;1.2482827
2074;0;0;1.3186615;0;1.3077878
2075;0;0;1.3568711;0;1.3516197
2076;0;0;1.3955598;0;1.3829273
2077;0;0;1.440111;0;1.4124287
2078;0;0;1.468927;0;1.4600817
2079;0;0;1.4976523;0;1.4879687
2080;0;0;1.5287538;0;1.5156342
2081;0;0;1.5456498;0;1.5506606
2082;0;0;1.5617437;0;1.558104
2083;0;0;1.568914;0;1.5642568
2084;0;0;1.5769966;0;1.5673103
2085;0;0;1.5860637;0;1.5793855
2086;0;0;1.6086227;0;1.5931051
2087;0;0;1.6326877;0;1.6290067
2088;0;0;1.6560421;0;1.6598127
2089;0;0;1.6892785;0;1.6865612
2090;0;0;1.7152056;0;1.717718
2091;0;0;1.7370056;0;1.7437279
2092;0;0;1.7649045;0;1.7606432
2093;0;0;1.7837508;0;1.781681
2094;0;0;1.7968421;0;1.8010529
2095;0;0;1.8114796;0;1.811489
2096;0;0;1.8174559;0;1.8222245
2097;0;0;1.8165131;0;1.8306899
2098;0;0;1.8112967;0;1.8285323
2099;0;0;1.8062615;0;1.8211254
2100;0;0;1.7993243;0;1.8168161
2101;0;0;1.7908547;0;1.810009
2102;0;0;1.7867805;0;1.8014402
2103;0;0;1.7833415;0;1.7969444
2104;0;0;1.7814112;0;1.793804
2105;0;0;1.7795246;0;1.7912122
2106;0;0;1.7780238;0;1.788767
2107;0;0;1.778187;0;1.7885213
2108;0;0;1.7796774;0;1.7885901
2109;0;0;1.7800474;0;1.7907267
2110;0;0;1.7794132;0;1.7918681
2111;0;0;1.7788126;0;1.7915372
2112;0;0;1.7760975;0;1.7909156
2113;0;0;1.7735136;0;1.7882364
2114;0;0;1.7699163;0;1.7851568
2115;0;0;1.7660177;0;1.7814496
2116;0;0;1.7596292;0;1.7779211
2117;0;0;1.7538388;0;1.7709599
2118;0;0;1.7448659;0;1.7647853
2119;0;0;1.7362252;0;1.7553475
2120;0;0;1.7238241;0;1.7455984
2121;0;0;1.7018361;0;1.7305309
2122;0;0;1.6807091;0;1.7033154
2123;0;0;1.6529151;0;1.6750287
2124;0;0;1.6196638;0;1.6400485
2125;0;0;1.5671527;0;1.5970955
2126;0;0;1.5210948;0;1.52166
2127;0;0;1.449547;0;1.4646252
2128;0;0;1.3929707;0;1.384781
2129;0;0;1.3306084;0;1.3282738
2130;0;0;1.2394071;0;1.2639372
2131;0;0;1.1737419;0;1.1697925
2132;0;0;1.1112103;0;1.1099398
2133;0;0;1.030479;0;1.0518351
2134;0;0;0.9784442;0;0.9804022
2135;0;0;0.93322873;0;0.9318848
2136;0;0;0.8987571;0;0.910149
2137;0;0;0.8738629;0;0.8901797
2138;0;0;0.86852986;0;0.85657364
2139;0;0;0.8692014;0;0.86930794
2140;0;0;0.8695697;0;0.8753526
2141;0;0;0.87075347;0;0.87394375
2142;0;0;0.87097526;0;0.8751903
2143;0;0;0.8690338;0;0.86952245
2144;0;0;0.86719584;0;0.8634917
2145;0;0;0.8642883;0;0.85653985
2146;0;0;0.86453056;0;0.8546334
2147;0;0;0.86723465;0;0.856596
2148;0;0;0.875624;0;0.8619141
2149;0;0;0.8909917;0;0.87530184
2150;0;0;0.9046581;0;0.89547014
2151;0;0;0.92630947;0;0.9105622
2152;0;0;0.94669807;0;0.9344798
2153;0;0;0.9678449;0;0.9548054
2154;0;0;0.99172497;0;0.97619045
2155;0;0;1.0251613;0;0.9992659
2156;0;0;1.0526825;0;1.0409014
2157;0;0;1.0967883;0;1.0712905
2158;0;0;1.1318524;0;1.1185358
2159;0;0;1.1668391;0;1.1545973
2160;0;0;1.2060186;0;1.1875508
2161;0;0;1.2609531;0;1.2226989
2162;0;0;1.3015945;0;1.2871372
2163;0;0;1.356092;0;1.3298643
2164;0;0;1.3943852;0;1.3863757
2165;0;0;1.4270236;0;1.419127
2166;0;0;1.4670453;0;1.4433658
2167;0;0;1.494253;0;1.4823155
2168;0;0;1.5174656;0;1.5105245
2169;0;0;1.5448682;0;1.5351359
2170;0;0;1.5594916;0;1.5578419
2171;0;0;1.5707865;0;1.568046
2172;0;0;1.5829177;0;1.5745418
2173;0;0;1.5860541;0;1.5862515
2174;0;0;1.5857658;0;1.5945705
2175;0;0;1.578831;0;1.59399
2176;0;0;1.5693158;0;1.5842499
2177;0;0;1.5565013;0;1.5738624
2178;0;0;1.5319823;0;1.558617
2179;0;0;1.5060745;0;1.5223494
2180;0;0;1.478672;0;1.4827247
2181;0;0;1.4448335;0;1.4451834
2182;0;0;1.3934411;0;1.4108586
2183;0;0;1.3521539;0;1.3546853
2184;0;0;1.2894893;0;1.3120766
2185;0;0;1.2451769;0;1.2357454
2186;0;0;1.2008224;0;1.1972558
2187;0;0;1.1377447;0;1.1560202
2188;0;0;1.0947266;0;1.095708
2189;0;0;1.0529056;0;1.048687
2190;0;0;1.0043995;0;1.0139005
2191;0;0;0.97479457;0;0.98145527
2192;0;0;0.9491332;0;0.94422436
2193;0;0;0.9243749;0;0.9328956
2194;0;0;0.9131123;0;0.91143864
2195;0;0;0.9090643;0;0.89734274
2196;0;0;0.9093475;0;0.90836567
2197;0;0;0.9132751;0;0.914938
2198;0;0;0.9176854;0;0.9161265
2199;0;0;0.92179954;0;0.923181
2200;0;0;0.9266562;0;0.9228745
2201;0;0;0.92854756;0;0.921411
2202;0;0;0.9292687;0;0.9215902
2203;0;0;0.9285328;0;0.91951346
2204;0;0;0.92422086;0;0.9165452
2205;0;0;0.9174778;0;0.91071284
2206;0;0;0.90596026;0;0.9015473
2207;0;0;0.90183884;0;0.8882039
2208;0;0;0.90106696;0;0.88754106
2209;0;0;0.90340114;0;0.89306664
2210;0;0;0.9080816;0;0.9027878
2211;0;0;0.91749054;0;0.90950555
2212;0;0;0.93379045;0;0.9203904
2213;0;0;0.9487479;0;0.93892443
2214;0;0;0.96931535;0;0.954734
2215;0;0;0.985573;0;0.97752386
2216;0;0;0.99800134;0;0.9915612
2217;0;0;1.0087364;0;1.0001471
2218;0;0;1.0179003;0;1.0049789
2219;0;0;1.0210752;0;1.0131615
2220;0;0;1.0208493;0;1.0137627
2221;0;0;1.0171387;0;1.0085642
2222;0;0;1.0117992;0;1.0020163
2223;0;0;1.0027305;0;0.99582964
2224;0;0;0.9952132;0;0.9854526
2225;0;0;0.98853225;0;0.97936743
2226;0;0;0.98151696;0;0.97536004
2227;0;0;0.97894806;0;0.9705134
2228;0;0;0.98003256;0;0.9705111
2229;0;0;0.9855752;0;0.97572714
2230;0;0;1.0001;0;0.98603654
2231;0;0;1.013848;0;1.0058157
2232;0;0;1.0324222;0;1.0233867
2233;0;0;1.0479629;0;1.0431195
2234;0;0;1.0637608;0;1.0553489
2235;0;0;1.0765374;0;1.0698559
2236;0;0;1.0829903;0;1.0787783
2237;0;0;1.079268;0;1.0813932
2238;0;0;1.0657922;0;1.069048
2239;0;0;1.0505837;0;1.0437573
2240;0;0;1.0340894;0;1.0224675
2241;0;0;1.0107707;0;1.006861
2242;0;0;0.9924528;0;0.98552823
2243;0;0;0.97645545;0;0.9712354
2244;0;0;0.9609609;0;0.96260035
2245;0;0;0.944145;0;0.95229506
2246;0;0;0.9356705;0;0.9337394
2247;0;0;0.9287858;0;0.92862165
2248;0;0;0.92583436;0;0.92521864
2249;0;0;0.9232632;0;0.92434824
2250;0;0;0.91803133;0;0.9229639
2251;0;0;0.9113772;0;0.9158618
2252;0;0;0.90854686;0;0.9035895
2253;0;0;0.90681005;0;0.89845693
2254;0;0;0.90043175;0;0.899746
2255;0;0;0.89655274;0;0.89285547
2256;0;0;0.8828558;0;0.8880724
2257;0;0;0.8741009;0;0.87043434
2258;0;0;0.87099427;0;0.8601961
2259;0;0;0.8710321;0;0.8598867
2260;0;0;0.8814784;0;0.8694868
2261;0;0;0.89727366;0;0.88672936
2262;0;0;0.9266097;0;0.90781796
2263;0;0;0.9531237;0;0.9450433
2264;0;0;0.9790526;0;0.97209215
2265;0;0;1.0059155;0;0.9961696
2266;0;0;1.0398413;0;1.0179896
2267;0;0;1.0595086;0;1.0558096
2268;0;0;1.0783467;0;1.0716906
2269;0;0;1.0856478;0;1.0816627
2270;0;0;1.0853345;0;1.0805703
2271;0;0;1.0742716;0;1.073625
2272;0;0;1.0575565;0;1.0510899
2273;0;0;1.0393798;0;1.0275747
2274;0;0;1.0122067;0;1.008076
2275;0;0;0.9880382;0;0.98083407
2276;0;0;0.9672277;0;0.96202236
2277;0;0;0.94994646;0;0.94800395
2278;0;0;0.9376989;0;0.9399666
2279;0;0;0.93488556;0;0.93129694
2280;0;0;0.93910205;0;0.9352086
2281;0;0;0.94607776;0;0.9460321
2282;0;0;0.95670694;0;0.95403326
2283;0;0;0.9724911;0;0.964925
2284;0;0;0.98430204;0;0.98051655
2285;0;0;0.9956398;0;0.98971575
2286;0;0;1.0086181;0;0.996402
2287;0;0;1.0132108;0;1.0073317
2288;0;0;1.0144027;0;1.0090761
2289;0;0;1.012166;0;1.0039351
2290;0;0;1.0082976;0;0.9967046
2291;0;0;1.0009938;0;0.9931841
2292;0;0;0.9832478;0;0.983815
2293;0;0;0.9677498;0;0.9621339
2294;0;0;0.95575184;0;0.9444992
2295;0;0;0.94482434;0;0.9357108
2296;0;0;0.93456;0;0.933356
2297;0;0;0.92906404;0;0.9270873
2298;0;0;0.9263839;0;0.92556685
2299;0;0;0.929611;0;0.9258295
2300;0;0;0.93610233;0;0.9303088
2301;0;0;0.94594955;0;0.93901867
2302;0;0;0.96333545;0;0.9501428
2303;0;0;0.97803605;0;0.970157
2304;0;0;1.0008857;0;0.9855167
2305;0;0;1.019743;0;1.0104401
2306;0;0;1.0359002;0;1.0278654
2307;0;0;1.0522962;0;1.0433064
2308;0;0;1.0591422;0;1.0551918
2309;0;0;1.0594438;0;1.0580751
2310;0;0;1.0515242;0;1.0504001
2311;0;0;1.031686;0;1.0317422
2312;0;0;1.0121737;0;1.003971
2313;0;0;0.97874755;0;0.9793047
2314;0;0;0.9553043;0;0.9429527
2315;0;0;0.93575203;0;0.927677
2316;0;0;0.91294336;0;0.9179605
2317;0;0;0.9066516;0;0.9052619
2318;0;0;0.9065373;0;0.9035874
2319;0;0;0.912164;0;0.9112801
2320;0;0;0.91938835;0;0.92446816
2321;0;0;0.927405;0;0.9268141
2322;0;0;0.9395518;0;0.9350659
2323;0;0;0.9479762;0;0.9423661
2324;0;0;0.95458686;0;0.94622475
2325;0;0;0.96132267;0;0.95084524
2326;0;0;0.963834;0;0.9541619
2327;0;0;0.9639119;0;0.9553125
2328;0;0;0.9618111;0;0.95205957
2329;0;0;0.95936674;0;0.9476029
2330;0;0;0.95642596;0;0.94611186
2331;0;0;0.9524877;0;0.94316345
2332;0;0;0.94586504;0;0.94022226
2333;0;0;0.9405245;0;0.93315154
2334;0;0;0.9329929;0;0.9277012
2335;0;0;0.9306446;0;0.9204896
2336;0;0;0.93073916;0;0.9208887
2337;0;0;0.93360424;0;0.92472076
2338;0;0;0.9387406;0;0.93186104
2339;0;0;0.946867;0;0.9379322
2340;0;0;0.9615941;0;0.9470847
2341;0;0;0.9757548;0;0.9652778
2342;0;0;0.9898898;0;0.9808741
2343;0;0;1.0027467;0;0.9950047
2344;0;0;1.0156771;0;1.004483
2345;0;0;1.0207504;0;1.0159645
2346;0;0;1.0205327;0;1.0162867
2347;0;0;1.0154644;0;1.0094876
2348;0;0;1.0067204;0;0.99837464
2349;0;0;0.99552923;0;0.98650396
2350;0;0;0.9775324;0;0.97407216
2351;0;0;0.96296716;0;0.95448273
2352;0;0;0.9454395;0;0.9421296
2353;0;0;0.93350106;0;0.92749155
2354;0;0;0.92419523;0;0.9220214
2355;0;0;0.91652536;0;0.91744536
2356;0;0;0.91392934;0;0.9148667
2357;0;0;0.9138943;0;0.91387427
2358;0;0;0.9157169;0;0.9147404
2359;0;0;0.9187229;0;0.917606
2360;0;0;0.92078567;0;0.91764665
2361;0;0;0.922168;0;0.9178332
2362;0;0;0.9219926;0;0.9157259
2363;0;0;0.92107314;0;0.9122931
2364;0;0;0.9193045;0;0.91014856
2365;0;0;0.91824377;0;0.9073489
2366;0;0;0.9179404;0;0.9071278
2367;0;0;0.9192108;0;0.9084685
2368;0;0;0.9219979;0;0.91167516
2369;0;0;0.92595387;0;0.916196
2370;0;0;0.93259615;0;0.92116094
2371;0;0;0.9388911;0;0.9292079
2372;0;0;0.9452899;0;0.936011
2373;0;0;0.9529599;0;0.9420172
2374;0;0;0.9578817;0;0.949024
2375;0;0;0.9613461;0;0.95293766
2376;0;0;0.9637159;0;0.95404273
2377;0;0;0.96342754;0;0.9542353
2378;0;0;0.96088433;0;0.95291793
2379;0;0;0.955034;0;0.94811445
2380;0;0;0.9493959;0;0.94005495
2381;0;0;0.9434315;0;0.9341401
2382;0;0;0.9361077;0;0.92849225
2383;0;0;0.9311646;0;0.92318463
2384;0;0;0.9270294;0;0.9203863
2385;0;0;0.9236273;0;0.91865534
2386;0;0;0.91998625;0;0.9172295
2387;0;0;0.9182232;0;0.91310924
2388;0;0;0.9168314;0;0.9118792
2389;0;0;0.9164374;0;0.9105716
2390;0;0;0.9163242;0;0.91017747
2391;0;0;0.916392;0;0.91007966
2392;0;0;0.91662693;0;0.9098226
2393;0;0;0.9168648;0;0.90935624
2394;0;0;0.917393;0;0.9088738
