"Index";"Time";"TC"
1;2.46484375;00:00:02:55;0.2843379974;0.673134923;-0.2540927231;-0;0;-0;0;0;0;1
2;2.47265625;00:00:02:56;0.2842045724;0.6732027531;-0.2541405857;-0;0;-0;0;0;0;1
3;2.48046875;00:00:02:57;0.2840785682;0.6732752323;-0.2542054951;-0;0;-0;0;0;0;1
4;2.4921875;00:00:02:59;0.2839556634;0.6733550429;-0.2542503774;-0;0;-0;0;0;0;1
5;2.5;00:00:02:60;0.2838104963;0.6734475493;-0.2542946637;-0;0;-0;0;0;0;1
6;2.5078125;00:00:02:60;0.2836550474;0.6735376716;-0.254337877;-0;0;-0;0;0;0;1
7;2.515625;00:00:02:61;0.2835151553;0.6736356616;-0.2543894947;-0;0;-0;0;0;0;1
8;2.5234375;00:00:02:62;0.2832080424;0.6737525463;-0.2544002831;-0;0;-0;0;0;0;1
9;2.53125;00:00:02:63;0.283095628;0.6738286018;-0.2544342875;-0;0;-0;0;0;0;1
10;2.5390625;00:00:02:64;0.2829806209;0.6739067435;-0.2544444203;-0;0;-0;0;0;0;1
11;2.546875;00:00:02:65;0.2828733027;0.6739791036;-0.2544623017;-0;0;-0;0;0;0;1
12;2.55859375;00:00:02:67;0.2827988267;0.6740324497;-0.2544855177;-0;0;-0;0;0;0;1
13;2.56640625;00:00:02:67;0.282913655;0.6740421653;-0.2545227706;-0;0;-0;0;0;0;1
14;2.57421875;00:00:02:68;0.2828362584;0.6740934849;-0.2545302212;-0;0;-0;0;0;0;1
15;2.58203125;00:00:02:69;0.2827727199;0.6741501689;-0.2545512021;-0;0;-0;0;0;0;1
16;2.58984375;00:00:02:70;0.2827010751;0.674218595;-0.2545775175;-0;0;-0;0;0;0;1
17;2.59765625;00:00:02:71;0.2826455832;0.6742764115;-0.2546006739;-0;0;-0;0;0;0;1
18;2.60546875;00:00:02:72;0.2825892866;0.6743510365;-0.2546293736;-0;0;-0;0;0;0;1
19;2.6171875;00:00:02:74;0.2825495005;0.6744046807;-0.254638195;-0;0;-0;0;0;0;1
20;2.625;00:00:02:75;0.282522887;0.6744593978;-0.2546530962;-0;0;-0;0;0;0;1
21;2.6328125;00:00:02:75;0.2825111151;0.6745055914;-0.2546718419;-0;0;-0;0;0;0;1
22;2.640625;00:00:02:76;0.2825075984;0.6745451093;-0.2546932101;-0;0;-0;0;0;0;1
23;2.6484375;00:00:02:77;0.2825190425;0.6745830178;-0.2547229826;-0;0;-0;0;0;0;1
24;2.65625;00:00:02:78;0.2825346887;0.6746129394;-0.2547599077;-0;0;-0;0;0;0;1
25;2.6640625;00:00:02:79;0.2825430632;0.6746357679;-0.2547788322;-0;0;-0;0;0;0;1
26;2.671875;00:00:02:80;0.282548815;0.674659133;-0.2547959089;-0;0;-0;0;0;0;1
27;2.68359375;00:00:02:82;0.2825472057;0.6746734381;-0.2548092008;-0;0;-0;0;0;0;1
28;2.69140625;00:00:02:82;0.2825618982;0.6746820807;-0.2548449337;-0;0;-0;0;0;0;1
29;2.69921875;00:00:02:83;0.2825801969;0.6746797562;-0.2548782527;-0;0;-0;0;0;0;1
30;2.70703125;00:00:02:84;0.282595247;0.6746688485;-0.2549038231;-0;0;-0;0;0;0;1
31;2.71484375;00:00:02:85;0.2826170921;0.674665153;-0.2549196184;-0;0;-0;0;0;0;1
32;2.72265625;00:00:02:86;0.2824469209;0.6746692061;-0.2548902929;-0;0;-0;0;0;0;1
33;2.73046875;00:00:02:87;0.2824734747;0.674644351;-0.2549166381;-0;0;-0;0;0;0;1
34;2.7421875;00:00:02:89;0.2825015187;0.6746261716;-0.2549495995;-0;0;-0;0;0;0;1
35;2.75;00:00:02:90;0.2825170457;0.674610734;-0.2549867928;-0;0;-0;0;0;0;1
36;2.7578125;00:00:02:90;0.2825253904;0.6746090651;-0.2550244927;-0;0;-0;0;0;0;1
37;2.765625;00:00:02:91;0.2825499177;0.6746120453;-0.2550551295;-0;0;-0;0;0;0;1
38;2.7734375;00:00:02:92;0.2825829983;0.6746162176;-0.2550722957;-0;0;-0;0;0;0;1
39;2.78125;00:00:02:93;0.2826292813;0.6746118069;-0.2550812364;-0;0;-0;0;0;0;1
40;2.7890625;00:00:02:94;0.2826783955;0.6746001244;-0.2550970316;-0;0;-0;0;0;0;1
41;2.796875;00:00:02:95;0.2827188671;0.6745995283;-0.2551107109;-0;0;-0;0;0;0;1
42;2.80859375;00:00:02:97;0.2827604115;0.6746000051;-0.2551296353;-0;0;-0;0;0;0;1
43;2.81640625;00:00:02:97;0.2827819586;0.6746066213;-0.2551444471;-0;0;-0;0;0;0;1
44;2.82421875;00:00:02:98;0.2827988267;0.6746118069;-0.2551612556;-0;0;-0;0;0;0;1
45;2.83203125;00:00:02:99;0.2828227282;0.6746061444;-0.2551698387;-0;0;-0;0;0;0;1
46;2.83984375;00:00:02:100;0.2828399539;0.6746041179;-0.2551781237;-0;0;-0;0;0;0;1
47;2.84765625;00:00:02:101;0.2828674316;0.6746015549;-0.255186677;-0;0;-0;0;0;0;1
48;2.85546875;00:00:02:102;0.2828863561;0.6745993495;-0.2551937699;-0;0;-0;0;0;0;1
49;2.8671875;00:00:02:104;0.2828904092;0.6745947599;-0.2552041113;-0;0;-0;0;0;0;1
50;2.875;00:00:02:105;0.2829048634;0.6745952368;-0.2552216649;-0;0;-0;0;0;0;1
51;2.8828125;00:00:02:105;0.2829060256;0.6745994091;-0.2552499473;-0;0;-0;0;0;0;1
52;2.890625;00:00:02:106;0.2828901708;0.6746070385;-0.2552790046;-0;0;-0;0;0;0;1
53;2.8984375;00:00:02:107;-0.2593648732;0.07926782221;-0.2091700882;-0;0;-0;0;0;0;1
54;2.90625;00:00:02:108;0.282876879;0.6746044159;-0.2553106248;-0;0;-0;0;0;0;1
55;2.9140625;00:00:02:109;0.2828532457;0.6746135354;-0.2553504109;-0;0;-0;0;0;0;1
56;2.921875;00:00:02:110;0.2828163803;0.6746401191;-0.2554193437;-0;0;-0;0;0;0;1
57;2.93359375;00:00:02:112;0.2827604115;0.6746735573;-0.2554991245;-0;0;-0;0;0;0;1
58;2.94140625;00:00:02:112;0.2827099562;0.6747050881;-0.2555811107;-0;0;-0;0;0;0;1
59;2.94921875;00:00:02:113;0.282678932;0.6747246981;-0.2556564212;-0;0;-0;0;0;0;1
60;2.95703125;00:00:02:114;0.2826571465;0.6747339368;-0.2557496428;-0;0;-0;0;0;0;1
61;2.96484375;00:00:02:115;0.2826331258;0.6747439504;-0.2558381259;-0;0;-0;0;0;0;1
62;2.97265625;00:00:02:116;0.2825975716;0.6747658253;-0.2559375465;-0;0;-0;0;0;0;1
63;2.98046875;00:00:02:117;0.282543391;0.6748001575;-0.2560448349;-0;0;-0;0;0;0;1
64;2.9921875;00:00:02:119;0.2824804485;0.6748342514;-0.2561624944;-0;0;-0;0;0;0;1
65;3;00:00:03:00;0.2824062407;0.6748774648;-0.2562912107;-0;0;-0;0;0;0;1
66;3.0078125;00:00:03:00;0.2823427618;0.6748942733;-0.2564182281;-0;0;-0;0;0;0;1
67;3.015625;00:00:03:01;0.282268554;0.6749183536;-0.2565416396;-0;0;-0;0;0;0;1
68;3.0234375;00:00:03:02;0.282184422;0.674943924;-0.2566543519;-0;0;-0;0;0;0;1
69;3.03125;00:00:03:03;0.2820841074;0.6749694347;-0.2567854226;-0;0;-0;0;0;0;1
70;3.0390625;00:00:03:04;0.2819886506;0.674988687;-0.2569159865;-0;0;-0;0;0;0;1
71;3.046875;00:00:03:05;0.2818997502;0.6749998331;-0.2570617795;-0;0;-0;0;0;0;1
72;3.05859375;00:00:03:07;0.2818125188;0.6750161052;-0.2572053671;-0;0;-0;0;0;0;1
73;3.06640625;00:00:03:07;0.2817012072;0.6750507951;-0.2573396564;-0;0;-0;0;0;0;1
74;3.07421875;00:00:03:08;0.2816033065;0.6750923395;-0.2574788332;-0;0;-0;0;0;0;1
75;3.08203125;00:00:03:09;0.2814983726;0.6751353145;-0.2576152682;-0;0;-0;0;0;0;1
76;3.08984375;00:00:03:10;0.2813962996;0.6751816273;-0.2577308118;-0;0;-0;0;0;0;1
77;3.09765625;00:00:03:11;0.2813027799;0.6752299666;-0.2578470707;-0;0;-0;0;0;0;1
78;3.10546875;00:00:03:12;0.2812246978;0.675273478;-0.2579635382;-0;0;-0;0;0;0;1
79;3.1171875;00:00:03:14;0.2811596692;0.6753124595;-0.2580704987;-0;0;-0;0;0;0;1
80;3.125;00:00:03:15;0.2810882628;0.6753588319;-0.2581538558;-0;0;-0;0;0;0;1
81;3.1328125;00:00:03:15;0.2810307741;0.6754143238;-0.2582212687;-0;0;-0;0;0;0;1
82;3.140625;00:00:03:16;0.2809732258;0.6754611731;-0.2582782209;-0;0;-0;0;0;0;1
83;3.1484375;00:00:03:17;0.2809308767;0.6755028963;-0.2583317161;-0;0;-0;0;0;0;1
84;3.15625;00:00:03:18;0.2808828056;0.6755466461;-0.2583703399;-0;0;-0;0;0;0;1
85;3.1640625;00:00:03:19;0.2808255851;0.6755959988;-0.2584049106;-0;0;-0;0;0;0;1
86;3.171875;00:00:03:20;0.2807780206;0.6756481528;-0.2584353387;-0;0;-0;0;0;0;1
87;3.18359375;00:00:03:22;0.2807152271;0.67570889;-0.2584685087;-0;0;-0;0;0;0;1
88;3.19140625;00:00:03:22;0.280654937;0.6757573485;-0.2584725618;-0;0;-0;0;0;0;1
89;3.19921875;00:00:03:23;0.2806117833;0.6758045554;-0.2584826946;-0;0;-0;0;0;0;1
90;3.20703125;00:00:03:24;0.2805546224;0.6758480668;-0.2584819794;-0;0;-0;0;0;0;1
91;3.21484375;00:00:03:25;0.2805005014;0.6758953333;-0.2584876418;-0;0;-0;0;0;0;1
92;3.22265625;00:00:03:26;0.2804480791;0.6759419441;-0.2584984303;-0;0;-0;0;0;0;1
93;3.23046875;00:00:03:27;0.2803798914;0.6759818196;-0.2584785223;-0;0;-0;0;0;0;1
94;3.2421875;00:00:03:29;0.2802996039;0.6760192513;-0.2584490776;-0;0;-0;0;0;0;1
95;3.25;00:00:03:30;0.2802298367;0.676042676;-0.2584172189;-0;0;-0;0;0;0;1
96;3.2578125;00:00:03:30;0.2801707685;0.6760544181;-0.2583947778;-0;0;-0;0;0;0;1
97;3.265625;00:00:03:31;0.2801128924;0.6760643125;-0.2583728135;-0;0;-0;0;0;0;1
98;3.2734375;00:00:03:32;0.2800430655;0.6760819554;-0.2583482265;-0;0;-0;0;0;0;1
99;3.28125;00:00:03:33;0.2799793482;0.6760928035;-0.2583223283;-0;0;-0;0;0;0;1
100;3.2890625;00:00:03:34;0.2798981667;0.6761035323;-0.2583030462;-0;0;-0;0;0;0;1
101;3.296875;00:00:03:35;0.2798343301;0.6760987043;-0.2582939863;-0;0;-0;0;0;0;1
102;3.30859375;00:00:03:37;0.2797761261;0.6760830283;-0.2583037615;-0;0;-0;0;0;0;1
103;3.31640625;00:00:03:37;0.2797243595;0.6760659814;-0.2583168447;-0;0;-0;0;0;0;1
104;3.32421875;00:00:03:38;0.2796575725;0.6760526299;-0.258343637;-0;0;-0;0;0;0;1
105;3.33203125;00:00:03:39;0.2795707881;0.6760348082;-0.2583643794;-0;0;-0;0;0;0;1
106;3.33984375;00:00:03:40;0.2794729769;0.6760087609;-0.2583793998;-0;0;-0;0;0;0;1
107;3.34765625;00:00:03:41;0.2793635428;0.6759864688;-0.2584144473;-0;0;-0;0;0;0;1
108;3.35546875;00:00:03:42;0.2792512476;0.6759487987;-0.2584339976;-0;0;-0;0;0;0;1
109;3.3671875;00:00:03:44;0.2791443467;0.67589885;-0.2584685981;-0;0;-0;0;0;0;1
110;3.375;00:00:03:45;0.2790197134;0.6758563519;-0.258500427;-0;0;-0;0;0;0;1
111;3.3828125;00:00:03:45;0.2788990438;0.6758052111;-0.2585319877;-0;0;-0;0;0;0;1
112;3.390625;00:00:03:46;0.2787733972;0.6757432818;-0.2585619986;-0;0;-0;0;0;0;1
113;3.3984375;00:00:03:47;0.2786654234;0.6756702065;-0.2586218119;-0;0;-0;0;0;0;1
114;3.40625;00:00:03:48;0.2785555124;0.6755984426;-0.2586872876;-0;0;-0;0;0;0;1
115;3.4140625;00:00:03:49;0.278463155;0.6755137444;-0.25874421;-0;0;-0;0;0;0;1
116;3.421875;00:00:03:50;0.2783742547;0.6754324436;-0.2588045597;-0;0;-0;0;0;0;1
117;3.43359375;00:00:03:52;0.2782726884;0.6753295064;-0.2588376999;-0;0;-0;0;0;0;1
118;3.44140625;00:00:03:52;0.2781969011;0.675211072;-0.2588618994;-0;0;-0;0;0;0;1
119;3.44921875;00:00:03:53;0.2781538665;0.6751070619;-0.2589021325;-0;0;-0;0;0;0;1
120;3.45703125;00:00:03:54;0.2781329155;0.6749910712;-0.2589324117;-0;0;-0;0;0;0;1
121;3.46484375;00:00:03:55;0.2781098187;0.6748814583;-0.2589631677;-0;0;-0;0;0;0;1
122;3.47265625;00:00:03:56;0.2780865431;0.6747800708;-0.2590073049;-0;0;-0;0;0;0;1
123;3.48046875;00:00:03:57;0.2780733407;0.6746726036;-0.2590538263;-0;0;-0;0;0;0;1
124;3.4921875;00:00:03:59;0.2780644;0.6745735407;-0.2590915263;-0;0;-0;0;0;0;1
125;3.5;00:00:03:60;0.278066963;0.6744843721;-0.2591329813;-0;0;-0;0;0;0;1
126;3.5078125;00:00:03:60;0.2780700922;0.6743969321;-0.2591695487;-0;0;-0;0;0;0;1
127;3.515625;00:00:03:61;0.2781005502;0.6743044257;-0.2592065036;-0;0;-0;0;0;0;1
128;3.5234375;00:00:03:62;0.278131187;0.6742056012;-0.2592380345;-0;0;-0;0;0;0;1
129;3.53125;00:00:03:63;0.2781670988;0.6741168499;-0.2592706978;-0;0;-0;0;0;0;1
130;3.5390625;00:00:03:64;0.2782173455;0.6740242243;-0.2592903674;-0;0;-0;0;0;0;1
131;3.546875;00:00:03:65;0.2782736421;0.673933804;-0.2593103647;-0;0;-0;0;0;0;1
132;3.55859375;00:00:03:67;0.2783176899;0.6738501787;-0.2593357563;-0;0;-0;0;0;0;1
133;3.56640625;00:00:03:67;0.2783682644;0.6737599969;-0.2593560219;-0;0;-0;0;0;0;1
134;3.57421875;00:00:03:68;0.2784011066;0.6736803055;-0.2593978941;-0;0;-0;0;0;0;1
135;3.58203125;00:00:03:69;0.2784464359;0.6735922694;-0.2594256997;-0;0;-0;0;0;0;1
136;3.58984375;00:00:03:70;0.2784777284;0.6735095978;-0.2594411671;-0;0;-0;0;0;0;1
137;3.59765625;00:00:03:71;0.2785212398;0.6734369397;-0.2594616115;-0;0;-0;0;0;0;1
138;3.60546875;00:00:03:72;0.2785563469;0.6733580232;-0.2594609261;-0;0;-0;0;0;0;1
139;3.6171875;00:00:03:74;0.2785748541;0.6732950211;-0.2594647706;-0;0;-0;0;0;0;1
140;3.625;00:00:03:75;0.2785858512;0.6732352972;-0.2594785392;-0;0;-0;0;0;0;1
141;3.6328125;00:00:03:75;0.2786051929;0.6731642485;-0.2594838142;-0;0;-0;0;0;0;1
142;3.640625;00:00:03:76;0.2786191106;0.6731022;-0.2594861984;-0;0;-0;0;0;0;1
143;3.6484375;00:00:03:77;0.2786103189;0.6730633378;-0.2594798803;-0;0;-0;0;0;0;1
144;3.65625;00:00:03:78;0.2785879374;0.6730290651;-0.2594993114;-0;0;-0;0;0;0;1
145;3.6640625;00:00:03:79;0.2785532773;0.6730025411;-0.2595234811;-0;0;-0;0;0;0;1
146;3.671875;00:00:03:80;0.2785336673;0.6729717851;-0.2595551908;-0;0;-0;0;0;0;1
147;3.68359375;00:00:03:82;0.2784957886;0.6729239821;-0.2595589459;-0;0;-0;0;0;0;1
148;3.69140625;00:00:03:82;0.2784314156;0.6728978753;-0.2595489621;-0;0;-0;0;0;0;1
149;3.69921875;00:00:03:83;0.27834481;0.6728849411;-0.2595749795;-0;0;-0;0;0;0;1
150;3.70703125;00:00:03:84;0.2782489955;0.6728894114;-0.2596324086;-0;0;-0;0;0;0;1
151;3.71484375;00:00:03:85;0.2781062722;0.6729066968;-0.2597067952;-0;0;-0;0;0;0;1
152;3.72265625;00:00:03:86;0.2779453099;0.6729198694;-0.259785682;-0;0;-0;0;0;0;1
153;3.73046875;00:00:03:87;0.27777493;0.6729350686;-0.259888202;-0;0;-0;0;0;0;1
154;3.7421875;00:00:03:89;0.2776199579;0.6729584336;-0.2600239813;-0;0;-0;0;0;0;1
155;3.75;00:00:03:90;0.2774702907;0.6729879379;-0.2601790726;-0;0;-0;0;0;0;1
156;3.7578125;00:00:03:90;0.2773131728;0.6730234027;-0.2603696585;-0;0;-0;0;0;0;1
157;3.765625;00:00:03:91;0.2771580219;0.6730684042;-0.2605988085;-0;0;-0;0;0;0;1
158;3.7734375;00:00:03:92;0.2770114243;0.6731230617;-0.2608514428;-0;0;-0;0;0;0;1
159;3.78125;00:00:03:93;0.2768622637;0.6731885672;-0.2611334324;-0;0;-0;0;0;0;1
160;3.7890625;00:00:03:94;0.2767097354;0.6732650399;-0.2614173591;-0;0;-0;0;0;0;1
161;3.796875;00:00:03:95;0.2765170932;0.6733638644;-0.261747539;-0;0;-0;0;0;0;1
162;3.80859375;00:00:03:97;0.2763307989;0.6734756231;-0.2620894313;-0;0;-0;0;0;0;1
163;3.81640625;00:00:03:97;0.2761692107;0.6735869646;-0.2624436021;-0;0;-0;0;0;0;1
164;3.82421875;00:00:03:98;0.2760398686;0.673689425;-0.2627803981;-0;0;-0;0;0;0;1
165;3.83203125;00:00:03:99;0.2759444118;0.6737872958;-0.2631284297;-0;0;-0;0;0;0;1
166;3.83984375;00:00:03:100;0.2758746147;0.6738650799;-0.2634796202;-0;0;-0;0;0;0;1
167;3.84765625;00:00:03:101;0.2758323252;0.6739611626;-0.2638646066;-0;0;-0;0;0;0;1
168;3.85546875;00:00:03:102;0.2757976949;0.674059093;-0.2642365992;-0;0;-0;0;0;0;1
169;3.8671875;00:00:03:104;0.275772661;0.6741688848;-0.2646137476;-0;0;-0;0;0;0;1
170;3.875;00:00:03:105;0.275749594;0.6742719412;-0.264968276;-0;0;-0;0;0;0;1
171;3.8828125;00:00:03:105;0.275733918;0.6743602157;-0.2652955353;-0;0;-0;0;0;0;1
172;3.890625;00:00:03:106;0.2757288516;0.6744551659;-0.2656242251;-0;0;-0;0;0;0;1
173;3.8984375;00:00:03:107;0.2757208645;0.6745619774;-0.2659491599;-0;0;-0;0;0;0;1
174;3.90625;00:00:03:108;0.2757009268;0.6746636033;-0.266232878;-0;0;-0;0;0;0;1
175;3.9140625;00:00:03:109;0.2756749094;0.6747571826;-0.2665317953;-0;0;-0;0;0;0;1
176;3.921875;00:00:03:110;0.2756511867;0.6748586297;-0.2668073475;-0;0;-0;0;0;0;1
177;3.93359375;00:00:03:112;0.2756359279;0.6749472022;-0.2670713365;-0;0;-0;0;0;0;1
178;3.94140625;00:00:03:112;0.275621891;0.6750267148;-0.2673223317;-0;0;-0;0;0;0;1
179;3.94921875;00:00:03:113;0.2756048441;0.6750861406;-0.2675486207;-0;0;-0;0;0;0;1
180;3.95703125;00:00:03:114;0.2755797207;0.6751568913;-0.2677413225;-0;0;-0;0;0;0;1
181;3.96484375;00:00:03:115;0.2755828798;0.6751796603;-0.2679397464;-0;0;-0;0;0;0;1
182;3.97265625;00:00:03:116;0.2755666971;0.6752206683;-0.268106848;-0;0;-0;0;0;0;1
183;3.98046875;00:00:03:117;0.275551796;0.6752485037;-0.2682484984;-0;0;-0;0;0;0;1
184;3.9921875;00:00:03:119;0.2755365968;0.675280273;-0.2683635056;-0;0;-0;0;0;0;1
185;4;00:00:04:00;0.2755123079;0.6753023267;-0.2684618831;-0;0;-0;0;0;0;1
186;4.0078125;00:00:04:00;0.2754859626;0.6753317118;-0.2685488462;-0;0;-0;0;0;0;1
187;4.015625;00:00:04:01;0.2754445076;0.6753302813;-0.2686326504;-0;0;-0;0;0;0;1
188;4.0234375;00:00:04:02;0.2754012346;0.6753394604;-0.2686828971;-0;0;-0;0;0;0;1
189;4.03125;00:00:04:03;0.2753596008;0.6753435731;-0.268712461;-0;0;-0;0;0;0;1
190;4.0390625;00:00:04:04;0.275310576;0.6753470302;-0.2687346041;-0;0;-0;0;0;0;1
191;4.046875;00:00:04:05;0.2752684653;0.6753451824;-0.2687536776;-0;0;-0;0;0;0;1
192;4.05859375;00:00:04:07;0.2752276063;0.6753430367;-0.2687556446;-0;0;-0;0;0;0;1
193;4.06640625;00:00:04:07;0.2751995921;0.675342679;-0.2687300742;-0;0;-0;0;0;0;1
194;4.07421875;00:00:04:08;0.2751883864;0.6753396988;-0.2687116861;-0;0;-0;0;0;0;1
195;4.08203125;00:00:04:09;0.2751820385;0.6753422618;-0.2686809301;-0;0;-0;0;0;0;1
196;4.08984375;00:00:04:10;0.2751922011;0.675342381;-0.2686436772;-0;0;-0;0;0;0;1
197;4.09765625;00:00:04:11;0.2752099633;0.6753524542;-0.268589735;-0;0;-0;0;0;0;1
198;4.10546875;00:00:04:12;0.2752343416;0.6753636003;-0.2685300708;-0;0;-0;0;0;0;1
199;4.1171875;00:00:04:14;0.2752767503;0.6753599048;-0.2684651613;-0;0;-0;0;0;0;1
200;4.125;00:00:04:15;0.2753352821;0.6753618121;-0.2683968544;-0;0;-0;0;0;0;1
201;4.1328125;00:00:04:15;0.2754173577;0.6753752828;-0.2683089674;-0;0;-0;0;0;0;1
202;4.140625;00:00:04:16;0.2755027115;0.675375998;-0.2682263553;-0;0;-0;0;0;0;1
203;4.1484375;00:00:04:17;0.2756118476;0.6753715277;-0.2681323886;-0;0;-0;0;0;0;1
204;4.15625;00:00:04:18;0.2757243216;0.6753515005;-0.2680279016;-0;0;-0;0;0;0;1
205;4.1640625;00:00:04:19;0.2758446932;0.6753339767;-0.2679314911;-0;0;-0;0;0;0;1
206;4.171875;00:00:04:20;0.2759736776;0.6753041148;-0.2678275108;-0;0;-0;0;0;0;1
207;4.18359375;00:00:04:22;0.2760992646;0.6752669811;-0.2677130103;-0;0;-0;0;0;0;1
208;4.19140625;00:00:04:22;0.2762372494;0.6752306819;-0.2675774693;-0;0;-0;0;0;0;1
209;4.19921875;00:00:04:23;0.2763528824;0.6751896143;-0.2674642205;-0;0;-0;0;0;0;1
210;4.20703125;00:00:04:24;0.2764634192;0.6751720309;-0.2673664689;-0;0;-0;0;0;0;1
211;4.21484375;00:00:04:25;0.27657637;0.6751468182;-0.2672699094;-0;0;-0;0;0;0;1
212;4.22265625;00:00:04:26;0.2766754031;0.6751227379;-0.2671643496;-0;0;-0;0;0;0;1
213;4.23046875;00:00:04:27;0.2767688632;0.6750944853;-0.2670531869;-0;0;-0;0;0;0;1
214;4.2421875;00:00:04:29;0.276868999;0.6750472188;-0.2669353783;-0;0;-0;0;0;0;1
215;4.25;00:00:04:30;0.276958853;0.6749964356;-0.2668069601;-0;0;-0;0;0;0;1
216;4.2578125;00:00:04:30;0.2770436406;0.6749482751;-0.2666788101;-0;0;-0;0;0;0;1
217;4.265625;00:00:04:31;0.2770863473;0.6749101281;-0.2665607929;-0;0;-0;0;0;0;1
218;4.2734375;00:00:04:32;0.2771258652;0.6748716235;-0.266459018;-0;0;-0;0;0;0;1
219;4.28125;00:00:04:33;0.2771599293;0.6748325229;-0.2663650811;-0;0;-0;0;0;0;1
220;4.2890625;00:00:04:34;0.2771958411;0.6748054624;-0.2662724853;-0;0;-0;0;0;0;1
221;4.296875;00:00:04:35;0.2772289217;0.6747674942;-0.2661818862;-0;0;-0;0;0;0;1
222;4.30859375;00:00:04:37;0.2772655487;0.6747252941;-0.2660938799;-0;0;-0;0;0;0;1
223;4.31640625;00:00:04:37;0.277295202;0.674689889;-0.2660019398;-0;0;-0;0;0;0;1
224;4.32421875;00:00:04:38;0.2773291469;0.6746544838;-0.2659344375;-0;0;-0;0;0;0;1
225;4.33203125;00:00:04:39;0.2773501873;0.6746234894;-0.2658687532;-0;0;-0;0;0;0;1
226;4.33984375;00:00:04:40;0.2773606777;0.6745935082;-0.2658025026;-0;0;-0;0;0;0;1
227;4.34765625;00:00:04:41;0.2773821652;0.6745473146;-0.2657406926;-0;0;-0;0;0;0;1
228;4.35546875;00:00:04:42;0.2773953378;0.6745165586;-0.2656696439;-0;0;-0;0;0;0;1
229;4.3671875;00:00:04:44;0.2774032354;0.6744721532;-0.2656040788;-0;0;-0;0;0;0;1
230;4.375;00:00:04:45;0.277398169;0.6744186282;-0.2655386925;-0;0;-0;0;0;0;1
231;4.3828125;00:00:04:45;0.277402252;0.6743690372;-0.2654908299;-0;0;-0;0;0;0;1
232;4.390625;00:00:04:46;0.2774166763;0.6743119359;-0.2654438615;-0;0;-0;0;0;0;1
233;4.3984375;00:00:04:47;0.277410686;0.6742774248;-0.2654166818;-0;0;-0;0;0;0;1
234;4.40625;00:00:04:48;0.2774083614;0.6742418408;-0.2653962672;-0;0;-0;0;0;0;1
235;4.4140625;00:00:04:49;0.2774083316;0.6742085814;-0.2653746307;-0;0;-0;0;0;0;1
236;4.421875;00:00:04:50;0.2773985565;0.6741583347;-0.2653658688;-0;0;-0;0;0;0;1
237;4.43359375;00:00:04:52;0.2773861587;0.6741318107;-0.2653311789;-0;0;-0;0;0;0;1
238;4.44140625;00:00:04:52;0.2773635983;0.6741155386;-0.2652501464;-0;0;-0;0;0;0;1
239;4.44921875;00:00:04:53;0.2773483396;0.674089849;-0.2651747167;-0;0;-0;0;0;0;1
240;4.45703125;00:00:04:54;0.2773241699;0.6740806103;-0.2650779188;-0;0;-0;0;0;0;1
241;4.46484375;00:00:04:55;0.2772975862;0.6740841866;-0.2649519145;-0;0;-0;0;0;0;1
242;4.47265625;00:00:04:56;0.277253896;0.6741142273;-0.2647744119;-0;0;-0;0;0;0;1
243;4.48046875;00:00:04:57;0.2772147655;0.6741539836;-0.264528811;-0;0;-0;0;0;0;1
244;4.4921875;00:00:04:59;0.2771684527;0.6742337346;-0.2642118037;-0;0;-0;0;0;0;1
245;4.5;00:00:04:60;0.2771213353;0.674331069;-0.2637965381;-0;0;-0;0;0;0;1
246;4.5078125;00:00:04:60;0.2770504951;0.6744630933;-0.2632909417;-0;0;-0;0;0;0;1
247;4.515625;00:00:04:61;0.2769771218;0.6746268868;-0.2626940608;-0;0;-0;0;0;0;1
248;4.5234375;00:00:04:62;0.2769179642;0.6748082638;-0.2619435787;-0;0;-0;0;0;0;1
249;4.53125;00:00:04:63;0.27687186;0.675001204;-0.2609301805;-0;0;-0;0;0;0;1
250;4.5390625;00:00:04:64;0.2767471969;0.6751892567;-0.2597565353;-0;0;-0;0;0;0;1
251;4.546875;00:00:04:65;0.2766379416;0.6754375696;-0.2583802938;-0;0;-0;0;0;0;1
252;4.55859375;00:00:04:67;0.2765810788;0.6757019162;-0.256747663;-0;0;-0;0;0;0;1
253;4.56640625;00:00:04:67;0.2764519155;0.6759572029;-0.2547794878;-0;0;-0;0;0;0;1
254;4.57421875;00:00:04:68;0.2762906551;0.6763333678;-0.2524966598;-0;0;-0;0;0;0;1
255;4.58203125;00:00:04:69;0.2761304677;0.6767190695;-0.2500296235;-0;0;-0;0;0;0;1
256;4.58984375;00:00:04:70;0.276009798;0.6771393418;-0.2471328378;-0;0;-0;0;0;0;1
257;4.59765625;00:00:04:71;0.2758201659;0.6776391864;-0.2438374758;-0;0;-0;0;0;0;1
258;4.60546875;00:00:04:72;0.275621891;0.6781750917;-0.2401832938;-0;0;-0;0;0;0;1
259;4.6171875;00:00:04:74;0.2756335139;0.6787130237;-0.2361231893;-0;0;-0;0;0;0;1
260;4.625;00:00:04:75;0.2755737305;0.679320991;-0.231627807;-0;0;-0;0;0;0;1
261;4.6328125;00:00:04:75;0.2755924165;0.6800402403;-0.2266488075;-0;0;-0;0;0;0;1
262;4.640625;00:00:04:76;0.2756696641;0.6808208227;-0.2211657912;-0;0;-0;0;0;0;1
263;4.6484375;00:00:04:77;0.2757633924;0.681694448;-0.2147873938;-0;0;-0;0;0;0;1
264;4.65625;00:00:04:78;0.2759893835;0.6825815439;-0.2081426084;-0;0;-0;0;0;0;1
265;4.6640625;00:00:04:79;0.2763063014;0.6836566329;-0.2007439137;-0;0;-0;0;0;0;1
266;4.671875;00:00:04:80;0.2766004503;0.6847934723;-0.192650795;-0;0;-0;0;0;0;1
267;4.68359375;00:00:04:82;0.2772296071;0.6861522794;-0.1839213222;-0;0;-0;0;0;0;1
268;4.69140625;00:00:04:82;0.2778167427;0.6877008677;-0.1746656895;-0;0;-0;0;0;0;1
269;4.69921875;00:00:04:83;0.2783902586;0.6893419623;-0.1642906219;-0;0;-0;0;0;0;1
270;4.70703125;00:00:04:84;0.2793245614;0.6912774444;-0.153415814;-0;0;-0;0;0;0;1
271;4.71484375;00:00:04:85;0.2803277075;0.6933431029;-0.141889438;-0;0;-0;0;0;0;1
272;4.72265625;00:00:04:86;0.2815395594;0.6957958937;-0.1295443326;-0;0;-0;0;0;0;1
273;4.73046875;00:00:04:87;0.283008188;0.6984835863;-0.1164224371;-0;0;-0;0;0;0;1
274;4.7421875;00:00:04:89;0.2846321762;0.7014172077;-0.1024040729;-0;0;-0;0;0;0;1
275;4.75;00:00:04:90;0.2867010832;0.7047122717;-0.08769829571;-0;0;-0;0;0;0;1
276;4.7578125;00:00:04:90;0.2891643047;0.708401978;-0.07218815386;-0;0;-0;0;0;0;1
277;4.765625;00:00:04:91;0.2919995487;0.7124795318;-0.05592189729;-0;0;-0;0;0;0;1
278;4.7734375;00:00:04:92;0.2951314151;0.7171056271;-0.03888975829;-0;0;-0;0;0;0;1
279;4.78125;00:00:04:93;0.2990460992;0.7221140862;-0.02096910775;-0;0;-0;0;0;0;1
280;4.7890625;00:00:04:94;0.3035817444;0.7276518941;-0.002291508019;-0;0;-0;0;0;0;1
281;4.796875;00:00:04:95;0.3087576628;0.7337440252;0.01703260839;-0;0;-0;0;0;0;1
282;4.80859375;00:00:04:97;0.314660877;0.7404766679;0.03703963012;-0;0;-0;0;0;0;1
283;4.81640625;00:00:04:97;0.3212743402;0.7478625178;0.05767505243;-0;0;-0;0;0;0;1
284;4.82421875;00:00:04:98;0.3288100362;0.755900383;0.07884237915;-0;0;-0;0;0;0;1
285;4.83203125;00:00:04:99;0.3370758891;0.7647634149;0.1005489007;-0;0;-0;0;0;0;1
286;4.83984375;00:00:04:100;0.3465931416;0.7742863297;0.1226458997;-0;0;-0;0;0;0;1
287;4.84765625;00:00:04:101;0.3569342494;0.7847793102;0.1451079249;-0;0;-0;0;0;0;1
288;4.85546875;00:00:04:102;0.3683651984;0.7961791754;0.1679051667;-0;0;-0;0;0;0;1
289;4.8671875;00:00:04:104;0.3809666932;0.8084723353;0.1904511452;-0;0;-0;0;0;0;1
290;4.875;00:00:04:105;0.3947912753;0.821769774;0.2129875273;-0;0;-0;0;0;0;1
291;4.8828125;00:00:04:105;0.4095814228;0.836194694;0.2354628742;-0;0;-0;0;0;0;1
292;4.890625;00:00:04:106;0.4260279536;0.8516274691;0.2577259541;-0;0;-0;0;0;0;1
293;4.8984375;00:00:04:107;0.4432443976;0.8682560921;0.2795591354;-0;0;-0;0;0;0;1
294;4.90625;00:00:04:108;0.461950779;0.8859518766;0.3007673919;-0;0;-0;0;0;0;1
295;4.9140625;00:00:04:109;0.4816093147;0.9050862789;0.321423918;-0;0;-0;0;0;0;1
296;4.921875;00:00:04:110;0.5025907159;0.925231874;0.3410896659;-0;0;-0;0;0;0;1
297;4.93359375;00:00:04:112;0.5246022344;0.9467175007;0.3598475754;-0;0;-0;0;0;0;1
298;4.94140625;00:00:04:112;0.547713995;0.9691542387;0.3772919774;-0;0;-0;0;0;0;1
299;4.94921875;00:00:04:113;0.571880877;0.9926661253;0.3933241367;-0;0;-0;0;0;0;1
300;4.95703125;00:00:04:114;0.5968791842;1.017155766;0.4078540802;-0;0;-0;0;0;0;1
301;4.96484375;00:00:04:115;0.6226685047;1.042545438;0.4206578135;-0;0;-0;0;0;0;1
302;4.97265625;00:00:04:116;0.6492258906;1.068865776;0.4316492379;-0;0;-0;0;0;0;1
303;4.98046875;00:00:04:117;0.6760340333;1.096078873;0.4407311678;-0;0;-0;0;0;0;1
304;4.9921875;00:00:04:119;0.7034003735;1.12389946;0.4477415383;-0;0;-0;0;0;0;1
305;5;00:00:05:00;0.7311248779;1.152224302;0.4526645243;-0;0;-0;0;0;0;1
306;5.0078125;00:00:05:00;0.7589688897;1.181041837;0.4553122818;-0;0;-0;0;0;0;1
307;5.015625;00:00:05:01;0.7865478992;1.210528851;0.4558870792;-0;0;-0;0;0;0;1
308;5.0234375;00:00:05:02;0.8142082095;1.239886761;0.4540609717;-0;0;-0;0;0;0;1
309;5.03125;00:00:05:03;0.8415154815;1.269293904;0.4499732852;-0;0;-0;0;0;0;1
310;5.0390625;00:00:05:04;0.8682168126;1.298977852;0.4434541762;-0;0;-0;0;0;0;1
311;5.046875;00:00:05:05;0.8942036629;1.328560948;0.4345378876;-0;0;-0;0;0;0;1
312;5.05859375;00:00:05:07;0.919030726;1.358086109;0.4233110845;-0;0;-0;0;0;0;1
313;5.06640625;00:00:05:07;0.9431845546;1.387233138;0.4098236561;-0;0;-0;0;0;0;1
314;5.07421875;00:00:05:08;0.965908289;1.416216016;0.3944123387;-0;0;-0;0;0;0;1
315;5.08203125;00:00:05:09;0.9880957603;1.444181204;0.376604259;-0;0;-0;0;0;0;1
316;5.08984375;00:00:05:10;1.008474112;1.47186327;0.3570362628;-0;0;-0;0;0;0;1
317;5.09765625;00:00:05:11;1.027671337;1.498598933;0.3353615403;-0;0;-0;0;0;0;1
318;5.10546875;00:00:05:12;1.045364738;1.524501562;0.3122531176;-0;0;-0;0;0;0;1
319;5.1171875;00:00:05:14;1.061089754;1.549553275;0.2874569893;-0;0;-0;0;0;0;1
320;5.125;00:00:05:15;1.075455666;1.573240161;0.2611501515;-0;0;-0;0;0;0;1
321;5.1328125;00:00:05:15;1.088129878;1.595702291;0.2337977588;-0;0;-0;0;0;0;1
322;5.140625;00:00:05:16;1.099437952;1.616562128;0.2054397315;-0;0;-0;0;0;0;1
323;5.1484375;00:00:05:17;1.108702421;1.636387229;0.1762851775;-0;0;-0;0;0;0;1
324;5.15625;00:00:05:18;1.116122723;1.654563785;0.146385774;-0;0;-0;0;0;0;1
325;5.1640625;00:00:05:19;1.122022748;1.671334267;0.1163196564;-0;0;-0;0;0;0;1
326;5.171875;00:00:05:20;1.126233459;1.686599612;0.08594351262;-0;0;-0;0;0;0;1
327;5.18359375;00:00:05:22;1.129006624;1.700372219;0.05567230284;-0;0;-0;0;0;0;1
328;5.19140625;00:00:05:22;1.130044818;1.712741137;0.02531186678;-0;0;-0;0;0;0;1
329;5.19921875;00:00:05:23;1.129576921;1.723600149;-0.004754202906;-0;0;-0;0;0;0;1
330;5.20703125;00:00:05:24;1.127750754;1.733090162;-0.03443428129;-0;0;-0;0;0;0;1
331;5.21484375;00:00:05:25;1.124232411;1.741220355;-0.06374117732;-0;0;-0;0;0;0;1
332;5.22265625;00:00:05:26;1.119196296;1.748094201;-0.09248456359;-0;0;-0;0;0;0;1
333;5.23046875;00:00:05:27;1.112923265;1.753754735;-0.1205622703;-0;0;-0;0;0;0;1
334;5.2421875;00:00:05:29;1.105063081;1.758088827;-0.1480340511;-0;0;-0;0;0;0;1
335;5.25;00:00:05:30;1.09627986;1.761124015;-0.1745095253;-0;0;-0;0;0;0;1
336;5.2578125;00:00:05:30;1.086183548;1.762999654;-0.2001229525;-0;0;-0;0;0;0;1
337;5.265625;00:00:05:31;1.075281262;1.763782144;-0.2246295363;-0;0;-0;0;0;0;1
338;5.2734375;00:00:05:32;1.062998176;1.763464689;-0.2481229454;-0;0;-0;0;0;0;1
339;5.28125;00:00:05:33;1.049822927;1.762125373;-0.2703973651;-0;0;-0;0;0;0;1
340;5.2890625;00:00:05:34;1.035745859;1.75984025;-0.2914272547;-0;0;-0;0;0;0;1
341;5.296875;00:00:05:35;1.020985603;1.756540298;-0.3112410009;-0;0;-0;0;0;0;1
342;5.30859375;00:00:05:37;1.005361319;1.75241828;-0.3297658265;-0;0;-0;0;0;0;1
343;5.31640625;00:00:05:37;0.9891167879;1.747543931;-0.3468137085;-0;0;-0;0;0;0;1
344;5.32421875;00:00:05:38;0.9723470211;1.741995454;-0.3624423444;-0;0;-0;0;0;0;1
345;5.33203125;00:00:05:39;0.955457747;1.735773206;-0.3764903247;-0;0;-0;0;0;0;1
346;5.33984375;00:00:05:40;0.9381285906;1.728968501;-0.3890982866;-0;0;-0;0;0;0;1
347;5.34765625;00:00:05:41;0.9208804369;1.72188437;-0.4001524448;-0;0;-0;0;0;0;1
348;5.35546875;00:00:05:42;0.9032728076;1.714187503;-0.4096772373;-0;0;-0;0;0;0;1
349;5.3671875;00:00:05:44;0.8858377337;1.706140637;-0.4177006483;-0;0;-0;0;0;0;1
350;5.375;00:00:05:45;0.868588686;1.697873235;-0.4242835343;-0;0;-0;0;0;0;1
351;5.3828125;00:00:05:45;0.851524055;1.68950963;-0.4294477105;-0;0;-0;0;0;0;1
352;5.390625;00:00:05:46;0.8348724246;1.68117559;-0.4331950247;-0;0;-0;0;0;0;1
353;5.3984375;00:00:05:47;0.8187952638;1.672912717;-0.4355260134;-0;0;-0;0;0;0;1
354;5.40625;00:00:05:48;0.8036758304;1.664738655;-0.4367138147;-0;0;-0;0;0;0;1
355;5.4140625;00:00:05:49;0.7891729474;1.65683639;-0.4369081259;-0;0;-0;0;0;0;1
356;5.421875;00:00:05:50;0.7752745152;1.649142385;-0.4357417822;-0;0;-0;0;0;0;1
357;5.43359375;00:00:05:52;0.7622350454;1.641786575;-0.4337625802;-0;0;-0;0;0;0;1
358;5.44140625;00:00:05:52;0.7498475313;1.63481915;-0.4308257401;-0;0;-0;0;0;0;1
359;5.44921875;00:00:05:53;0.7382925153;1.628335118;-0.4271603525;-0;0;-0;0;0;0;1
360;5.45703125;00:00:05:54;0.727499187;1.622394562;-0.4228502512;-0;0;-0;0;0;0;1
361;5.46484375;00:00:05:55;0.717494607;1.616879463;-0.41774261;-0;0;-0;0;0;0;1
362;5.47265625;00:00:05:56;0.7085014582;1.611778378;-0.4123789966;-0;0;-0;0;0;0;1
363;5.48046875;00:00:05:57;0.7003161907;1.607206941;-0.4066924751;-0;0;-0;0;0;0;1
364;5.4921875;00:00:05:59;0.692997098;1.603212237;-0.4006988406;-0;0;-0;0;0;0;1
365;5.5;00:00:05:60;0.6864432096;1.599763155;-0.3945773244;-0;0;-0;0;0;0;1
366;5.5078125;00:00:05:60;0.6807156801;1.59680891;-0.388404876;-0;0;-0;0;0;0;1
367;5.515625;00:00:05:61;0.6754437089;1.59432292;-0.381783843;-0;0;-0;0;0;0;1
368;5.5234375;00:00:05:62;0.6710500121;1.592330337;-0.3753824532;-0;0;-0;0;0;0;1
369;5.53125;00:00:05:63;0.6673657894;1.590690136;-0.3688741326;-0;0;-0;0;0;0;1
370;5.5390625;00:00:05:64;0.6642506123;1.589561939;-0.3626951575;-0;0;-0;0;0;0;1
371;5.546875;00:00:05:65;0.6615875363;1.588654399;-0.3564487994;-0;0;-0;0;0;0;1
372;5.55859375;00:00:05:67;0.6592434049;1.588192105;-0.3510085046;-0;0;-0;0;0;0;1
373;5.56640625;00:00:05:67;0.6576203108;1.587948203;-0.3459298611;-0;0;-0;0;0;0;1
374;5.57421875;00:00:05:68;0.6563754678;1.588000655;-0.3412269056;-0;0;-0;0;0;0;1
375;5.58203125;00:00:05:69;0.6553685665;1.588190079;-0.3369095325;-0;0;-0;0;0;0;1
376;5.58984375;00:00:05:70;0.6545428634;1.588551641;-0.3328776658;-0;0;-0;0;0;0;1
377;5.59765625;00:00:05:71;0.6541581154;1.58893466;-0.3292195797;-0;0;-0;0;0;0;1
378;5.60546875;00:00:05:72;0.6537117958;1.589381099;-0.3259800971;-0;0;-0;0;0;0;1
379;5.6171875;00:00:05:74;0.6535351872;1.589851022;-0.3232062459;-0;0;-0;0;0;0;1
380;5.625;00:00:05:75;0.6534913778;1.590380669;-0.3208359182;-0;0;-0;0;0;0;1
381;5.6328125;00:00:05:75;0.6537703276;1.590868354;-0.3188027442;-0;0;-0;0;0;0;1
382;5.640625;00:00:05:76;0.6542011499;1.591431141;-0.3172757924;-0;0;-0;0;0;0;1
383;5.6484375;00:00:05:77;0.6547937393;1.592128992;-0.3162810802;-0;0;-0;0;0;0;1
384;5.65625;00:00:05:78;0.6556759477;1.592829823;-0.3156459928;-0;0;-0;0;0;0;1
385;5.6640625;00:00:05:79;0.6568600535;1.59360981;-0.3154363632;-0;0;-0;0;0;0;1
386;5.671875;00:00:05:80;0.6585184932;1.594435453;-0.3155274987;-0;0;-0;0;0;0;1
387;5.68359375;00:00:05:82;0.6602175236;1.595353246;-0.3159774244;-0;0;-0;0;0;0;1
388;5.69140625;00:00:05:82;0.662267983;1.596398592;-0.3167062998;-0;0;-0;0;0;0;1
389;5.69921875;00:00:05:83;0.6645689011;1.597442746;-0.3175352812;-0;0;-0;0;0;0;1
390;5.70703125;00:00:05:84;0.6672132015;1.598582745;-0.3185327053;-0;0;-0;0;0;0;1
391;5.71484375;00:00:05:85;0.6703454256;1.599732041;-0.3193970323;-0;0;-0;0;0;0;1
392;5.72265625;00:00:05:86;0.6736932397;1.601099849;-0.3205847144;-0;0;-0;0;0;0;1
393;5.73046875;00:00:05:87;0.6775910258;1.602527022;-0.3217743337;-0;0;-0;0;0;0;1
394;5.7421875;00:00:05:89;0.6818961501;1.604195952;-0.3231243789;-0;0;-0;0;0;0;1
395;5.75;00:00:05:90;0.6866509914;1.606012702;-0.3244548738;-0;0;-0;0;0;0;1
396;5.7578125;00:00:05:90;0.6922681928;1.60807395;-0.3256291747;-0;0;-0;0;0;0;1
397;5.765625;00:00:05:91;0.6983528733;1.610385656;-0.326805383;-0;0;-0;0;0;0;1
398;5.7734375;00:00:05:92;0.705008626;1.612659216;-0.3276007175;-0;0;-0;0;0;0;1
399;5.78125;00:00:05:93;0.7125396729;1.615157962;-0.3283450007;-0;0;-0;0;0;0;1
400;5.7890625;00:00:05:94;0.7203477621;1.617723823;-0.3282294273;-0;0;-0;0;0;0;1
401;5.796875;00:00:05:95;0.7288022637;1.620364308;-0.3276799917;-0;0;-0;0;0;0;1
402;5.80859375;00:00:05:97;0.7376016974;1.622762203;-0.3263826966;-0;0;-0;0;0;0;1
403;5.81640625;00:00:05:97;0.7470917702;1.625302076;-0.3245048821;-0;0;-0;0;0;0;1
404;5.82421875;00:00:05:98;0.7569873333;1.627872348;-0.3218379319;-0;0;-0;0;0;0;1
405;5.83203125;00:00:05:99;0.7673557997;1.630393863;-0.3182658255;-0;0;-0;0;0;0;1
406;5.83984375;00:00:05:100;0.7788091302;1.632709622;-0.3137543797;-0;0;-0;0;0;0;1
407;5.84765625;00:00:05:101;0.7903087139;1.634994268;-0.3078547716;-0;0;-0;0;0;0;1
408;5.85546875;00:00:05:102;0.8020172715;1.637038469;-0.3007263839;-0;0;-0;0;0;0;1
409;5.8671875;00:00:05:104;0.8143385649;1.639091849;-0.2924718559;-0;0;-0;0;0;0;1
410;5.875;00:00:05:105;0.8265895844;1.640557289;-0.2823237181;-0;0;-0;0;0;0;1
411;5.8828125;00:00:05:105;0.8388927579;1.64178741;-0.2708913088;-0;0;-0;0;0;0;1
412;5.890625;00:00:05:106;0.8510519862;1.642324448;-0.2575539947;-0;0;-0;0;0;0;1
413;5.8984375;00:00:05:107;0.8630589247;1.642315388;-0.242456913;-0;0;-0;0;0;0;1
414;5.90625;00:00:05:108;0.8746707439;1.641636491;-0.2256659865;-0;0;-0;0;0;0;1
415;5.9140625;00:00:05:109;0.8857744336;1.640072942;-0.2069778591;-0;0;-0;0;0;0;1
416;5.921875;00:00:05:110;0.8962853551;1.637419462;-0.1865079254;-0;0;-0;0;0;0;1
417;5.93359375;00:00:05:112;0.9057434797;1.633399248;-0.1641100645;-0;0;-0;0;0;0;1
418;5.94140625;00:00:05:112;0.9142224789;1.627798557;-0.1398684978;-0;0;-0;0;0;0;1
419;5.94921875;00:00:05:113;0.9213936925;1.620302796;-0.1137965322;-0;0;-0;0;0;0;1
420;5.95703125;00:00:05:114;0.9268544912;1.610586882;-0.085993357;-0;0;-0;0;0;0;1
421;5.96484375;00:00:05:115;0.9304951429;1.598516822;-0.05628229305;-0;0;-0;0;0;0;1
422;5.97265625;00:00:05:116;0.9319554567;1.58353591;-0.02513051033;-0;0;-0;0;0;0;1
423;5.98046875;00:00:05:117;0.9308505654;1.565241694;0.007286068983;-0;0;-0;0;0;0;1
424;5.9921875;00:00:05:119;0.92661798;1.543270588;0.04070938006;-0;0;-0;0;0;0;1
425;6;00:00:06:00;0.9195345044;1.51688385;0.07492593676;-0;0;-0;0;0;0;1
426;6.0078125;00:00:06:00;0.9085323811;1.48581183;0.1091777757;-0;0;-0;0;0;0;1
427;6.015625;00:00:06:01;0.8928020597;1.449470878;0.1422877014;-0;0;-0;0;0;0;1
428;6.0234375;00:00:06:02;0.8722088337;1.40786767;0.1737852991;-0;0;-0;0;0;0;1
429;6.03125;00:00:06:03;0.8462544084;1.361032367;0.2025699019;-0;0;-0;0;0;0;1
430;6.0390625;00:00:06:04;0.8147255182;1.308961391;0.2268006951;-0;0;-0;0;0;0;1
431;6.046875;00:00:06:05;0.7771000266;1.252618194;0.2448703945;-0;0;-0;0;0;0;1
432;6.05859375;00:00:06:07;0.7341905236;1.192588687;0.2551547885;-0;0;-0;0;0;0;1
433;6.06640625;00:00:06:07;0.6867355704;1.130548835;0.2560324669;-0;0;-0;0;0;0;1
434;6.07421875;00:00:06:08;0.6358780265;1.067978501;0.2464104891;-0;0;-0;0;0;0;1
435;6.08203125;00:00:06:09;0.5830712318;1.006182671;0.2247043699;-0;0;-0;0;0;0;1
436;6.08984375;00:00:06:10;0.5290036798;0.9474226832;0.1915974617;-0;0;-0;0;0;0;1
437;6.09765625;00:00:06:11;0.4757512808;0.8920749426;0.1462099701;-0;0;-0;0;0;0;1
438;6.10546875;00:00:06:12;0.4252328277;0.8415238261;0.08869037032;-0;0;-0;0;0;0;1
439;6.1171875;00:00:06:14;0.3797257245;0.7982597947;0.02013266832;-0;0;-0;0;0;0;1
440;6.125;00:00:06:15;0.3401935995;0.7647400498;-0.05801788345;-0;0;-0;0;0;0;1
441;6.1328125;00:00:06:15;0.3081836998;0.7422600389;-0.1441337764;-0;0;-0;0;0;0;1
442;6.140625;00:00:06:16;0.2853037119;0.7324305773;-0.2346321493;-0;0;-0;0;0;0;1
443;6.1484375;00:00:06:17;0.2713726759;0.7356184721;-0.3264339864;-0;0;-0;0;0;0;1
444;6.15625;00:00:06:18;0.2668347657;0.7516054511;-0.4177925885;-0;0;-0;0;0;0;1
445;6.1640625;00:00:06:19;0.2729460299;0.7799500823;-0.5070820451;-0;0;-0;0;0;0;1
446;6.171875;00:00:06:20;0.2880031765;0.8198199272;-0.5908629298;-0;0;-0;0;0;0;1
447;6.18359375;00:00:06:22;0.3108280599;0.8687484264;-0.6671358943;-0;0;-0;0;0;0;1
448;6.19140625;00:00:06:22;0.3396128714;0.9255510569;-0.7351702452;-0;0;-0;0;0;0;1
449;6.19921875;00:00:06:23;0.3739363253;0.9901632667;-0.7947462201;-0;0;-0;0;0;0;1
450;6.20703125;00:00:06:24;0.4129360616;1.061976314;-0.8444217443;-0;0;-0;0;0;0;1
451;6.21484375;00:00:06:25;0.4550251961;1.136676192;-0.8831188679;-0;0;-0;0;0;0;1
452;6.22265625;00:00:06:26;0.5009942055;1.212017894;-0.909958899;-0;0;-0;0;0;0;1
453;6.23046875;00:00:06:27;0.5487986207;1.285115123;-0.9255225062;-0;0;-0;0;0;0;1
454;6.2421875;00:00:06:29;0.5970675945;1.355748057;-0.9305455685;-0;0;-0;0;0;0;1
455;6.25;00:00:06:30;0.6459425092;1.423321247;-0.9254540801;-0;0;-0;0;0;0;1
456;6.2578125;00:00:06:30;0.6936783791;1.487369537;-0.9114671946;-0;0;-0;0;0;0;1
457;6.265625;00:00:06:31;0.7393344641;1.547699332;-0.8885467052;-0;0;-0;0;0;0;1
458;6.2734375;00:00:06:32;0.7824521065;1.602921009;-0.8575359583;-0;0;-0;0;0;0;1
459;6.28125;00:00:06:33;0.8225975037;1.651994109;-0.8198547959;-0;0;-0;0;0;0;1
460;6.2890625;00:00:06:34;0.8592396379;1.694454432;-0.7768860459;-0;0;-0;0;0;0;1
461;6.296875;00:00:06:35;0.8914724588;1.730506301;-0.7296070457;-0;0;-0;0;0;0;1
462;6.30859375;00:00:06:37;0.9187682271;1.760381222;-0.6792016029;-0;0;-0;0;0;0;1
463;6.31640625;00:00:06:37;0.9408739209;1.784239769;-0.6272676587;-0;0;-0;0;0;0;1
464;6.32421875;00:00:06:38;0.9579269886;1.802456856;-0.5747305155;-0;0;-0;0;0;0;1
465;6.33203125;00:00:06:39;0.9701395631;1.815261722;-0.5225606561;-0;0;-0;0;0;0;1
466;6.33984375;00:00:06:40;0.9775819182;1.823197484;-0.4713039696;-0;0;-0;0;0;0;1
467;6.34765625;00:00:06:41;0.9802336097;1.826859355;-0.4216020107;-0;0;-0;0;0;0;1
468;6.35546875;00:00:06:42;0.9782636762;1.826696038;-0.3741951287;-0;0;-0;0;0;0;1
469;6.3671875;00:00:06:44;0.9722105265;1.823189139;-0.3295298219;-0;0;-0;0;0;0;1
470;6.375;00:00:06:45;0.9627463818;1.816563129;-0.2882643938;-0;0;-0;0;0;0;1
471;6.3828125;00:00:06:45;0.9500842094;1.807172656;-0.2502361536;-0;0;-0;0;0;0;1
472;6.390625;00:00:06:46;0.9347296357;1.795445085;-0.2156174183;-0;0;-0;0;0;0;1
473;6.3984375;00:00:06:47;0.916962862;1.781731129;-0.1843484491;-0;0;-0;0;0;0;1
474;6.40625;00:00:06:48;0.897810936;1.767111301;-0.1569558829;-0;0;-0;0;0;0;1
475;6.4140625;00:00:06:49;0.877789259;1.751027822;-0.1327931285;-0;0;-0;0;0;0;1
476;6.421875;00:00:06:50;0.858174324;1.734792829;-0.1124440953;-0;0;-0;0;0;0;1
477;6.43359375;00:00:06:52;0.8377446532;1.717578411;-0.09457266331;-0;0;-0;0;0;0;1
478;6.44140625;00:00:06:52;0.8172088265;1.700065255;-0.07957466692;-0;0;-0;0;0;0;1
479;6.44921875;00:00:06:53;0.7971883416;1.682597995;-0.06771805137;-0;0;-0;0;0;0;1
480;6.45703125;00:00:06:54;0.7773057222;1.665557623;-0.05855178088;-0;0;-0;0;0;0;1
481;6.46484375;00:00:06:55;0.7579454184;1.649191856;-0.05189694837;-0;0;-0;0;0;0;1
482;6.47265625;00:00:06:56;0.7396439314;1.634259105;-0.04776886106;-0;0;-0;0;0;0;1
483;6.48046875;00:00:06:57;0.7215935588;1.620136023;-0.04585718736;-0;0;-0;0;0;0;1
484;6.4921875;00:00:06:59;0.7041916251;1.607077718;-0.0458316952;-0;0;-0;0;0;0;1
485;6.5;00:00:06:60;0.6871454716;1.594541907;-0.04818188399;-0;0;-0;0;0;0;1
486;6.5078125;00:00:06:60;0.6705713272;1.583145738;-0.05204124376;-0;0;-0;0;0;0;1
487;6.515625;00:00:06:61;0.6548420191;1.572986603;-0.05681576207;-0;0;-0;0;0;0;1
488;6.5234375;00:00:06:62;0.6399555802;1.563977003;-0.06277048588;-0;0;-0;0;0;0;1
489;6.53125;00:00:06:63;0.6255910993;1.556026936;-0.06967443973;-0;0;-0;0;0;0;1
490;6.5390625;00:00:06:64;0.6115695834;1.548876166;-0.07784932852;-0;0;-0;0;0;0;1
491;6.546875;00:00:06:65;0.598597765;1.542547345;-0.08622034639;-0;0;-0;0;0;0;1
492;6.55859375;00:00:06:67;0.586097002;1.537252188;-0.09539824724;-0;0;-0;0;0;0;1
493;6.56640625;00:00:06:67;0.5743149519;1.532641649;-0.1048826948;-0;0;-0;0;0;0;1
494;6.57421875;00:00:06:68;0.5635650158;1.529042721;-0.1142931953;-0;0;-0;0;0;0;1
495;6.58203125;00:00:06:69;0.5536119342;1.526387811;-0.1236153692;-0;0;-0;0;0;0;1
496;6.58984375;00:00:06:70;0.5443695784;1.524372101;-0.1327603012;-0;0;-0;0;0;0;1
497;6.59765625;00:00:06:71;0.5364314914;1.523362994;-0.1410226822;-0;0;-0;0;0;0;1
498;6.60546875;00:00:06:72;0.5290679336;1.522867918;-0.1493836492;-0;0;-0;0;0;0;1
499;6.6171875;00:00:06:74;0.5224548578;1.523105621;-0.1573787183;-0;0;-0;0;0;0;1
500;6.625;00:00:06:75;0.5164392591;1.523677945;-0.1652137935;-0;0;-0;0;0;0;1
501;6.6328125;00:00:06:75;0.5110545158;1.524766326;-0.1727052778;-0;0;-0;0;0;0;1
502;6.640625;00:00:06:76;0.5060161352;1.526092291;-0.1792104244;-0;0;-0;0;0;0;1
503;6.6484375;00:00:06:77;0.5014339685;1.527663231;-0.185515821;-0;0;-0;0;0;0;1
504;6.65625;00:00:06:78;0.4974909127;1.529440522;-0.1908801645;-0;0;-0;0;0;0;1
505;6.6640625;00:00:06:79;0.4939740002;1.530836105;-0.1964762509;-0;0;-0;0;0;0;1
506;6.671875;00:00:06:80;0.4908612967;1.532450318;-0.2010297328;-0;0;-0;0;0;0;1
507;6.68359375;00:00:06:82;0.488075912;1.53402698;-0.2045559734;-0;0;-0;0;0;0;1
508;6.69140625;00:00:06:82;0.4856175482;1.535741687;-0.2072992176;-0;0;-0;0;0;0;1
509;6.69921875;00:00:06:83;0.4831113815;1.537549019;-0.2099844813;-0;0;-0;0;0;0;1
510;6.70703125;00:00:06:84;0.4808719456;1.539570212;-0.2118613869;-0;0;-0;0;0;0;1
511;6.71484375;00:00:06:85;0.478875339;1.541353464;-0.2131379247;-0;0;-0;0;0;0;1
512;6.72265625;00:00:06:86;0.4770671725;1.542969465;-0.2139930725;-0;0;-0;0;0;0;1
513;6.73046875;00:00:06:87;0.4753283858;1.544297099;-0.2144974619;-0;0;-0;0;0;0;1
514;6.7421875;00:00:06:89;0.4735942781;1.545532584;-0.2147068679;-0;0;-0;0;0;0;1
515;6.75;00:00:06:90;0.4723076522;1.546437502;-0.2147328705;-0;0;-0;0;0;0;1
516;6.7578125;00:00:06:90;0.4711203873;1.547368288;-0.2143441439;-0;0;-0;0;0;0;1
517;6.765625;00:00:06:91;0.4698462188;1.548463941;-0.2133736014;-0;0;-0;0;0;0;1
518;6.7734375;00:00:06:92;0.4689079821;1.549350142;-0.2122932971;-0;0;-0;0;0;0;1
519;6.78125;00:00:06:93;0.4682207704;1.550275683;-0.2109242529;-0;0;-0;0;0;0;1
520;6.7890625;00:00:06:94;0.4678665698;1.551250458;-0.2091521472;-0;0;-0;0;0;0;1
521;6.796875;00:00:06:95;0.467608273;1.552156568;-0.2074380219;-0;0;-0;0;0;0;1
522;6.80859375;00:00:06:97;0.4675026238;1.553159237;-0.2054895759;-0;0;-0;0;0;0;1
523;6.81640625;00:00:06:97;0.4677208364;1.554168463;-0.2035071552;-0;0;-0;0;0;0;1
524;6.82421875;00:00:06:98;0.4682215154;1.555160165;-0.2014616728;-0;0;-0;0;0;0;1
525;6.83203125;00:00:06:99;0.4687943757;1.556170464;-0.1991216689;-0;0;-0;0;0;0;1
526;6.83984375;00:00:06:100;0.4695407152;1.557522774;-0.1966908872;-0;0;-0;0;0;0;1
527;6.84765625;00:00:06:101;0.4707741737;1.558421254;-0.1946203262;-0;0;-0;0;0;0;1
528;6.85546875;00:00:06:102;0.4720576406;1.559353828;-0.1924955547;-0;0;-0;0;0;0;1
529;6.8671875;00:00:06:104;0.4735690057;1.560201883;-0.1904224902;-0;0;-0;0;0;0;1
530;6.875;00:00:06:105;0.4749266505;1.561158538;-0.1882611364;-0;0;-0;0;0;0;1
531;6.8828125;00:00:06:105;0.4767956734;1.561960697;-0.1860866696;-0;0;-0;0;0;0;1
532;6.890625;00:00:06:106;0.4786006808;1.562868834;-0.183975175;-0;0;-0;0;0;0;1
533;6.8984375;00:00:06:107;0.4805768728;1.563719153;-0.181830883;-0;0;-0;0;0;0;1
534;6.90625;00:00:06:108;0.4824462533;1.564503312;-0.1802112907;-0;0;-0;0;0;0;1
535;6.9140625;00:00:06:109;0.4845325947;1.565186858;-0.1782829612;-0;0;-0;0;0;0;1
536;6.921875;00:00:06:110;0.4866938889;1.565996289;-0.1763782352;-0;0;-0;0;0;0;1
537;6.93359375;00:00:06:112;0.4888172448;1.566749454;-0.1746008396;-0;0;-0;0;0;0;1
538;6.94140625;00:00:06:112;0.4912308455;1.567456722;-0.1728736162;-0;0;-0;0;0;0;1
539;6.94921875;00:00:06:113;0.4933618903;1.568170905;-0.1712466031;-0;0;-0;0;0;0;1
540;6.95703125;00:00:06:114;0.4955269992;1.568842292;-0.1695395261;-0;0;-0;0;0;0;1
541;6.96484375;00:00:06:115;0.4981060922;1.569622755;-0.1676431447;-0;0;-0;0;0;0;1
542;6.97265625;00:00:06:116;0.5003949404;1.570327997;-0.166114971;-0;0;-0;0;0;0;1
543;6.98046875;00:00:06:117;0.5027924776;1.570989609;-0.1645950824;-0;0;-0;0;0;0;1
544;6.9921875;00:00:06:119;0.5050873756;1.571584702;-0.1630522907;-0;0;-0;0;0;0;1
545;7;00:00:07:00;0.5073931813;1.572199821;-0.1617697924;-0;0;-0;0;0;0;1
546;7.0078125;00:00:07:00;0.509768784;1.572758675;-0.1605620533;-0;0;-0;0;0;0;1
547;7.015625;00:00:07:01;0.5119208097;1.573147178;-0.1595835239;-0;0;-0;0;0;0;1
548;7.0234375;00:00:07:02;0.5141434669;1.573701978;-0.1584569067;-0;0;-0;0;0;0;1
549;7.03125;00:00:07:03;0.5163297653;1.574217677;-0.1575561017;-0;0;-0;0;0;0;1
550;7.0390625;00:00:07:04;0.5184050798;1.574756742;-0.1567014158;-0;0;-0;0;0;0;1
551;7.046875;00:00:07:05;0.5204701424;1.575298786;-0.1560168862;-0;0;-0;0;0;0;1
552;7.05859375;00:00:07:07;0.5224184394;1.575914979;-0.1554412544;-0;0;-0;0;0;0;1
553;7.06640625;00:00:07:07;0.524546504;1.576541901;-0.1546900272;-0;0;-0;0;0;0;1
554;7.07421875;00:00:07:08;0.526247859;1.577274084;-0.1541343778;-0;0;-0;0;0;0;1
555;7.08203125;00:00:07:09;0.5280115604;1.577837586;-0.1537852734;-0;0;-0;0;0;0;1
556;7.08984375;00:00:07:10;0.5300740004;1.578473091;-0.1532253474;-0;0;-0;0;0;0;1
557;7.09765625;00:00:07:11;0.5316279531;1.579126596;-0.1528762579;-0;0;-0;0;0;0;1
558;7.10546875;00:00:07:12;0.5331278443;1.579653025;-0.1525807679;-0;0;-0;0;0;0;1
559;7.1171875;00:00:07:14;0.534784317;1.580091834;-0.1523050219;-0;0;-0;0;0;0;1
560;7.125;00:00:07:15;0.5362676382;1.58052969;-0.15188241;-0;0;-0;0;0;0;1
561;7.1328125;00:00:07:15;0.5373938084;1.580953956;-0.1517591923;-0;0;-0;0;0;0;1
562;7.140625;00:00:07:16;0.538639605;1.581254244;-0.1517611742;-0;0;-0;0;0;0;1
563;7.1484375;00:00:07:17;0.5394904017;1.58153975;-0.15166004;-0;0;-0;0;0;0;1
564;7.15625;00:00:07:18;0.5401846766;1.581779122;-0.1515458226;-0;0;-0;0;0;0;1
565;7.1640625;00:00:07:19;0.5407958031;1.581970692;-0.1514600068;-0;0;-0;0;0;0;1
566;7.171875;00:00:07:20;0.541375339;1.582019925;-0.1515524387;-0;0;-0;0;0;0;1
567;7.18359375;00:00:07:22;0.5418816209;1.582103133;-0.1514689773;-0;0;-0;0;0;0;1
568;7.19140625;00:00:07:22;0.5423101783;1.582156897;-0.151384607;-0;0;-0;0;0;0;1
569;7.19921875;00:00:07:23;0.5426871777;1.582183361;-0.1513340026;-0;0;-0;0;0;0;1
570;7.20703125;00:00:07:24;0.5430176854;1.582181931;-0.1512851715;-0;0;-0;0;0;0;1
571;7.21484375;00:00:07:25;0.5432950258;1.582194805;-0.1512550414;-0;0;-0;0;0;0;1
572;7.22265625;00:00:07:26;0.5434992313;1.582232714;-0.1512647569;-0;0;-0;0;0;0;1
573;7.23046875;00:00:07:27;0.5436390638;1.582307935;-0.1513363719;-0;0;-0;0;0;0;1
574;7.2421875;00:00:07:29;0.5437101722;1.582358241;-0.1514775902;-0;0;-0;0;0;0;1
575;7.25;00:00:07:30;0.5437932611;1.582371235;-0.1516111046;-0;0;-0;0;0;0;1
576;7.2578125;00:00:07:30;0.5441139936;1.58230257;-0.151763171;-0;0;-0;0;0;0;1
577;7.265625;00:00:07:31;0.5442790389;1.582080603;-0.1524251848;-0;0;-0;0;0;0;1
578;7.2734375;00:00:07:32;0.5442834496;1.582081437;-0.1526407003;-0;0;-0;0;0;0;1
579;7.28125;00:00:07:33;0.5444861054;1.581902027;-0.1530677378;-0;0;-0;0;0;0;1
580;7.2890625;00:00:07:34;0.5445934534;1.58173573;-0.1535007209;-0;0;-0;0;0;0;1
581;7.296875;00:00:07:35;0.5449673533;1.581424117;-0.1540694833;-0;0;-0;0;0;0;1
582;7.30859375;00:00:07:37;0.5451993942;1.581146598;-0.1545510739;-0;0;-0;0;0;0;1
583;7.31640625;00:00:07:37;0.5454539061;1.580880523;-0.1549980491;-0;0;-0;0;0;0;1
584;7.32421875;00:00:07:38;0.5457638502;1.580623031;-0.1554743946;-0;0;-0;0;0;0;1
585;7.33203125;00:00:07:39;0.5460968614;1.580349684;-0.1559588462;-0;0;-0;0;0;0;1
586;7.33984375;00:00:07:40;0.5464116335;1.580039144;-0.156445682;-0;0;-0;0;0;0;1
587;7.34765625;00:00:07:41;0.5468249321;1.579726815;-0.1571209133;-0;0;-0;0;0;0;1
588;7.35546875;00:00:07:42;0.5471989512;1.579333067;-0.1575926095;-0;0;-0;0;0;0;1
589;7.3671875;00:00:07:44;0.5476279259;1.578907728;-0.1580808014;-0;0;-0;0;0;0;1
590;7.375;00:00:07:45;0.5479732752;1.578461885;-0.1583367586;-0;0;-0;0;0;0;1
591;7.3828125;00:00:07:45;0.5484400392;1.578018665;-0.1587854326;-0;0;-0;0;0;0;1
592;7.390625;00:00:07:46;0.5489010811;1.577569723;-0.159212634;-0;0;-0;0;0;0;1
593;7.3984375;00:00:07:47;0.5494077802;1.577135205;-0.1595733762;-0;0;-0;0;0;0;1
594;7.40625;00:00:07:48;0.5499228835;1.576706648;-0.1599098593;-0;0;-0;0;0;0;1
595;7.4140625;00:00:07:49;0.5505042672;1.576309562;-0.160222739;-0;0;-0;0;0;0;1
596;7.421875;00:00:07:50;0.5511394739;1.575961232;-0.1604465395;-0;0;-0;0;0;0;1
597;7.43359375;00:00:07:52;0.5517436862;1.575642467;-0.1606671214;-0;0;-0;0;0;0;1
598;7.44140625;00:00:07:52;0.5523164272;1.575353742;-0.1608479917;-0;0;-0;0;0;0;1
599;7.44921875;00:00:07:53;0.5528823137;1.575096607;-0.1610144079;-0;0;-0;0;0;0;1
600;7.45703125;00:00:07:54;0.5534647703;1.574872255;-0.1611746252;-0;0;-0;0;0;0;1
601;7.46484375;00:00:07:55;0.5540331006;1.574668884;-0.1613263339;-0;0;-0;0;0;0;1
602;7.47265625;00:00:07:56;0.55467242;1.574543953;-0.1613433063;-0;0;-0;0;0;0;1
603;7.48046875;00:00:07:57;0.5554105043;1.57443583;-0.1614433825;-0;0;-0;0;0;0;1
604;7.4921875;00:00:07:59;0.5559316278;1.574375033;-0.1616561711;-0;0;-0;0;0;0;1
605;7.5;00:00:07:60;0.5564380884;1.574361563;-0.161887154;-0;0;-0;0;0;0;1
606;7.5078125;00:00:07:60;0.5569197536;1.574412465;-0.1621307433;-0;0;-0;0;0;0;1
607;7.515625;00:00:07:61;0.5573771596;1.57450366;-0.162388742;-0;0;-0;0;0;0;1
608;7.5234375;00:00:07:62;0.5578342676;1.574648142;-0.1626474857;-0;0;-0;0;0;0;1
609;7.53125;00:00:07:63;0.5583230257;1.574867129;-0.1629383266;-0;0;-0;0;0;0;1
610;7.5390625;00:00:07:64;0.558876276;1.575162649;-0.1632388532;-0;0;-0;0;0;0;1
611;7.546875;00:00:07:65;0.5594835877;1.575552702;-0.1635463983;-0;0;-0;0;0;0;1
612;7.55859375;00:00:07:67;0.5601208806;1.575993419;-0.163867712;-0;0;-0;0;0;0;1
613;7.56640625;00:00:07:67;0.5607964396;1.576508284;-0.164204821;-0;0;-0;0;0;0;1
614;7.57421875;00:00:07:68;0.5614842772;1.577043295;-0.1647242904;-0;0;-0;0;0;0;1
615;7.58203125;00:00:07:69;0.5622851253;1.577716112;-0.1648344547;-0;0;-0;0;0;0;1
616;7.58984375;00:00:07:70;0.5631655455;1.578405976;-0.1651640087;-0;0;-0;0;0;0;1
617;7.59765625;00:00:07:71;0.5640006065;1.579115391;-0.1655209363;-0;0;-0;0;0;0;1
618;7.60546875;00:00:07:72;0.5649277568;1.579852104;-0.1658146381;-0;0;-0;0;0;0;1
619;7.6171875;00:00:07:74;0.5658910871;1.580622911;-0.1661229581;-0;0;-0;0;0;0;1
620;7.625;00:00:07:75;0.5668967962;1.581450462;-0.1663703471;-0;0;-0;0;0;0;1
621;7.6328125;00:00:07:75;0.5679766536;1.582283854;-0.1665385664;-0;0;-0;0;0;0;1
622;7.640625;00:00:07:76;0.5690928102;1.583127379;-0.1668557674;-0;0;-0;0;0;0;1
623;7.6484375;00:00:07:77;0.5701403022;1.583940387;-0.1667889953;-0;0;-0;0;0;0;1
624;7.65625;00:00:07:78;0.5711584091;1.584635735;-0.1670882404;-0;0;-0;0;0;0;1
625;7.6640625;00:00:07:79;0.5721667409;1.585285902;-0.1673388034;-0;0;-0;0;0;0;1
626;7.671875;00:00:07:80;0.5730983615;1.585916877;-0.1675332785;-0;0;-0;0;0;0;1
627;7.68359375;00:00:07:82;0.5740321875;1.586532474;-0.1676722914;-0;0;-0;0;0;0;1
628;7.69140625;00:00:07:82;0.5749723315;1.587178946;-0.1677998602;-0;0;-0;0;0;0;1
629;7.69921875;00:00:07:83;0.5759329796;1.58786273;-0.1678799838;-0;0;-0;0;0;0;1
630;7.70703125;00:00:07:84;0.5768377781;1.588540077;-0.167905882;-0;0;-0;0;0;0;1
631;7.71484375;00:00:07:85;0.5777828693;1.589239478;-0.1678739786;-0;0;-0;0;0;0;1
632;7.72265625;00:00:07:86;0.578748405;1.589945197;-0.167856127;-0;0;-0;0;0;0;1
633;7.73046875;00:00:07:87;0.5796724558;1.590703011;-0.1677905172;-0;0;-0;0;0;0;1
634;7.7421875;00:00:07:89;0.5806068182;1.591522336;-0.1677358747;-0;0;-0;0;0;0;1
635;7.75;00:00:07:90;0.5816196799;1.592374444;-0.1677061319;-0;0;-0;0;0;0;1
636;7.7578125;00:00:07:90;0.5826716423;1.593230486;-0.1676035672;-0;0;-0;0;0;0;1
637;7.765625;00:00:07:91;0.5836373568;1.594147086;-0.1674516797;-0;0;-0;0;0;0;1
638;7.7734375;00:00:07:92;0.5847074986;1.595044017;-0.1672359854;-0;0;-0;0;0;0;1
639;7.78125;00:00:07:93;0.5858092904;1.596034169;-0.1670886278;-0;0;-0;0;0;0;1
640;7.7890625;00:00:07:94;0.5869731307;1.596962929;-0.1669757068;-0;0;-0;0;0;0;1
641;7.796875;00:00:07:95;0.5881066322;1.597911358;-0.1668642014;-0;0;-0;0;0;0;1
642;7.80859375;00:00:07:97;0.5892345905;1.598833323;-0.1667525619;-0;0;-0;0;0;0;1
643;7.81640625;00:00:07:97;0.5903531313;1.599718213;-0.1666017622;-0;0;-0;0;0;0;1
644;7.82421875;00:00:07:98;0.5914863348;1.600569725;-0.1664809883;-0;0;-0;0;0;0;1
645;7.83203125;00:00:07:99;0.5925061703;1.601360559;-0.1663619131;-0;0;-0;0;0;0;1
646;7.83984375;00:00:07:100;0.5936411023;1.602096438;-0.1662530899;-0;0;-0;0;0;0;1
647;7.84765625;00:00:07:101;0.5946861506;1.602773786;-0.1660682261;-0;0;-0;0;0;0;1
648;7.85546875;00:00:07:102;0.5957682133;1.603377938;-0.165887177;-0;0;-0;0;0;0;1
649;7.8671875;00:00:07:104;0.5967871547;1.603930712;-0.1656770706;-0;0;-0;0;0;0;1
650;7.875;00:00:07:105;0.5978351235;1.604470372;-0.1655098647;-0;0;-0;0;0;0;1
651;7.8828125;00:00:07:105;0.5988655686;1.604915619;-0.1652777195;-0;0;-0;0;0;0;1
652;7.890625;00:00:07:106;0.5997740626;1.605362535;-0.1649502218;-0;0;-0;0;0;0;1
653;7.8984375;00:00:07:107;0.6008455753;1.605767727;-0.1646533012;-0;0;-0;0;0;0;1
654;7.90625;00:00:07:108;0.6018047333;1.606106877;-0.1643155962;-0;0;-0;0;0;0;1
655;7.9140625;00:00:07:109;0.6028570533;1.606491685;-0.1639623642;-0;0;-0;0;0;0;1
656;7.921875;00:00:07:110;0.6038805842;1.606885195;-0.1633526683;-0;0;-0;0;0;0;1
657;7.93359375;00:00:07:112;0.604826808;1.607128382;-0.1629894674;-0;0;-0;0;0;0;1
658;7.94140625;00:00:07:112;0.605723083;1.607373118;-0.1625925004;-0;0;-0;0;0;0;1
659;7.94921875;00:00:07:113;0.6066108346;1.607598186;-0.1621611714;-0;0;-0;0;0;0;1
660;7.95703125;00:00:07:114;0.6074929833;1.607837796;-0.1617501825;-0;0;-0;0;0;0;1
661;7.96484375;00:00:07:115;0.6083948016;1.608124852;-0.161315769;-0;0;-0;0;0;0;1
662;7.97265625;00:00:07:116;0.6091995239;1.60837245;-0.1609334946;-0;0;-0;0;0;0;1
663;7.98046875;00:00:07:117;0.6099678874;1.608656406;-0.1605169177;-0;0;-0;0;0;0;1
664;7.9921875;00:00:07:119;0.6107234955;1.608955741;-0.1601410955;-0;0;-0;0;0;0;1
665;8;00:00:08:00;0.6114521623;1.609262586;-0.1597972363;-0;0;-0;0;0;0;1
666;8.0078125;00:00:08:00;0.6121249795;1.609588981;-0.1594791263;-0;0;-0;0;0;0;1
667;8.015625;00:00:08:01;0.6127306223;1.609930754;-0.1591507792;-0;0;-0;0;0;0;1
668;8.0234375;00:00:08:02;0.6133669615;1.610259056;-0.1588309556;-0;0;-0;0;0;0;1
669;8.03125;00:00:08:03;0.6139600277;1.610565901;-0.1585565358;-0;0;-0;0;0;0;1
670;8.0390625;00:00:08:04;0.6144696474;1.610866904;-0.1582997888;-0;0;-0;0;0;0;1
671;8.046875;00:00:08:05;0.6149513721;1.611164093;-0.1580440253;-0;0;-0;0;0;0;1
672;8.05859375;00:00:08:07;0.6154134274;1.61144948;-0.15778099;-0;0;-0;0;0;0;1
