Index;Time;Time Code;X;Y;Z
1586;0;0;-0.18404055;0.93288535;-2.5500004
1587;0;0;-0.17938718;0.92258024;-2.5221791
1588;0;0;-0.17858982;0.9087781;-2.4713387
1589;0;0;-0.17658138;0.9065955;-2.4230876
1590;0;0;-0.17903937;0.9093654;-2.36815
1591;0;0;-0.18109591;0.9027393;-2.3007202
1592;0;0;-0.18990135;0.8883821;-2.2194314
1593;0;0;-0.20517509;0.8824274;-2.1505885
1594;0;0;-0.22370335;0.8875745;-2.0351229
1595;0;0;-0.22780077;0.9011154;-1.9455183
1596;0;0;-0.23837607;0.9319972;-1.8659891
1597;0;0;-0.2690426;0.9985175;-1.757562
1598;0;0;-0.2941917;1.0664905;-1.6688975
1599;0;0;-0.30629873;1.1383611;-1.6018906
1600;0;0;-0.32441735;1.253075;-1.5087537
1601;0;0;-0.33495107;1.3472111;-1.4496027
1602;0;0;-0.35050738;1.4466839;-1.4216741
1603;0;0;-0.3622617;1.546198;-1.4080825
1604;0;0;-0.3745324;1.5936769;-1.4008569
1605;0;0;-0.3802635;1.602925;-1.4082799
1606;0;0;-0.37139648;1.5852469;-1.3960646
1607;0;0;-0.37546408;1.5726871;-1.3602513
1608;0;0;-0.3770582;1.5698589;-1.3165992
1609;0;0;-0.35997885;1.5722938;-1.2792815
1610;0;0;-0.30135104;1.5662624;-1.2034472
1611;0;0;-0.2515979;1.5517598;-1.1551405
1612;0;0;-0.21341826;1.5439168;-1.1141273
1613;0;0;-0.2206174;1.5486907;-1.0898505
1614;0;0;-0.25671834;1.5637516;-1.0816432
1615;0;0;-0.30139136;1.5890955;-1.0882357
1616;0;0;-0.33101007;1.6017;-1.095321
1617;0;0;-0.35404098;1.5994985;-1.10364
1618;0;0;-0.37051558;1.5913473;-1.10174
1619;0;0;-0.37133428;1.5903033;-1.0885866
1620;0;0;-0.35532746;1.5872487;-1.057952
1621;0;0;-0.332785;1.5819211;-1.0120608
1622;0;0;-0.2911771;1.5696899;-0.92022324
1623;0;0;-0.25450248;1.5572869;-0.855463
1624;0;0;-0.21982065;1.5412952;-0.80967176
1625;0;0;-0.2169672;1.5371456;-0.79348594
1626;0;0;-0.24453089;1.5484709;-0.7799656
1627;0;0;-0.2976025;1.5491365;-0.76007736
1628;0;0;-0.33878893;1.5183185;-0.74519885
1629;0;0;-0.35364598;1.4897565;-0.7181767
1630;0;0;-0.3438833;1.4751269;-0.63524246
1631;0;0;-0.30741286;1.4675146;-0.5486531
1632;0;0;-0.2794562;1.4519202;-0.42984286
1633;0;0;-0.22503127;1.4159486;-0.2964959
1634;0;0;-0.1693248;1.3692664;-0.23236984
1635;0;0;-0.11810453;1.3167626;-0.22146125
1636;0;0;-0.07312993;1.2533444;-0.21292564
1637;0;0;-0.0529217;1.2112969;-0.18837512
1638;0;0;-0.045037974;1.1825408;-0.17600825
1639;0;0;-0.043061234;1.1536635;-0.1506313
1640;0;0;-0.0515589;1.123906;-0.13367714
1641;0;0;-0.06339791;1.0857617;-0.10742881
1642;0;0;-0.065495916;1.033406;-0.06628614
1643;0;0;-0.072536044;0.96678346;-0.060376223
1644;0;0;-0.08597039;0.9427599;-0.06796346
1645;0;0;-0.08711294;0.936079;-0.059624586
1646;0;0;-0.08713213;0.918312;-0.08829727
1647;0;0;-0.08173006;0.91509783;-0.103164755
1648;0;0;-0.08528652;0.9234368;-0.087277494
1649;0;0;-0.11006735;0.9312322;-0.062246423
1650;0;0;-0.13172844;0.9295057;-0.066850804
1651;0;0;-0.120595686;0.93363273;-0.081549145
1652;0;0;-0.09365267;0.9412024;-0.057823125
1653;0;0;-0.078252345;0.9457435;-0.034377415
1654;0;0;-0.06169148;0.94881666;0.00013364293
1655;0;0;-0.04956167;0.9526817;0.020735122
1656;0;0;-0.042056;0.95355064;0.04916122
1657;0;0;-0.035426307;0.94616044;0.092358865
1658;0;0;-0.029701237;0.93706363;0.1273572
1659;0;0;-0.025935132;0.92453766;0.15167847
1660;0;0;-0.023120083;0.911381;0.17772472
1661;0;0;-0.016664427;0.89469135;0.24628593
1662;0;0;-0.012329959;0.8931007;0.3018982
1663;0;0;-0.006038026;0.8964523;0.37804857
1664;0;0;-0.0062269466;0.88821965;0.4284988
1665;0;0;-0.009464633;0.8780178;0.4854024
1666;0;0;-0.017261475;0.87897825;0.59150684
1667;0;0;-0.010152843;0.881118;0.6773946
1668;0;0;-0.012567441;0.89397085;0.75260615
1669;0;0;-0.034739252;0.93220925;0.86134803
1670;0;0;-0.054166656;0.98512584;0.9739154
1671;0;0;-0.06644165;1.0436245;1.0487674
1672;0;0;-0.08109259;1.1390738;1.1452361
1673;0;0;-0.086030595;1.2228684;1.2150015
1674;0;0;-0.103213176;1.3092184;1.277173
1675;0;0;-0.13494542;1.4042995;1.3300031
1676;0;0;-0.17801945;1.5391184;1.3227051
1677;0;0;-0.19892362;1.5893074;1.2854964
1678;0;0;-0.1771483;1.5751818;1.2934839
1679;0;0;-0.15295349;1.5482616;1.2950913
1680;0;0;-0.15296265;1.5447603;1.3107955
1681;0;0;-0.15535082;1.548237;1.3396722
1682;0;0;-0.14183617;1.5484964;1.399751
1683;0;0;-0.1243852;1.5376468;1.4495732
1684;0;0;-0.103820495;1.5246824;1.4931512
1685;0;0;-0.07207724;1.5135702;1.5567781
1686;0;0;-0.071507476;1.5162774;1.6087451
1687;0;0;-0.09329661;1.5238343;1.6458161
1688;0;0;-0.10987619;1.5351121;1.6465937
1689;0;0;-0.12070095;1.5431998;1.6567746
1690;0;0;-0.12983146;1.543669;1.6898185
1691;0;0;-0.12239229;1.5390433;1.726057
1692;0;0;-0.09788977;1.5377858;1.7634903
1693;0;0;-0.046857882;1.5464417;1.8353587
1694;0;0;0.0025787456;1.5517226;1.8960468
1695;0;0;0.06485818;1.5462464;1.9499717
1696;0;0;0.1413192;1.5334162;2.0064983
1697;0;0;0.18286751;1.5217344;2.0679178
1698;0;0;0.18732601;1.5215688;2.1146073
1699;0;0;0.19162786;1.5291716;2.187693
1700;0;0;0.21183848;1.539807;2.251368
1701;0;0;0.25556535;1.5457816;2.2808847
1702;0;0;0.32830474;1.5498977;2.2868016
1703;0;0;0.43617454;1.5591975;2.2871377
1704;0;0;0.5058941;1.562286;2.2628822
1705;0;0;0.57791686;1.5452292;2.230394
1706;0;0;0.61952674;1.5103709;2.1926951
1707;0;0;0.6519934;1.4494368;2.1338239
1708;0;0;0.6490909;1.3493555;2.0678325
1709;0;0;0.6208358;1.2679836;2.033743
1710;0;0;0.57702994;1.2013661;2.0167868
1711;0;0;0.52328044;1.1112078;2.0116935
1712;0;0;0.49097317;1.0543332;2.02813
1713;0;0;0.46818787;1.0177015;2.0601552
1714;0;0;0.4388727;0.9891169;2.1045742
1715;0;0;0.40629393;0.9511585;2.1283283
1716;0;0;0.3776759;0.94433886;2.133812
1717;0;0;0.35324913;0.94804513;2.1310713
1718;0;0;0.33012807;0.9528234;2.134193
1719;0;0;0.31130233;0.9536487;2.1166887
1720;0;0;0.2885697;0.95070827;2.0999815
1721;0;0;0.27804744;0.95440644;2.0480783
1722;0;0;0.2780085;0.9638439;1.9984064
1723;0;0;0.2689892;0.97786176;1.9385351
1724;0;0;0.25069967;1.0143197;1.8788624
1725;0;0;0.23140845;1.0553687;1.8496467
1726;0;0;0.21073613;1.1113572;1.8185712
1727;0;0;0.2043899;1.1468598;1.7972416
1728;0;0;0.20029828;1.1712793;1.774598
1729;0;0;0.19194335;1.1816977;1.7608695
1730;0;0;0.18099171;1.1908602;1.7536945
1731;0;0;0.1744529;1.181048;1.7592825
1732;0;0;0.17059493;1.1596692;1.7627703
1733;0;0;0.16765222;1.1171426;1.7712861
1734;0;0;0.17199016;1.0736175;1.7837119
1735;0;0;0.1839768;1.0132061;1.8081568
1736;0;0;0.18995862;0.9758674;1.834283
1737;0;0;0.1919334;0.947006;1.8598214
1738;0;0;0.19513881;0.92178226;1.879989
1739;0;0;0.19864544;0.9138316;1.8836613
1740;0;0;0.20058265;0.9105158;1.8769782
1741;0;0;0.20496586;0.912351;1.8787003
1742;0;0;0.20271051;0.92277694;1.8613827
1743;0;0;0.19807939;0.931774;1.8217863
1744;0;0;0.20166916;0.93708766;1.7705356
1745;0;0;0.22190733;0.94194484;1.6901951
1746;0;0;0.23732103;0.95562637;1.6133424
1747;0;0;0.23247378;0.9825252;1.5117618
1748;0;0;0.22267199;1.0101477;1.4415076
1749;0;0;0.21797797;1.0529817;1.3788469
1750;0;0;0.22327876;1.1013192;1.3118798
1751;0;0;0.21076995;1.1626247;1.230945
1752;0;0;0.1899639;1.2057973;1.1772026
1753;0;0;0.17527658;1.264735;1.105567
1754;0;0;0.1726264;1.2960347;1.0596547
1755;0;0;0.1680017;1.3187582;1.0218791
1756;0;0;0.16192298;1.3339993;0.96995246
1757;0;0;0.16315131;1.3394574;0.9252125
1758;0;0;0.16672611;1.3257656;0.8906623
1759;0;0;0.15853104;1.2682928;0.8436581
1760;0;0;0.16041644;1.2048208;0.8023211
1761;0;0;0.1755369;1.1354989;0.77859926
1762;0;0;0.20422229;1.0485301;0.77598906
1763;0;0;0.223814;0.98539317;0.8001247
1764;0;0;0.23346083;0.9435605;0.84321415
1765;0;0;0.23705477;0.9017628;0.8894712
1766;0;0;0.24247217;0.88736117;0.9173549
1767;0;0;0.26704338;0.8878683;0.93534714
1768;0;0;0.2751136;0.897334;0.9542058
1769;0;0;0.2539344;0.910382;0.991418
1770;0;0;0.21886924;0.9242887;1.0212742
1771;0;0;0.1862836;0.9361924;1.0223058
1772;0;0;0.16321126;0.95105183;1.0463215
1773;0;0;0.15838504;0.9655943;1.0511881
1774;0;0;0.15789443;0.9788394;1.0471565
1775;0;0;0.15911338;0.9799694;1.0074328
1776;0;0;0.160103;0.9793488;0.9930839
1777;0;0;0.16163579;0.97074026;0.97874886
1778;0;0;0.17264657;0.9428989;0.91110784
1779;0;0;0.16728646;0.92029357;0.8389791
1780;0;0;0.15416776;0.90432453;0.7684498
1781;0;0;0.15497956;0.8933809;0.67138636
1782;0;0;0.1571858;0.86832213;0.57984775
1783;0;0;0.16359636;0.8355689;0.44984573
1784;0;0;0.17965345;0.8305391;0.34389582
1785;0;0;0.18356667;0.84055674;0.22992311
1786;0;0;0.18758461;0.87227595;0.07842669
1787;0;0;0.18393707;0.9133883;-0.030274078
1788;0;0;0.17126083;0.9682215;-0.1220751
1789;0;0;0.14489558;1.0455481;-0.2420271
1790;0;0;0.12676151;1.1056579;-0.3199935
1791;0;0;0.12145589;1.1741828;-0.3860688
1792;0;0;0.11815337;1.2312618;-0.46735194
1793;0;0;0.10398189;1.32676;-0.5437683
1794;0;0;0.09635573;1.377244;-0.56843996
1795;0;0;0.069464535;1.3972387;-0.6156096
1796;0;0;0.05216272;1.3752068;-0.6657878
1797;0;0;0.0629904;1.3530551;-0.70609593
1798;0;0;0.08065398;1.3214997;-0.76630056
1799;0;0;0.09436359;1.2520245;-0.7860638
1800;0;0;0.102836445;1.1794896;-0.7919626
1801;0;0;0.113942295;1.0576668;-0.783475
1802;0;0;0.11278724;0.976875;-0.7619496
1803;0;0;0.124293216;0.92494893;-0.73094225
1804;0;0;0.1652813;0.88989043;-0.68173456
1805;0;0;0.17621124;0.8817379;-0.6272719
1806;0;0;0.16118595;0.89602983;-0.5841273
1807;0;0;0.1450195;0.9095776;-0.5502285
1808;0;0;0.13975805;0.9278066;-0.505545
1809;0;0;0.14003022;0.9529018;-0.4876104
1810;0;0;0.13855281;0.98508906;-0.48356307
1811;0;0;0.13506728;1.0022625;-0.4931385
1812;0;0;0.13227697;1.0090129;-0.5044548
1813;0;0;0.13382035;1.0075632;-0.5256216
1814;0;0;0.13214554;1.0046495;-0.5704998
1815;0;0;0.12723215;0.992269;-0.62167144
1816;0;0;0.11626696;0.9668745;-0.693396
1817;0;0;0.1066398;0.93139315;-0.805437
1818;0;0;0.09898177;0.89298606;-0.9065951
1819;0;0;0.09451975;0.8689518;-1.02072
1820;0;0;0.07478719;0.84375346;-1.1843151
1821;0;0;0.054711442;0.8470223;-1.3371407
1822;0;0;0.03543421;0.89587766;-1.5421542
1823;0;0;0.031277716;0.95536107;-1.6559952
1824;0;0;0.01065723;1.0145673;-1.7487903
1825;0;0;-0.030447755;1.098128;-1.8514739
1826;0;0;-0.054558296;1.1564795;-1.9400235
1827;0;0;-0.05982488;1.2064694;-1.9864233
1828;0;0;-0.05950178;1.2498525;-2.0477023
1829;0;0;-0.057635795;1.3105346;-2.1191773
1830;0;0;-0.05376447;1.3333169;-2.1637526
1831;0;0;-0.07393844;1.3373432;-2.2051644
1832;0;0;-0.085256405;1.3133997;-2.231296
1833;0;0;-0.08119788;1.2879761;-2.2567916
1834;0;0;-0.07184853;1.2412472;-2.2902951
1835;0;0;-0.063194014;1.1824076;-2.297006
1836;0;0;-0.038592715;1.0990168;-2.276347
1837;0;0;-0.0071461545;0.98205394;-2.2278323
1838;0;0;0.0024848743;0.92848486;-2.2209702
1839;0;0;0.020888176;0.9003074;-2.1752863
1840;0;0;0.035081297;0.88013935;-2.081719
1841;0;0;0.03398377;0.8879591;-1.999549
1842;0;0;0.032632615;0.916046;-1.9544057
1843;0;0;0.03265629;0.94187534;-1.9338173
1844;0;0;0.026964419;0.9686061;-1.9113396
1845;0;0;0.017812856;0.9860909;-1.9142114
1846;0;0;0.01788178;1.0044448;-1.9079236
1847;0;0;0.019986922;1.0073735;-1.9375619
1848;0;0;0.02495477;1.0059161;-1.9602791
1849;0;0;0.021116301;1.0008254;-2.0123477
1850;0;0;0.012836702;0.99100846;-2.0724082
1851;0;0;0.008167466;0.96582675;-2.1520193
1852;0;0;0.0026840884;0.9390644;-2.2614236
1853;0;0;-0.016595475;0.8911179;-2.376204
1854;0;0;-0.02881775;0.860008;-2.4766831
1855;0;0;-0.040397253;0.8491937;-2.6398327
1856;0;0;-0.058792863;0.8655715;-2.7665672
1857;0;0;-0.080180414;0.89586735;-2.876875
1858;0;0;-0.09915628;0.9431523;-2.980929
1859;0;0;-0.14241406;1.0175962;-3.1118264
1860;0;0;-0.18309018;1.0806429;-3.1859937
1861;0;0;-0.22061884;1.1613283;-3.2571507
1862;0;0;-0.22509307;1.2091368;-3.3146496
1863;0;0;-0.22023909;1.2500356;-3.3634887
1864;0;0;-0.22163294;1.274901;-3.4093874
1865;0;0;-0.24520522;1.3086181;-3.4387941
1866;0;0;-0.2648285;1.3085743;-3.45686
1867;0;0;-0.27194202;1.2973751;-3.4718928
1868;0;0;-0.26662847;1.2698803;-3.5217896
1869;0;0;-0.25712;1.2302923;-3.546709
1870;0;0;-0.24660766;1.1699861;-3.5708363
1871;0;0;-0.23001108;1.0758101;-3.5444186
1872;0;0;-0.22621135;1.0108875;-3.5445955
1873;0;0;-0.17259301;0.9381287;-3.5291355
1874;0;0;-0.12560439;0.9218698;-3.5158548
1875;0;0;-0.09273086;0.9315181;-3.486134
1876;0;0;-0.061223555;0.9651233;-3.4509292
1877;0;0;-0.043700267;0.9861497;-3.4503741
1878;0;0;-0.034940284;1.0025824;-3.4740582
1879;0;0;-0.035263654;1.0060691;-3.51467
1880;0;0;-0.04647912;1.0033269;-3.5408337
1881;0;0;-0.062350836;0.9978888;-3.570383
1882;0;0;-0.07885712;0.9919669;-3.6233952
1883;0;0;-0.0974692;0.98395306;-3.666328
1884;0;0;-0.12835832;0.9765452;-3.6938088
1885;0;0;-0.16512275;0.9702444;-3.74622
1886;0;0;-0.19021532;0.9704317;-3.7928078
1887;0;0;-0.2363652;0.9633421;-3.8443818
1888;0;0;-0.30510432;0.9474845;-3.875989
1889;0;0;-0.4144023;0.9321773;-3.9152317
1890;0;0;-0.49435717;0.93278617;-3.9361792
1891;0;0;-0.5590782;0.94128036;-3.9430056
1892;0;0;-0.6666942;0.9584058;-3.934037
1893;0;0;-0.75614434;0.9801693;-3.9239266
1894;0;0;-0.84848654;1.0140933;-3.9012737
1895;0;0;-0.89071524;1.0354732;-3.8825312
1896;0;0;-0.9304904;1.0524403;-3.8625774
1897;0;0;-0.97110295;1.0685507;-3.8227363
1898;0;0;-0.9915073;1.0724686;-3.7917988
1899;0;0;-0.9985415;1.0683297;-3.7621453
1900;0;0;-1.0011688;1.0567905;-3.7177467
1901;0;0;-0.9967716;1.0417025;-3.6884604
1902;0;0;-0.98162544;1.0220212;-3.6635623
1903;0;0;-0.9504061;0.9895052;-3.623592
1904;0;0;-0.9159372;0.967792;-3.5915732
1905;0;0;-0.8789993;0.9523876;-3.5618086
1906;0;0;-0.83353454;0.9371412;-3.5167453
1907;0;0;-0.80865014;0.9290892;-3.49221
1908;0;0;-0.78879744;0.9205661;-3.475564
1909;0;0;-0.76753056;0.9127859;-3.4457006
1910;0;0;-0.75160766;0.9152094;-3.422223
1911;0;0;-0.7431426;0.9224155;-3.4057546
1912;0;0;-0.7414158;0.9259496;-3.3879752
1913;0;0;-0.75578094;0.9215143;-3.362169
1914;0;0;-0.76606977;0.91728675;-3.3453252
1915;0;0;-0.7649566;0.9157549;-3.3285618
1916;0;0;-0.7633358;0.9160832;-3.303683
1917;0;0;-0.7694745;0.9206729;-3.2836225
1918;0;0;-0.7773229;0.9252888;-3.2656133
1919;0;0;-0.78591526;0.92924464;-3.240917
1920;0;0;-0.7910552;0.92981166;-3.2222273
1921;0;0;-0.79622173;0.9288536;-3.2044363
1922;0;0;-0.8002628;0.9266341;-3.1773438
1923;0;0;-0.80160373;0.92343843;-3.1544867
1924;0;0;-0.8013537;0.91683185;-3.1215577
1925;0;0;-0.8017652;0.9102495;-3.0986726
1926;0;0;-0.8014562;0.90269303;-3.0772097
1927;0;0;-0.79897916;0.8923149;-3.060144
1928;0;0;-0.7979183;0.88244736;-3.033855
1929;0;0;-0.79829454;0.88685936;-3.013156
1930;0;0;-0.79475576;0.898805;-2.978526
1931;0;0;-0.7852642;0.90439814;-2.9595642
1932;0;0;-0.79350096;0.90437174;-2.9402642
1933;0;0;-0.80694973;0.9076615;-2.8913772
1934;0;0;-0.7933807;0.9045858;-2.844761
1935;0;0;-0.79826933;0.9033482;-2.810247
1936;0;0;-0.81986207;0.90838945;-2.7557116
1937;0;0;-0.8333766;0.91616046;-2.7111588
1938;0;0;-0.8360601;0.92262787;-2.6728005
1939;0;0;-0.8396334;0.9290439;-2.628906
1940;0;0;-0.8439367;0.936312;-2.5772028
1941;0;0;-0.8483202;0.9397783;-2.5365152
1942;0;0;-0.8526785;0.9423876;-2.5023136
1943;0;0;-0.860146;0.9445482;-2.4540162
1944;0;0;-0.8677617;0.9447495;-2.4214559
1945;0;0;-0.87142944;0.94382066;-2.3858037
1946;0;0;-0.86486;0.9417135;-2.3634973
1947;0;0;-0.86345696;0.9393066;-2.3384266
1948;0;0;-0.86512136;0.9425671;-2.3167615
1949;0;0;-0.869076;0.9628214;-2.307548
1950;0;0;-0.8669139;0.9794448;-2.2851887
1951;0;0;-0.87251365;0.9930084;-2.267263
1952;0;0;-0.8700557;0.9970283;-2.2440171
1953;0;0;-0.8540076;1.0051464;-2.2386093
1954;0;0;-0.84679234;1.0127466;-2.2200973
1955;0;0;-0.85791993;1.0123738;-2.2094955
1956;0;0;-0.8596627;1.0095862;-2.2062912
1957;0;0;-0.837872;1.0123569;-2.2038665
1958;0;0;-0.82362616;1.0177323;-2.197318
1959;0;0;-0.8179188;1.02179;-2.192149
1960;0;0;-0.81331086;1.0276227;-2.1935148
1961;0;0;-0.80537474;1.0309769;-2.1737676
1962;0;0;-0.7965049;1.0336211;-2.1591582
1963;0;0;-0.788244;1.0406276;-2.1484203
1964;0;0;-0.78512585;1.0454334;-2.1184626
1965;0;0;-0.7884056;1.0512164;-2.0883298
1966;0;0;-0.8055103;1.0667433;-2.0451412
1967;0;0;-0.82424194;1.0863968;-2.0111852
1968;0;0;-0.84698486;1.1136167;-1.9730731
1969;0;0;-0.8930921;1.183754;-1.8953806
1970;0;0;-0.9274893;1.2429464;-1.8395647
1971;0;0;-0.9548261;1.2933393;-1.797069
1972;0;0;-0.9760167;1.3790126;-1.7285789
1973;0;0;-0.96934986;1.4468596;-1.6590686
1974;0;0;-0.95588046;1.4904891;-1.6075169
1975;0;0;-0.93891674;1.5546142;-1.5480529
1976;0;0;-0.9283443;1.6016968;-1.4886494
1977;0;0;-0.91647756;1.6328;-1.4321342
1978;0;0;-0.8803705;1.6713052;-1.3580354
1979;0;0;-0.8444954;1.688363;-1.304743
1980;0;0;-0.81628096;1.6886181;-1.2440051
1981;0;0;-0.7850678;1.6736895;-1.1469138
1982;0;0;-0.768755;1.6530861;-1.0743299
1983;0;0;-0.7547164;1.6232449;-1.0108863
1984;0;0;-0.72871494;1.5645877;-0.91985404
1985;0;0;-0.71180815;1.5029904;-0.8558409
1986;0;0;-0.7032279;1.4321784;-0.81307375
1987;0;0;-0.69533205;1.3274738;-0.77137786
1988;0;0;-0.6957549;1.256781;-0.7613876
1989;0;0;-0.7053642;1.1976539;-0.7803702
1990;0;0;-0.7200357;1.1175877;-0.8261527
1991;0;0;-0.72695965;1.0798372;-0.85352445
1992;0;0;-0.73726;1.0642976;-0.8623051
1993;0;0;-0.756821;1.024367;-0.8830378
1994;0;0;-0.76388943;0.9897519;-0.9188718
1995;0;0;-0.76332676;0.97043014;-0.9620348
1996;0;0;-0.7683131;0.95754313;-0.99912083
1997;0;0;-0.78020513;0.93711805;-1.0664122
1998;0;0;-0.7789148;0.9302387;-1.1017953
1999;0;0;-0.7733661;0.92339456;-1.1348919
2000;0;0;-0.7675484;0.92199576;-1.1505854
2001;0;0;-0.7596642;0.920938;-1.1667973
2002;0;0;-0.7511166;0.9202555;-1.1896743
2003;0;0;-0.7440989;0.91544807;-1.1817194
2004;0;0;-0.7356596;0.9103112;-1.1733699
2005;0;0;-0.71647024;0.89860284;-1.1567425
2006;0;0;-0.701912;0.8974992;-1.1411763
2007;0;0;-0.69045484;0.90692043;-1.1117061
2008;0;0;-0.6823761;0.91583014;-1.0730907
2009;0;0;-0.67990714;0.9173405;-1.0415579
2010;0;0;-0.69042444;0.92259824;-0.9953878
2011;0;0;-0.7058925;0.92491984;-0.93995756
2012;0;0;-0.72571814;0.92329264;-0.8886383
2013;0;0;-0.74787223;0.9217379;-0.8502314
2014;0;0;-0.7723359;0.9252772;-0.7908766
2015;0;0;-0.7807908;0.93120325;-0.7530403
2016;0;0;-0.78195775;0.93926644;-0.7231661
2017;0;0;-0.7821561;0.94826466;-0.6797998
2018;0;0;-0.7785833;0.95260817;-0.65013456
2019;0;0;-0.77296627;0.95424014;-0.6324483
2020;0;0;-0.7640654;0.9531678;-0.60280526
2021;0;0;-0.7591858;0.9508536;-0.57937217
2022;0;0;-0.7596444;0.946756;-0.56342614
2023;0;0;-0.76154405;0.93947923;-0.53340155
2024;0;0;-0.7569963;0.9322382;-0.50556815
2025;0;0;-0.7491343;0.9256435;-0.48334974
2026;0;0;-0.7420294;0.9223994;-0.46997142
2027;0;0;-0.7355485;0.92238045;-0.4590938
2028;0;0;-0.72831714;0.9247546;-0.43313178
2029;0;0;-0.7104729;0.93143487;-0.3842413
2030;0;0;-0.69275385;0.9359361;-0.34966058
2031;0;0;-0.6791191;0.9395003;-0.32448974
2032;0;0;-0.6725141;0.9459994;-0.2708295
2033;0;0;-0.6725602;0.9511993;-0.22175142
2034;0;0;-0.6600548;0.9552971;-0.18783881
2035;0;0;-0.6293658;0.9613451;-0.14096478
2036;0;0;-0.6086594;0.96480095;-0.104020245
2037;0;0;-0.6027355;0.9646733;-0.07429852
2038;0;0;-0.59844816;0.9624611;-0.045729574
2039;0;0;-0.5928597;0.9598763;-0.025424074
2040;0;0;-0.5943297;0.95802224;-0.03674757
2041;0;0;-0.5955684;0.9570587;-0.042967316
2042;0;0;-0.59175193;0.9560246;-0.028190527
2043;0;0;-0.5847099;0.9549138;-0.0028027203
2044;0;0;-0.56613815;0.9530141;0.050023142
2045;0;0;-0.5552889;0.9508972;0.09029245
2046;0;0;-0.5483497;0.94850963;0.119480185
2047;0;0;-0.5354785;0.9453768;0.1523914
2048;0;0;-0.518887;0.941662;0.1972374
2049;0;0;-0.50459886;0.9383217;0.23381412
2050;0;0;-0.48105377;0.93156546;0.2865669
2051;0;0;-0.4605281;0.9256942;0.3229226
2052;0;0;-0.4396595;0.9253983;0.34782377
2053;0;0;-0.41513592;0.9281851;0.35922062
2054;0;0;-0.37776297;0.9281882;0.39344513
2055;0;0;-0.35010767;0.9258387;0.41541588
2056;0;0;-0.31282362;0.92696285;0.43450838
2057;0;0;-0.29318315;0.9315175;0.4523004
2058;0;0;-0.27179337;0.9343258;0.47267926
2059;0;0;-0.24936795;0.9472034;0.50492734
2060;0;0;-0.23436993;0.96195954;0.5217577
2061;0;0;-0.20913664;0.9651664;0.5229286
2062;0;0;-0.16750321;0.9719808;0.5244338
2063;0;0;-0.14099954;0.98210114;0.5237342
2064;0;0;-0.11876287;0.9930401;0.5173953
2065;0;0;-0.078881316;1.0112461;0.50280267
2066;0;0;-0.043286417;1.0273827;0.49208972
2067;0;0;-0.01379102;1.043319;0.4769415
2068;0;0;0.032813735;1.0737025;0.45233506
2069;0;0;0.06310982;1.1022841;0.4305913
2070;0;0;0.08258069;1.1288649;0.41531765
2071;0;0;0.11539396;1.1759781;0.39294577
2072;0;0;0.1348998;1.2177904;0.38402706
2073;0;0;0.14718139;1.2560269;0.37574124
2074;0;0;0.16086105;1.3149921;0.3618287
2075;0;0;0.16247493;1.3588206;0.35363716
2076;0;0;0.15644285;1.3913987;0.35248098
2077;0;0;0.15004423;1.4244889;0.3525082
2078;0;0;0.1448856;1.4728049;0.3582226
2079;0;0;0.1406728;1.4984542;0.3653632
2080;0;0;0.13062948;1.5201478;0.3686832
2081;0;0;0.124206215;1.5485634;0.37791377
2082;0;0;0.1257707;1.5629027;0.39247495
2083;0;0;0.12491129;1.5719792;0.41063318
2084;0;0;0.1263318;1.5724906;0.42891008
2085;0;0;0.13066086;1.5781733;0.4538718
2086;0;0;0.13252035;1.5866178;0.4871005
2087;0;0;0.13385253;1.6161383;0.5370275
2088;0;0;0.13209206;1.64725;0.5775833
2089;0;0;0.12686549;1.6729189;0.6114577
2090;0;0;0.11585973;1.7078677;0.65938336
2091;0;0;0.10816077;1.7351366;0.69128644
2092;0;0;0.10092982;1.753179;0.7235841
2093;0;0;0.08764741;1.7786591;0.76672447
2094;0;0;0.07610265;1.7969387;0.7979059
2095;0;0;0.06924136;1.8046671;0.82609725
2096;0;0;0.057859465;1.8146173;0.85695755
2097;0;0;0.053514753;1.8180333;0.87884486
2098;0;0;0.050768975;1.8110571;0.90686274
2099;0;0;0.046589497;1.7991252;0.9265771
2100;0;0;0.035888992;1.79206;0.93688095
2101;0;0;0.021324467;1.7847036;0.94741905
2102;0;0;0.007749195;1.7753586;0.95342296
2103;0;0;-0.00047592446;1.7720046;0.9558732
2104;0;0;-0.008622498;1.7710341;0.95821375
2105;0;0;-0.009350131;1.7709885;0.95715237
2106;0;0;-0.0026984448;1.7694355;0.9559407
2107;0;0;0.00717493;1.7683033;0.9588964
2108;0;0;0.008300898;1.7691389;0.9615885
2109;0;0;0.004489232;1.7720281;0.96590066
2110;0;0;8.6082146e-05;1.7728301;0.9753606
2111;0;0;0.001585068;1.7712542;0.97757477
2112;0;0;0.008504257;1.7698189;0.9714168
2113;0;0;0.019213602;1.7662796;0.963951
2114;0;0;0.024164706;1.762867;0.9618967
2115;0;0;0.026320215;1.758612;0.9609897
2116;0;0;0.028275404;1.7544314;0.95867085
2117;0;0;0.033247024;1.7467822;0.95827687
2118;0;0;0.035378758;1.7401465;0.95696616
2119;0;0;0.037554163;1.7299153;0.95243543
2120;0;0;0.040620953;1.7203501;0.94671947
2121;0;0;0.042543683;1.7061281;0.9415575
2122;0;0;0.04784176;1.6791087;0.9315593
2123;0;0;0.053169426;1.6531011;0.9130122
2124;0;0;0.05432914;1.6221681;0.89678913
2125;0;0;0.05918587;1.5850662;0.8754072
2126;0;0;0.06576826;1.5211984;0.8440553
2127;0;0;0.06474209;1.4683737;0.81729925
2128;0;0;0.056600112;1.3874754;0.777596
2129;0;0;0.043274123;1.3280987;0.7492131
2130;0;0;0.025721215;1.2660013;0.71731263
2131;0;0;-0.005836523;1.1662596;0.6601316
2132;0;0;-0.034592543;1.0938662;0.6085582
2133;0;0;-0.059671056;1.0414373;0.560717
2134;0;0;-0.10872776;0.963213;0.48784333
2135;0;0;-0.15366581;0.9113126;0.4413303
2136;0;0;-0.18502559;0.87995744;0.4082157
2137;0;0;-0.23198964;0.8608014;0.36302498
2138;0;0;-0.31232366;0.84284306;0.29176426
2139;0;0;-0.3629869;0.8512442;0.23841462
2140;0;0;-0.39545947;0.86433977;0.18594453
2141;0;0;-0.42306405;0.86965144;0.1436231
2142;0;0;-0.43423647;0.8694986;0.123915374
2143;0;0;-0.44864583;0.86891234;0.118262745
2144;0;0;-0.45981002;0.86581254;0.13203858
2145;0;0;-0.46713966;0.8626825;0.14865896
2146;0;0;-0.47130254;0.85916257;0.1702283
2147;0;0;-0.4700186;0.86043024;0.18747917
2148;0;0;-0.46240467;0.86547506;0.20432407
2149;0;0;-0.45084333;0.878;0.21513507
2150;0;0;-0.44313902;0.89892215;0.2391239
2151;0;0;-0.44400638;0.9159496;0.26180547
2152;0;0;-0.44682264;0.9403079;0.30299446
2153;0;0;-0.44742015;0.96288;0.33575654
2154;0;0;-0.44915593;0.9852047;0.36563867
2155;0;0;-0.44984415;1.0092304;0.40058783
2156;0;0;-0.4481697;1.0479776;0.45505083
2157;0;0;-0.44290352;1.078113;0.49301687
2158;0;0;-0.43582022;1.126924;0.54646826
2159;0;0;-0.4345969;1.1641846;0.5841687
2160;0;0;-0.43328685;1.1980886;0.61689955
2161;0;0;-0.42758462;1.235076;0.6538565
2162;0;0;-0.4209398;1.2991517;0.6947987
2163;0;0;-0.41662836;1.3423377;0.72168285
2164;0;0;-0.40618414;1.3970033;0.75013894
2165;0;0;-0.39128125;1.4310833;0.76291263
2166;0;0;-0.37593004;1.4575418;0.77924407
2167;0;0;-0.35290354;1.4929911;0.8092432
2168;0;0;-0.3376426;1.5197563;0.82782185
2169;0;0;-0.3291369;1.5368961;0.84140426
2170;0;0;-0.31688377;1.5607148;0.862316
2171;0;0;-0.30558607;1.5732156;0.8808062
2172;0;0;-0.29406378;1.5780247;0.8988296
2173;0;0;-0.28359044;1.586083;0.9225168
2174;0;0;-0.27427825;1.5871137;0.95285785
2175;0;0;-0.2622429;1.5815876;0.9746193
2176;0;0;-0.24128127;1.5687428;1.0062678
2177;0;0;-0.22921869;1.5555602;1.0299392
2178;0;0;-0.22146836;1.5395648;1.0561221
2179;0;0;-0.2082667;1.5093042;1.0974642
2180;0;0;-0.19713521;1.4769752;1.1251088
2181;0;0;-0.1911175;1.4468995;1.1373831
2182;0;0;-0.19180104;1.4111995;1.1373004
2183;0;0;-0.19239922;1.349697;1.1442415
2184;0;0;-0.1939419;1.30303;1.141831
2185;0;0;-0.19733907;1.2347898;1.1317415
2186;0;0;-0.20562217;1.1914213;1.1197861
2187;0;0;-0.21773487;1.151493;1.1105632
2188;0;0;-0.24615344;1.0868982;1.0799395
2189;0;0;-0.26678258;1.0404865;1.0685292
2190;0;0;-0.28765088;1.00613;1.0533762
2191;0;0;-0.315315;0.9615285;1.0179821
2192;0;0;-0.33219883;0.9340333;0.99689746
2193;0;0;-0.34922025;0.9182211;0.9702047
2194;0;0;-0.3841582;0.89999664;0.92766225
2195;0;0;-0.41543257;0.8929398;0.8976935
2196;0;0;-0.43523568;0.8981792;0.88541615
2197;0;0;-0.45478994;0.9059633;0.8639011
2198;0;0;-0.46205044;0.9129654;0.8683776
2199;0;0;-0.4592012;0.91915727;0.87888193
2200;0;0;-0.45558292;0.9234358;0.90265834
2201;0;0;-0.44658136;0.92804176;0.91572434
2202;0;0;-0.43798977;0.9290026;0.935508
2203;0;0;-0.42697096;0.92795587;0.97240436
2204;0;0;-0.4242699;0.9254676;0.99895227
2205;0;0;-0.4186787;0.91920257;1.0335394
2206;0;0;-0.40543824;0.9096371;1.0908095
2207;0;0;-0.36763301;0.8946084;1.1902503
2208;0;0;-0.3374303;0.8911383;1.2602828
2209;0;0;-0.30525404;0.894877;1.3381149
2210;0;0;-0.2746303;0.9019729;1.3864492
2211;0;0;-0.23927292;0.90872496;1.4251355
2212;0;0;-0.20754455;0.9212455;1.4543327
2213;0;0;-0.15755127;0.94257087;1.5031703
2214;0;0;-0.12380462;0.9608358;1.5194013
2215;0;0;-0.077792086;0.9834508;1.5351176
2216;0;0;-0.04682573;0.9995984;1.5236254
2217;0;0;-0.01617708;1.0094727;1.5154682
2218;0;0;0.01949029;1.0161855;1.5027415
2219;0;0;0.07550391;1.023793;1.4876848
2220;0;0;0.11166498;1.0240209;1.4662493
2221;0;0;0.15271185;1.0194458;1.4290274
2222;0;0;0.17736581;1.0118718;1.398985
2223;0;0;0.19480437;1.0043707;1.3670846
2224;0;0;0.21989077;0.9928743;1.3165873
2225;0;0;0.23781136;0.9843211;1.2698506
2226;0;0;0.24680033;0.9783378;1.2292652
2227;0;0;0.2592517;0.97236323;1.1579753
2228;0;0;0.26242936;0.97135854;1.0912961
2229;0;0;0.25841588;0.9759402;1.0344158
2230;0;0;0.25077686;0.9858505;0.971527
2231;0;0;0.23700067;1.0061576;0.86951745
2232;0;0;0.231058;1.0242559;0.8100717
2233;0;0;0.22772181;1.0452293;0.7383199
2234;0;0;0.23165557;1.0605985;0.693275
2235;0;0;0.22318141;1.0758655;0.647049
2236;0;0;0.20602037;1.0864028;0.6035366
2237;0;0;0.19643092;1.0892798;0.54932356
2238;0;0;0.20399567;1.0778706;0.5263421
2239;0;0;0.21056347;1.0548415;0.49523056
2240;0;0;0.20980868;1.0332363;0.4802693
2241;0;0;0.21182235;1.0150534;0.4693684
2242;0;0;0.22532974;0.9893612;0.47367668
2243;0;0;0.24107593;0.9697069;0.47025877
2244;0;0;0.24537367;0.95617104;0.47905183
2245;0;0;0.24089247;0.94380355;0.4910014
2246;0;0;0.23284653;0.9265013;0.5333471
2247;0;0;0.23090139;0.9205332;0.55773365
2248;0;0;0.2346066;0.9181572;0.5804831
2249;0;0;0.23780036;0.9191667;0.5850674
2250;0;0;0.23492506;0.9178972;0.58483404
2251;0;0;0.22517464;0.9122608;0.5728104
2252;0;0;0.21544364;0.9032911;0.55405533
2253;0;0;0.20235334;0.9007921;0.5263878
2254;0;0;0.18081744;0.9014913;0.47319508
2255;0;0;0.15961263;0.89464086;0.42915064
2256;0;0;0.1450955;0.8891634;0.38688958
2257;0;0;0.13649498;0.8718717;0.33074754
2258;0;0;0.14890437;0.8612664;0.274764
2259;0;0;0.1599518;0.86088914;0.20901847
2260;0;0;0.15821463;0.86708677;0.13102707
2261;0;0;0.15736946;0.8835412;0.045116294
2262;0;0;0.16076759;0.9063637;-0.014393563
2263;0;0;0.15861467;0.9449621;-0.089545965
2264;0;0;0.15365222;0.9764639;-0.13234892
2265;0;0;0.1531747;1.0022548;-0.16655275
2266;0;0;0.15529022;1.0269034;-0.195328
2267;0;0;0.16211629;1.0642506;-0.23743942
2268;0;0;0.16950071;1.0819317;-0.25421733
2269;0;0;0.18227182;1.0944581;-0.26615682
2270;0;0;0.19795495;1.0934967;-0.2577034
2271;0;0;0.21823044;1.0862058;-0.24404038
2272;0;0;0.24625789;1.0653074;-0.20795885
2273;0;0;0.2658259;1.041252;-0.16303238
2274;0;0;0.27599207;1.0188776;-0.12025576
2275;0;0;0.27031922;0.98783207;-0.07296836
2276;0;0;0.26045492;0.9609198;-0.031206597
2277;0;0;0.24894851;0.94165385;0.0111959
2278;0;0;0.2275537;0.92918146;0.06328867
2279;0;0;0.18154965;0.9209437;0.14606638
2280;0;0;0.1528164;0.92460835;0.19033371
2281;0;0;0.115099795;0.93671405;0.24665686
2282;0;0;0.0844954;0.94919586;0.27730447
2283;0;0;0.037978183;0.9625778;0.2939929
2284;0;0;-0.039116118;0.9817232;0.31196976
2285;0;0;-0.10648268;0.99471545;0.32102
2286;0;0;-0.16355273;1.0042694;0.30736524
2287;0;0;-0.24233815;1.0163027;0.26628298
2288;0;0;-0.2938125;1.018799;0.22863835
2289;0;0;-0.32351002;1.0148416;0.20206061
2290;0;0;-0.36403495;1.0079468;0.16868998
2291;0;0;-0.39699244;1.0022521;0.1440736
2292;0;0;-0.4081037;0.99264455;0.1286852
2293;0;0;-0.40335965;0.9692193;0.10758003
2294;0;0;-0.38692057;0.94909763;0.09109975
2295;0;0;-0.37020004;0.9383092;0.08561602
2296;0;0;-0.345524;0.9313003;0.09044663
2297;0;0;-0.30922204;0.92216545;0.08956355
2298;0;0;-0.277098;0.91865695;0.09787042
2299;0;0;-0.23548394;0.9194505;0.11172285
2300;0;0;-0.207748;0.92715025;0.12588711
2301;0;0;-0.18818605;0.93770957;0.14032315
2302;0;0;-0.16301003;0.9511106;0.16677631
2303;0;0;-0.12571235;0.9728867;0.19596791
2304;0;0;-0.10555849;0.9903291;0.22155663
2305;0;0;-0.08261426;1.0158477;0.2590478
2306;0;0;-0.07202212;1.0356476;0.2876394
2307;0;0;-0.0668161;1.050436;0.3103811
2308;0;0;-0.060013767;1.0638355;0.34410116
2309;0;0;-0.058692615;1.0670677;0.3693205
2310;0;0;-0.063272916;1.0604614;0.3857633
2311;0;0;-0.07023809;1.0444264;0.41342133
2312;0;0;-0.081906766;1.0159267;0.43103105
2313;0;0;-0.091586225;0.9901141;0.4279338
2314;0;0;-0.1145067;0.9503275;0.42863718
2315;0;0;-0.14292118;0.9256016;0.42565766
2316;0;0;-0.17271218;0.9102119;0.4312476
2317;0;0;-0.20719483;0.89157647;0.41677874
2318;0;0;-0.22748895;0.8897297;0.40256616
2319;0;0;-0.2565869;0.8992548;0.3920738
2320;0;0;-0.31372586;0.9134495;0.38431486
2321;0;0;-0.3387553;0.9230398;0.3858172
2322;0;0;-0.33427122;0.9323069;0.39380687
2323;0;0;-0.32504433;0.9459839;0.40532443
2324;0;0;-0.3219599;0.95486975;0.4223774
2325;0;0;-0.31520748;0.9595014;0.4457878
2326;0;0;-0.30587244;0.9642213;0.47971407
2327;0;0;-0.29790282;0.9652866;0.50827116
2328;0;0;-0.29112965;0.96256745;0.53471726
2329;0;0;-0.28049758;0.9576739;0.5745543
2330;0;0;-0.26896963;0.9541559;0.621673
2331;0;0;-0.25284284;0.95079947;0.658968
2332;0;0;-0.23104084;0.94644827;0.70399445
2333;0;0;-0.18782158;0.9382329;0.7609189
2334;0;0;-0.14886692;0.9319825;0.8066344
2335;0;0;-0.09175807;0.9238981;0.86641455
2336;0;0;-0.050021198;0.92310727;0.90183735
2337;0;0;-0.0104996255;0.92620915;0.92835766
2338;0;0;0.054715876;0.9325414;0.96857
2339;0;0;0.11269203;0.9396834;0.9969251
2340;0;0;0.16438107;0.9502535;1.0129911
2341;0;0;0.23041078;0.9690677;1.0302479
2342;0;0;0.27223277;0.9864225;1.0404459
2343;0;0;0.29777265;1.0009457;1.0412132
2344;0;0;0.31730402;1.0123004;1.0378103
2345;0;0;0.34518704;1.0246689;1.0338641
2346;0;0;0.34825042;1.0264382;1.0299419
2347;0;0;0.3457833;1.0204266;1.026823
2348;0;0;0.33996022;1.0094975;1.0224428
2349;0;0;0.32963768;0.9970276;1.0152751
2350;0;0;0.31063008;0.98292124;1.0080012
2351;0;0;0.2718322;0.96101904;0.9949043
2352;0;0;0.23705456;0.9445375;0.9823373
2353;0;0;0.18723159;0.9267137;0.9601549
2354;0;0;0.15093113;0.91703606;0.94004536
2355;0;0;0.117755905;0.91064173;0.92232406
2356;0;0;0.073556215;0.9062859;0.90364915
2357;0;0;0.039169893;0.90627;0.8901848
2358;0;0;0.014859696;0.9097114;0.8824735
2359;0;0;-0.002855991;0.91418576;0.87703997
2360;0;0;-0.02491938;0.91835237;0.8708342
2361;0;0;-0.032535877;0.9206009;0.86875725
2362;0;0;-0.035236757;0.92120254;0.87059605
2363;0;0;-0.025515556;0.9197587;0.8758355
2364;0;0;-0.011292272;0.917782;0.88117325
2365;0;0;0.013464558;0.91513526;0.8892117
2366;0;0;0.03534787;0.91401505;0.8946403
2367;0;0;0.05730672;0.91431737;0.89868367
2368;0;0;0.089196034;0.91681683;0.9027408
2369;0;0;0.112536736;0.92101717;0.9032763
2370;0;0;0.1317096;0.92634714;0.9008364
2371;0;0;0.15921867;0.9346742;0.8969349
2372;0;0;0.17914176;0.9421422;0.89266
2373;0;0;0.19087476;0.9486966;0.88748163
2374;0;0;0.2039407;0.95650077;0.88061285
2375;0;0;0.21044004;0.9610075;0.8760202
2376;0;0;0.21124153;0.96272933;0.87260723
2377;0;0;0.20960553;0.9633135;0.8688808
2378;0;0;0.20716204;0.9615365;0.8669064
2379;0;0;0.2013126;0.95679027;0.8662964
2380;0;0;0.18953755;0.9482094;0.86461854
2381;0;0;0.17697902;0.94099265;0.86357117
2382;0;0;0.1616894;0.9347459;0.86465144
2383;0;0;0.13948289;0.9271934;0.8676772
2384;0;0;0.12138266;0.9224578;0.8710164
2385;0;0;0.10446553;0.91964567;0.8734792
2386;0;0;0.09014831;0.9175225;0.87522054
2387;0;0;0.07010847;0.9139861;0.8776973
2388;0;0;0.05983184;0.9128791;0.8785472
2389;0;0;0.049758647;0.9124326;0.87876093
2390;0;0;0.046751197;0.9129696;0.8786104
2391;0;0;0.04710794;0.91328233;0.8783227
2392;0;0;0.05575059;0.9136815;0.87561
2393;0;0;0.06571959;0.91399056;0.87339026
2394;0;0;0.07951843;0.9143059;0.87205255
