Index;Time;Time Code;X;Y;Z
445;0;0;-0.743175;1.2653544;-0.18271925
446;0;0;-0.7313218;1.2668312;-0.19492456
447;0;0;-0.7197079;1.2681465;-0.20719087
448;0;0;-0.70849526;1.2692841;-0.21952224
449;0;0;-0.6974807;1.2703103;-0.23176153
450;0;0;-0.6865801;1.2712435;-0.24378979
451;0;0;-0.67572176;1.2721559;-0.25546926
452;0;0;-0.66485953;1.2729934;-0.26670963
453;0;0;-0.6541426;1.2737441;-0.27753294
454;0;0;-0.6433833;1.2743963;-0.28777412
455;0;0;-0.6326156;1.2749728;-0.29734626
456;0;0;-0.62169784;1.2755857;-0.30626193
457;0;0;-0.61074805;1.2761246;-0.3145121
458;0;0;-0.5998521;1.2765677;-0.3220903
459;0;0;-0.588982;1.2769123;-0.32901737
460;0;0;-0.57806015;1.2771589;-0.3353277
461;0;0;-0.5672008;1.2771578;-0.34115916
462;0;0;-0.55648756;1.277108;-0.346449
463;0;0;-0.546012;1.2768797;-0.3514791
464;0;0;-0.5356596;1.2765112;-0.35624188
465;0;0;-0.52539665;1.2761033;-0.36070928
466;0;0;-0.51553494;1.2756292;-0.36507106
467;0;0;-0.50603753;1.2750828;-0.36934754
468;0;0;-0.49704722;1.2744148;-0.37367174
469;0;0;-0.48828065;1.2739197;-0.37778375
470;0;0;-0.47975406;1.2735183;-0.38176706
471;0;0;-0.47167477;1.2731627;-0.3858136
472;0;0;-0.46408165;1.272906;-0.38993838
473;0;0;-0.45672292;1.2724066;-0.39419246
474;0;0;-0.44953614;1.2721974;-0.39813325
475;0;0;-0.44263038;1.2717758;-0.4023109
476;0;0;-0.43602484;1.2709695;-0.40695813
477;0;0;-0.42959148;1.2697035;-0.41211846
478;0;0;-0.42316097;1.2679784;-0.4177811
479;0;0;-0.41684255;1.2659239;-0.42388582
480;0;0;-0.41067332;1.2635502;-0.4304805
481;0;0;-0.40472484;1.261039;-0.43743736
482;0;0;-0.39907482;1.2585694;-0.44459054
483;0;0;-0.39370817;1.2562282;-0.45160857
484;0;0;-0.3887431;1.2540853;-0.45826527
485;0;0;-0.38425562;1.2522421;-0.4643495
486;0;0;-0.38037568;1.2507701;-0.46977818
487;0;0;-0.37702745;1.2496213;-0.47441772
488;0;0;-0.3741384;1.24869;-0.47817156
489;0;0;-0.37167597;1.2479109;-0.48106954
490;0;0;-0.36962456;1.2472256;-0.48331025
491;0;0;-0.3680401;1.2465016;-0.48508516
492;0;0;-0.3667585;1.2456899;-0.48677805
493;0;0;-0.36561513;1.244645;-0.48849377
494;0;0;-0.36451784;1.2432002;-0.49041075
495;0;0;-0.36342078;1.2412469;-0.49277988
496;0;0;-0.3623921;1.2385815;-0.49579325
497;0;0;-0.3612186;1.235218;-0.4996626
498;0;0;-0.3600062;1.2313731;-0.50468254
499;0;0;-0.3585435;1.2273064;-0.5105891
500;0;0;-0.3568063;1.2232455;-0.51723105
501;0;0;-0.35494536;1.2192729;-0.52435917
502;0;0;-0.35303396;1.2154664;-0.53159505
503;0;0;-0.35119897;1.2118005;-0.5387649
504;0;0;-0.34942892;1.2083546;-0.54533106
505;0;0;-0.34777117;1.2050964;-0.55122834
506;0;0;-0.3463229;1.2019559;-0.5562902
507;0;0;-0.34504226;1.1988508;-0.5605068
508;0;0;-0.34410596;1.1959255;-0.5639898
509;0;0;-0.34344694;1.1931489;-0.5667872
510;0;0;-0.34293506;1.1907145;-0.56915736
511;0;0;-0.3425511;1.1886778;-0.57123435
512;0;0;-0.34220037;1.1869336;-0.57333773
513;0;0;-0.34193948;1.185671;-0.57547855
514;0;0;-0.34172267;1.1847111;-0.5778516
515;0;0;-0.3415147;1.1842681;-0.58028656
516;0;0;-0.34127232;1.1842655;-0.5826846
517;0;0;-0.34093162;1.1845477;-0.5849419
518;0;0;-0.34050834;1.1850488;-0.5869088
519;0;0;-0.34004915;1.1856107;-0.58857214
520;0;0;-0.3395637;1.1862881;-0.58978784
521;0;0;-0.33907378;1.187134;-0.59052926
522;0;0;-0.33867177;1.1880647;-0.5908605
523;0;0;-0.33820844;1.1892543;-0.59080255
524;0;0;-0.3377217;1.1906765;-0.5904592
525;0;0;-0.3372241;1.1922745;-0.5899054
526;0;0;-0.33671042;1.1940236;-0.5892151
527;0;0;-0.33616555;1.1958332;-0.5884885
528;0;0;-0.3355716;1.1977478;-0.5877765
529;0;0;-0.33492813;1.1995844;-0.5872657
530;0;0;-0.33414328;1.2014661;-0.58679694
531;0;0;-0.33317336;1.2033494;-0.58646023
532;0;0;-0.33205503;1.2051678;-0.58631784
533;0;0;-0.33084318;1.2068701;-0.58636653
534;0;0;-0.32952914;1.2085572;-0.58650446
535;0;0;-0.32820463;1.2102653;-0.58659405
536;0;0;-0.32695594;1.2120306;-0.586538
537;0;0;-0.325846;1.2138137;-0.5863022
538;0;0;-0.32490596;1.2156686;-0.5858465
539;0;0;-0.32412517;1.2175651;-0.5851329
540;0;0;-0.32353035;1.219439;-0.5841689
541;0;0;-0.323042;1.2212694;-0.58298147
542;0;0;-0.32264453;1.2229538;-0.5817046
543;0;0;-0.32224786;1.2244837;-0.5803784
544;0;0;-0.3217515;1.2257133;-0.57909477
545;0;0;-0.32116663;1.2267251;-0.5778231
546;0;0;-0.32044435;1.2274084;-0.576684
547;0;0;-0.31951073;1.227754;-0.57570183
548;0;0;-0.3183896;1.2277641;-0.5749351
549;0;0;-0.31711707;1.2273557;-0.57430774
550;0;0;-0.31568903;1.2266556;-0.5740167
551;0;0;-0.31415913;1.2258599;-0.57397187
552;0;0;-0.31260285;1.2249122;-0.5741609
553;0;0;-0.31107244;1.2237581;-0.5746192
554;0;0;-0.30965152;1.2226049;-0.5751695
555;0;0;-0.3084117;1.2214328;-0.57585835
556;0;0;-0.307358;1.2202839;-0.57667476
557;0;0;-0.30654386;1.2192746;-0.5775959
558;0;0;-0.30599952;1.2184423;-0.5786274
559;0;0;-0.305686;1.217781;-0.5798241
560;0;0;-0.30564418;1.2172297;-0.5812589
561;0;0;-0.30572358;1.2167999;-0.58293957
562;0;0;-0.30591688;1.2165645;-0.58483344
563;0;0;-0.306219;1.2164963;-0.5869724
564;0;0;-0.30659735;1.2165933;-0.5894414
565;0;0;-0.30706412;1.2168704;-0.5922839
566;0;0;-0.3075518;1.217254;-0.5955558
567;0;0;-0.30803058;1.2177812;-0.5992849
568;0;0;-0.30851212;1.2184545;-0.6035243
569;0;0;-0.3090305;1.2193427;-0.6082841
570;0;0;-0.30960432;1.2204667;-0.6136085
571;0;0;-0.31032518;1.2219868;-0.6194495
572;0;0;-0.3111898;1.2239217;-0.62585074
573;0;0;-0.31223825;1.2262844;-0.6328393
574;0;0;-0.31349736;1.2291397;-0.6403423
575;0;0;-0.3149726;1.2324741;-0.6483825
576;0;0;-0.31667867;1.2362906;-0.6569013
577;0;0;-0.3185914;1.240536;-0.66588604
578;0;0;-0.32070658;1.2450777;-0.67539376
579;0;0;-0.32307565;1.2499732;-0.6852845
580;0;0;-0.32540414;1.255189;-0.6957272
581;0;0;-0.32789588;1.2606003;-0.70653206
582;0;0;-0.33047932;1.2660644;-0.7177832
583;0;0;-0.33320105;1.2715502;-0.72940105
584;0;0;-0.33605215;1.2769247;-0.7414887
585;0;0;-0.33893907;1.2823449;-0.753939
586;0;0;-0.34187385;1.2878194;-0.76670724
587;0;0;-0.34481373;1.2933209;-0.77992874
588;0;0;-0.34781554;1.2987148;-0.7936733
589;0;0;-0.3508372;1.3042095;-0.80771273
590;0;0;-0.35370848;1.3094499;-0.82204074
591;0;0;-0.3566743;1.3145009;-0.83684933
592;0;0;-0.3597905;1.3192626;-0.85231304
593;0;0;-0.36307815;1.3238956;-0.8682198
594;0;0;-0.36639506;1.3285224;-0.88427585
595;0;0;-0.36987808;1.3328841;-0.900902
596;0;0;-0.37372914;1.3372036;-0.91777426
597;0;0;-0.37788734;1.3414608;-0.9347639
598;0;0;-0.38237295;1.3455579;-0.95196205
599;0;0;-0.3870788;1.3495618;-0.9690798
600;0;0;-0.39200872;1.3534211;-0.9860931
601;0;0;-0.39716175;1.357157;-1.0029298
602;0;0;-0.40252292;1.3607367;-1.0195519
603;0;0;-0.4077345;1.3643329;-1.0357376
604;0;0;-0.4133799;1.3676468;-1.0520045
605;0;0;-0.41939282;1.3707703;-1.068155
606;0;0;-0.4257118;1.3736883;-1.0841882
607;0;0;-0.43214867;1.376565;-1.0998585
608;0;0;-0.43847594;1.379451;-1.1150451
609;0;0;-0.44485012;1.3822997;-1.1299063
610;0;0;-0.45119408;1.3850862;-1.1444362
611;0;0;-0.45766076;1.3877883;-1.1587676
612;0;0;-0.4640992;1.3904153;-1.1727991
613;0;0;-0.47045273;1.3928754;-1.1866785
614;0;0;-0.47682056;1.3952757;-1.2002612
615;0;0;-0.4831645;1.3976318;-1.2135047
616;0;0;-0.4893659;1.3998957;-1.2263973
617;0;0;-0.4957895;1.402039;-1.2392415
618;0;0;-0.502195;1.4040053;-1.2519164
619;0;0;-0.5086229;1.4058406;-1.2644925
620;0;0;-0.5151438;1.4074748;-1.2770312
621;0;0;-0.5215403;1.4091401;-1.2890466
622;0;0;-0.52798826;1.4104168;-1.3011843
623;0;0;-0.5344155;1.4113613;-1.3133878
624;0;0;-0.5409382;1.4118984;-1.3258264
625;0;0;-0.5475821;1.4120864;-1.3383344
626;0;0;-0.5543911;1.4119931;-1.3507204
627;0;0;-0.56139493;1.4115033;-1.363148
628;0;0;-0.5686401;1.4104958;-1.3756505
629;0;0;-0.57613724;1.4090214;-1.3881705
630;0;0;-0.58383924;1.40709;-1.4005667
631;0;0;-0.5914891;1.4048146;-1.4125657
632;0;0;-0.5994632;1.4019262;-1.4246716
633;0;0;-0.6077478;1.3983864;-1.4368396
634;0;0;-0.61606133;1.394308;-1.4488487
635;0;0;-0.62410754;1.3898226;-1.4605942
636;0;0;-0.63203186;1.3847344;-1.472231
637;0;0;-0.6400415;1.3789004;-1.4839728
638;0;0;-0.64810985;1.3724267;-1.4956963
639;0;0;-0.6559881;1.3653896;-1.5072503
640;0;0;-0.66355145;1.3579206;-1.5185492
641;0;0;-0.6708104;1.3501382;-1.5294603
642;0;0;-0.6777613;1.3420466;-1.5400033
643;0;0;-0.6844509;1.3339826;-1.5501252
644;0;0;-0.69081175;1.326247;-1.559619
645;0;0;-0.6968898;1.3190773;-1.5683781
646;0;0;-0.70257825;1.3126296;-1.5761355
647;0;0;-0.7074579;1.3070667;-1.5829083
648;0;0;-0.7115461;1.3023255;-1.5887709
649;0;0;-0.7146568;1.2984071;-1.5938833
650;0;0;-0.71668714;1.2952381;-1.598463
651;0;0;-0.7176173;1.2926621;-1.6026511
652;0;0;-0.7174532;1.2905765;-1.6066549
653;0;0;-0.71635205;1.2887378;-1.6106064
654;0;0;-0.7145174;1.2871002;-1.6146919
655;0;0;-0.71213984;1.2854344;-1.6189326
656;0;0;-0.70951724;1.2835004;-1.6235383
657;0;0;-0.7069515;1.2810807;-1.628522
658;0;0;-0.7043057;1.278321;-1.6338035
659;0;0;-0.70195925;1.2749904;-1.6395493
660;0;0;-0.7002214;1.2710664;-1.6458424
661;0;0;-0.6995474;1.2664372;-1.6528986
662;0;0;-0.6997969;1.2614496;-1.6605393
663;0;0;-0.70072335;1.2565743;-1.6682953
664;0;0;-0.7021642;1.2517564;-1.676167
665;0;0;-0.70401603;1.2471081;-1.6838766
