timeStamp,elapsed,label,responseCode,responseMessage,threadName,dataType,success,failureMessage,bytes,sentBytes,grpThreads,allThreads,URL,Latency,IdleTime,Connect
1666672322982,1186,POST Register,201,Created,Auth to Buyer Order (2 users; 5 seconds; 1 loop) 1-1,text,true,,592,1583,1,1,https://market-final-project.herokuapp.com/auth/register,1186,0,822
1666672324170,324,POST Login,201,Created,Auth to Buyer Order (2 users; 5 seconds; 1 loop) 1-1,text,true,,505,299,1,1,https://market-final-project.herokuapp.com/auth/login,324,0,0
1666672324495,274,POST Buyer Order,201,Created,Auth to Buyer Order (2 users; 5 seconds; 1 loop) 1-1,text,true,,688,419,1,1,https://market-final-project.herokuapp.com/buyer/order,274,0,0
1666672324770,271,GET Buyer Order,200,OK,Auth to Buyer Order (2 users; 5 seconds; 1 loop) 1-1,text,true,,1239,345,1,1,https://market-final-project.herokuapp.com/buyer/order,271,0,0
1666672325041,269,GET Buyer Order-ID,200,OK,Auth to Buyer Order (2 users; 5 seconds; 1 loop) 1-1,text,true,,1237,351,1,1,https://market-final-project.herokuapp.com/buyer/order/11575,269,0,0
1666672325311,268,PUT Buyer Order-ID,200,OK,Auth to Buyer Order (2 users; 5 seconds; 1 loop) 1-1,text,true,,682,397,2,2,https://market-final-project.herokuapp.com/buyer/order/11575,268,0,0
1666672325484,1192,POST Register,201,Created,Auth to Buyer Order (2 users; 5 seconds; 1 loop) 1-2,text,true,,592,1592,1,1,https://market-final-project.herokuapp.com/auth/register,1192,0,841
1666672326679,344,POST Login,201,Created,Auth to Buyer Order (2 users; 5 seconds; 1 loop) 1-2,text,true,,505,299,1,1,https://market-final-project.herokuapp.com/auth/login,344,0,0
1666672327024,289,POST Buyer Order,201,Created,Auth to Buyer Order (2 users; 5 seconds; 1 loop) 1-2,text,true,,688,419,1,1,https://market-final-project.herokuapp.com/buyer/order,289,0,0
1666672327314,280,GET Buyer Order,200,OK,Auth to Buyer Order (2 users; 5 seconds; 1 loop) 1-2,text,true,,1239,345,1,1,https://market-final-project.herokuapp.com/buyer/order,280,0,0
1666672327595,284,GET Buyer Order-ID,200,OK,Auth to Buyer Order (2 users; 5 seconds; 1 loop) 1-2,text,true,,1237,351,1,1,https://market-final-project.herokuapp.com/buyer/order/11576,284,0,0
1666672327881,283,PUT Buyer Order-ID,200,OK,Auth to Buyer Order (2 users; 5 seconds; 1 loop) 1-2,text,true,,682,397,1,1,https://market-final-project.herokuapp.com/buyer/order/11576,283,0,0
