{
  "DELETE Product-ID" : {
    "transaction" : "DELETE Product-ID",
    "sampleCount" : 10,
    "errorCount" : 0,
    "errorPct" : 0.0,
    "meanResTime" : 281.70000000000005,
    "medianResTime" : 277.0,
    "minResTime" : 264.0,
    "maxResTime" : 335.0,
    "pct1ResTime" : 330.8,
    "pct2ResTime" : 335.0,
    "pct3ResTime" : 335.0,
    "throughput" : 1.9062142584826536,
    "receivedKBytesPerSec" : 0.5994150304994281,
    "sentKBytesPerSec" : 0.6999380480365992
  },
  "GET Seller Product-ID" : {
    "transaction" : "GET Seller Product-ID",
    "sampleCount" : 10,
    "errorCount" : 0,
    "errorPct" : 0.0,
    "meanResTime" : 281.4,
    "medianResTime" : 270.0,
    "minResTime" : 257.0,
    "maxResTime" : 359.0,
    "pct1ResTime" : 355.20000000000005,
    "pct2ResTime" : 359.0,
    "pct3ResTime" : 359.0,
    "throughput" : 1.9076688286913392,
    "receivedKBytesPerSec" : 1.3841776755055322,
    "sentKBytesPerSec" : 0.6594870755436856
  },
  "POST Register" : {
    "transaction" : "POST Register",
    "sampleCount" : 10,
    "errorCount" : 0,
    "errorPct" : 0.0,
    "meanResTime" : 1148.0000000000002,
    "medianResTime" : 1140.5,
    "minResTime" : 1106.0,
    "maxResTime" : 1214.0,
    "pct1ResTime" : 1211.0,
    "pct2ResTime" : 1214.0,
    "pct3ResTime" : 1214.0,
    "throughput" : 1.7746228926353151,
    "receivedKBytesPerSec" : 1.0259538598047915,
    "sentKBytesPerSec" : 2.7043935780834074
  },
  "POST Login" : {
    "transaction" : "POST Login",
    "sampleCount" : 10,
    "errorCount" : 0,
    "errorPct" : 0.0,
    "meanResTime" : 337.90000000000003,
    "medianResTime" : 338.0,
    "minResTime" : 325.0,
    "maxResTime" : 351.0,
    "pct1ResTime" : 350.7,
    "pct2ResTime" : 351.0,
    "pct3ResTime" : 351.0,
    "throughput" : 2.0898641588296765,
    "receivedKBytesPerSec" : 1.0306458986415883,
    "sentKBytesPerSec" : 0.6102240073145245
  },
  "GET Seller Product" : {
    "transaction" : "GET Seller Product",
    "sampleCount" : 10,
    "errorCount" : 0,
    "errorPct" : 0.0,
    "meanResTime" : 377.3,
    "medianResTime" : 302.5,
    "minResTime" : 269.0,
    "maxResTime" : 1055.0,
    "pct1ResTime" : 984.5000000000002,
    "pct2ResTime" : 1055.0,
    "pct3ResTime" : 1055.0,
    "throughput" : 1.8846588767433095,
    "receivedKBytesPerSec" : 4.803671551074255,
    "sentKBytesPerSec" : 0.6404895401432341
  },
  "Total" : {
    "transaction" : "Total",
    "sampleCount" : 100,
    "errorCount" : 0,
    "errorPct" : 0.0,
    "meanResTime" : 453.5000000000001,
    "medianResTime" : 327.5,
    "minResTime" : 257.0,
    "maxResTime" : 1214.0,
    "pct1ResTime" : 1100.9000000000003,
    "pct2ResTime" : 1142.75,
    "pct3ResTime" : 1213.6999999999998,
    "throughput" : 10.492078480747036,
    "receivedKBytesPerSec" : 8.496124488511173,
    "sentKBytesPerSec" : 384.8505657525443
  },
  "POST Seller Product" : {
    "transaction" : "POST Seller Product",
    "sampleCount" : 50,
    "errorCount" : 0,
    "errorPct" : 0.0,
    "meanResTime" : 421.73999999999995,
    "medianResTime" : 332.0,
    "minResTime" : 292.0,
    "maxResTime" : 912.0,
    "pct1ResTime" : 787.3,
    "pct2ResTime" : 817.45,
    "pct3ResTime" : 912.0,
    "throughput" : 7.783312577833126,
    "receivedKBytesPerSec" : 5.351027397260274,
    "sentKBytesPerSec" : 566.5199593321918
  }
}