{
  "GET Buyer Product-ID" : {
    "transaction" : "GET Buyer Product-ID",
    "sampleCount" : 5,
    "errorCount" : 0,
    "errorPct" : 0.0,
    "meanResTime" : 333.6,
    "medianResTime" : 280.0,
    "minResTime" : 258.0,
    "maxResTime" : 585.0,
    "pct1ResTime" : 585.0,
    "pct2ResTime" : 585.0,
    "pct3ResTime" : 585.0,
    "throughput" : 0.8259002312520648,
    "receivedKBytesPerSec" : 0.9267181305748265,
    "sentKBytesPerSec" : 0.28148357490915094
  },
  "POST Register" : {
    "transaction" : "POST Register",
    "sampleCount" : 5,
    "errorCount" : 0,
    "errorPct" : 0.0,
    "meanResTime" : 1608.8,
    "medianResTime" : 1336.0,
    "minResTime" : 1185.0,
    "maxResTime" : 2527.0,
    "pct1ResTime" : 2527.0,
    "pct2ResTime" : 2527.0,
    "pct3ResTime" : 2527.0,
    "throughput" : 0.7661661048115231,
    "receivedKBytesPerSec" : 0.44293977934416184,
    "sentKBytesPerSec" : 1.1790278788691388
  },
  "POST Login" : {
    "transaction" : "POST Login",
    "sampleCount" : 5,
    "errorCount" : 0,
    "errorPct" : 0.0,
    "meanResTime" : 494.6,
    "medianResTime" : 332.0,
    "minResTime" : 323.0,
    "maxResTime" : 1072.0,
    "pct1ResTime" : 1072.0,
    "pct2ResTime" : 1072.0,
    "pct3ResTime" : 1072.0,
    "throughput" : 0.8729050279329609,
    "receivedKBytesPerSec" : 0.430485389752095,
    "sentKBytesPerSec" : 0.25488144858589384
  },
  "Total" : {
    "transaction" : "Total",
    "sampleCount" : 20,
    "errorCount" : 0,
    "errorPct" : 0.0,
    "meanResTime" : 1631.8,
    "medianResTime" : 1128.5,
    "minResTime" : 258.0,
    "maxResTime" : 4908.0,
    "pct1ResTime" : 4665.600000000002,
    "pct2ResTime" : 4900.95,
    "pct3ResTime" : 4908.0,
    "throughput" : 1.8019641409135958,
    "receivedKBytesPerSec" : 2357.954105521894,
    "sentKBytesPerSec" : 1.1507758300297324
  },
  "GET Buyer Product" : {
    "transaction" : "GET Buyer Product",
    "sampleCount" : 5,
    "errorCount" : 0,
    "errorPct" : 0.0,
    "meanResTime" : 4090.2,
    "medianResTime" : 3753.0,
    "minResTime" : 3442.0,
    "maxResTime" : 4908.0,
    "pct1ResTime" : 4908.0,
    "pct2ResTime" : 4908.0,
    "pct3ResTime" : 4908.0,
    "throughput" : 0.5462093074065982,
    "receivedKBytesPerSec" : 2857.7633624986347,
    "sentKBytesPerSec" : 0.20909575049158838
  }
}