timeStamp,elapsed,label,responseCode,responseMessage,threadName,dataType,success,failureMessage,bytes,sentBytes,grpThreads,allThreads,URL,Latency,IdleTime,Connect
1666671558956,1163,POST Register,201,Created,Auth to Seller Product (5 users; 1 second; 1 loop) 1-1,text,true,,592,1601,5,5,https://market-final-project.herokuapp.com/auth/register,1163,0,813
1666671559157,1126,POST Register,201,Created,Auth to Seller Product (5 users; 1 second; 1 loop) 1-2,text,true,,592,1538,5,5,https://market-final-project.herokuapp.com/auth/register,1126,0,790
1666671560120,327,POST Login,201,Created,Auth to Seller Product (5 users; 1 second; 1 loop) 1-1,text,true,,505,299,5,5,https://market-final-project.herokuapp.com/auth/login,327,0,0
1666671559358,1157,POST Register,201,Created,Auth to Seller Product (5 users; 1 second; 1 loop) 1-3,text,true,,592,1583,5,5,https://market-final-project.herokuapp.com/auth/register,1157,0,772
1666671560284,330,POST Login,201,Created,Auth to Seller Product (5 users; 1 second; 1 loop) 1-2,text,true,,505,299,5,5,https://market-final-project.herokuapp.com/auth/login,330,0,0
1666671559557,1142,POST Register,201,Created,Auth to Seller Product (5 users; 1 second; 1 loop) 1-4,text,true,,592,1574,5,5,https://market-final-project.herokuapp.com/auth/register,1142,0,769
1666671560516,331,POST Login,201,Created,Auth to Seller Product (5 users; 1 second; 1 loop) 1-3,text,true,,505,299,5,5,https://market-final-project.herokuapp.com/auth/login,331,0,0
1666671559756,1165,POST Register,201,Created,Auth to Seller Product (5 users; 1 second; 1 loop) 1-5,text,true,,592,1547,5,5,https://market-final-project.herokuapp.com/auth/register,1165,0,760
1666671560699,323,POST Login,201,Created,Auth to Seller Product (5 users; 1 second; 1 loop) 1-4,text,true,,505,299,5,5,https://market-final-project.herokuapp.com/auth/login,323,0,0
1666671560921,333,POST Login,201,Created,Auth to Seller Product (5 users; 1 second; 1 loop) 1-5,text,true,,505,299,5,5,https://market-final-project.herokuapp.com/auth/login,332,0,0
1666671560448,829,POST Seller Product,201,Created,Auth to Seller Product (5 users; 1 second; 1 loop) 1-1,text,true,,704,74542,5,5,https://market-final-project.herokuapp.com/seller/product,829,0,0
1666671560615,787,POST Seller Product,201,Created,Auth to Seller Product (5 users; 1 second; 1 loop) 1-2,text,true,,704,74494,5,5,https://market-final-project.herokuapp.com/seller/product,787,0,0
1666671561278,306,POST Seller Product,201,Created,Auth to Seller Product (5 users; 1 second; 1 loop) 1-1,text,true,,704,74486,5,5,https://market-final-project.herokuapp.com/seller/product,306,0,0
1666671560848,765,POST Seller Product,201,Created,Auth to Seller Product (5 users; 1 second; 1 loop) 1-3,text,true,,704,74510,5,5,https://market-final-project.herokuapp.com/seller/product,765,0,0
1666671561403,315,POST Seller Product,201,Created,Auth to Seller Product (5 users; 1 second; 1 loop) 1-2,text,true,,704,74494,5,5,https://market-final-project.herokuapp.com/seller/product,315,0,0
1666671561023,769,POST Seller Product,201,Created,Auth to Seller Product (5 users; 1 second; 1 loop) 1-4,text,true,,704,74566,5,5,https://market-final-project.herokuapp.com/seller/product,769,0,0
1666671561586,356,POST Seller Product,201,Created,Auth to Seller Product (5 users; 1 second; 1 loop) 1-1,text,true,,704,74510,5,5,https://market-final-project.herokuapp.com/seller/product,356,0,0
1666671561613,343,POST Seller Product,201,Created,Auth to Seller Product (5 users; 1 second; 1 loop) 1-3,text,true,,704,74518,5,5,https://market-final-project.herokuapp.com/seller/product,343,0,0
1666671561255,827,POST Seller Product,201,Created,Auth to Seller Product (5 users; 1 second; 1 loop) 1-5,text,true,,704,74494,5,5,https://market-final-project.herokuapp.com/seller/product,827,0,0
1666671561719,367,POST Seller Product,201,Created,Auth to Seller Product (5 users; 1 second; 1 loop) 1-2,text,true,,704,74534,5,5,https://market-final-project.herokuapp.com/seller/product,367,0,0
1666671561793,306,POST Seller Product,201,Created,Auth to Seller Product (5 users; 1 second; 1 loop) 1-4,text,true,,704,74510,5,5,https://market-final-project.herokuapp.com/seller/product,306,0,0
1666671561943,314,POST Seller Product,201,Created,Auth to Seller Product (5 users; 1 second; 1 loop) 1-1,text,true,,704,74510,5,5,https://market-final-project.herokuapp.com/seller/product,314,0,0
1666671561957,323,POST Seller Product,201,Created,Auth to Seller Product (5 users; 1 second; 1 loop) 1-3,text,true,,704,74558,5,5,https://market-final-project.herokuapp.com/seller/product,322,0,0
1666671562083,328,POST Seller Product,201,Created,Auth to Seller Product (5 users; 1 second; 1 loop) 1-5,text,true,,704,74518,5,5,https://market-final-project.herokuapp.com/seller/product,328,0,0
1666671562086,346,POST Seller Product,201,Created,Auth to Seller Product (5 users; 1 second; 1 loop) 1-2,text,true,,704,74494,5,5,https://market-final-project.herokuapp.com/seller/product,346,0,0
1666671562099,338,POST Seller Product,201,Created,Auth to Seller Product (5 users; 1 second; 1 loop) 1-4,text,true,,704,74534,5,5,https://market-final-project.herokuapp.com/seller/product,338,0,0
1666671562258,296,POST Seller Product,201,Created,Auth to Seller Product (5 users; 1 second; 1 loop) 1-1,text,true,,704,74566,5,5,https://market-final-project.herokuapp.com/seller/product,296,0,0
1666671562280,299,POST Seller Product,201,Created,Auth to Seller Product (5 users; 1 second; 1 loop) 1-3,text,true,,704,74502,5,5,https://market-final-project.herokuapp.com/seller/product,299,0,0
1666671562412,295,POST Seller Product,201,Created,Auth to Seller Product (5 users; 1 second; 1 loop) 1-5,text,true,,704,74510,5,5,https://market-final-project.herokuapp.com/seller/product,295,0,0
1666671562439,353,POST Seller Product,201,Created,Auth to Seller Product (5 users; 1 second; 1 loop) 1-4,text,true,,704,74510,5,5,https://market-final-project.herokuapp.com/seller/product,353,0,0
1666671562432,360,POST Seller Product,201,Created,Auth to Seller Product (5 users; 1 second; 1 loop) 1-2,text,true,,704,74486,5,5,https://market-final-project.herokuapp.com/seller/product,360,0,0
1666671562556,291,GET Seller Product,200,OK,Auth to Seller Product (5 users; 1 second; 1 loop) 1-1,text,true,,2610,348,5,5,https://market-final-project.herokuapp.com/seller/product,291,0,0
1666671562581,299,POST Seller Product,201,Created,Auth to Seller Product (5 users; 1 second; 1 loop) 1-3,text,true,,704,74550,5,5,https://market-final-project.herokuapp.com/seller/product,299,0,0
1666671562708,297,POST Seller Product,201,Created,Auth to Seller Product (5 users; 1 second; 1 loop) 1-5,text,true,,704,74550,5,5,https://market-final-project.herokuapp.com/seller/product,297,0,0
1666671562793,296,GET Seller Product,200,OK,Auth to Seller Product (5 users; 1 second; 1 loop) 1-2,text,true,,2610,348,5,5,https://market-final-project.herokuapp.com/seller/product,296,0,0
1666671562793,309,POST Seller Product,201,Created,Auth to Seller Product (5 users; 1 second; 1 loop) 1-4,text,true,,704,74558,5,5,https://market-final-project.herokuapp.com/seller/product,309,0,0
1666671562848,291,GET Seller Product-ID,200,OK,Auth to Seller Product (5 users; 1 second; 1 loop) 1-1,text,true,,743,354,5,5,https://market-final-project.herokuapp.com/seller/product/24566,291,0,0
1666671562881,285,GET Seller Product,200,OK,Auth to Seller Product (5 users; 1 second; 1 loop) 1-3,text,true,,2610,348,5,5,https://market-final-project.herokuapp.com/seller/product,285,0,0
1666671563006,300,POST Seller Product,201,Created,Auth to Seller Product (5 users; 1 second; 1 loop) 1-5,text,true,,704,74558,5,5,https://market-final-project.herokuapp.com/seller/product,300,0,0
1666671563103,268,GET Seller Product,200,OK,Auth to Seller Product (5 users; 1 second; 1 loop) 1-4,text,true,,2610,348,5,5,https://market-final-project.herokuapp.com/seller/product,268,0,0
1666671563090,283,GET Seller Product-ID,200,OK,Auth to Seller Product (5 users; 1 second; 1 loop) 1-2,text,true,,743,354,5,5,https://market-final-project.herokuapp.com/seller/product/24567,283,0,0
1666671563140,268,DELETE Product-ID,200,OK,Auth to Seller Product (5 users; 1 second; 1 loop) 1-1,text,true,,322,376,5,5,https://market-final-project.herokuapp.com/seller/product/24566,268,0,0
1666671563167,257,GET Seller Product-ID,200,OK,Auth to Seller Product (5 users; 1 second; 1 loop) 1-3,text,true,,743,354,4,4,https://market-final-project.herokuapp.com/seller/product/24569,257,0,0
1666671563307,341,GET Seller Product,200,OK,Auth to Seller Product (5 users; 1 second; 1 loop) 1-5,text,true,,2610,348,4,4,https://market-final-project.herokuapp.com/seller/product,341,0,0
1666671563372,287,GET Seller Product-ID,200,OK,Auth to Seller Product (5 users; 1 second; 1 loop) 1-4,text,true,,743,354,4,4,https://market-final-project.herokuapp.com/seller/product/24571,287,0,0
1666671563373,289,DELETE Product-ID,200,OK,Auth to Seller Product (5 users; 1 second; 1 loop) 1-2,text,true,,322,376,4,4,https://market-final-project.herokuapp.com/seller/product/24567,289,0,0
1666671563425,267,DELETE Product-ID,200,OK,Auth to Seller Product (5 users; 1 second; 1 loop) 1-3,text,true,,322,376,3,3,https://market-final-project.herokuapp.com/seller/product/24569,267,0,0
1666671563649,276,GET Seller Product-ID,200,OK,Auth to Seller Product (5 users; 1 second; 1 loop) 1-5,text,true,,743,354,2,2,https://market-final-project.herokuapp.com/seller/product/24574,276,0,0
1666671563660,274,DELETE Product-ID,200,OK,Auth to Seller Product (5 users; 1 second; 1 loop) 1-4,text,true,,322,376,2,2,https://market-final-project.herokuapp.com/seller/product/24571,274,0,0
1666671563926,271,DELETE Product-ID,200,OK,Auth to Seller Product (5 users; 1 second; 1 loop) 1-5,text,true,,322,376,1,1,https://market-final-project.herokuapp.com/seller/product/24574,271,0,0
