{
  "GET Buyer Product-ID" : {
    "transaction" : "GET Buyer Product-ID",
    "sampleCount" : 2,
    "errorCount" : 0,
    "errorPct" : 0.0,
    "meanResTime" : 294.0,
    "medianResTime" : 294.0,
    "minResTime" : 259.0,
    "maxResTime" : 329.0,
    "pct1ResTime" : 329.0,
    "pct2ResTime" : 329.0,
    "pct3ResTime" : 329.0,
    "throughput" : 0.14238929232521716,
    "receivedKBytesPerSec" : 0.15977079773601027,
    "sentKBytesPerSec" : 0.04852916310693436
  },
  "POST Register" : {
    "transaction" : "POST Register",
    "sampleCount" : 2,
    "errorCount" : 0,
    "errorPct" : 0.0,
    "meanResTime" : 1156.5,
    "medianResTime" : 1156.5,
    "minResTime" : 1115.0,
    "maxResTime" : 1198.0,
    "pct1ResTime" : 1198.0,
    "pct2ResTime" : 1198.0,
    "pct3ResTime" : 1198.0,
    "throughput" : 1.2345679012345678,
    "receivedKBytesPerSec" : 0.7137345679012346,
    "sentKBytesPerSec" : 1.9085165895061726
  },
  "POST Login" : {
    "transaction" : "POST Login",
    "sampleCount" : 2,
    "errorCount" : 0,
    "errorPct" : 0.0,
    "meanResTime" : 662.5,
    "medianResTime" : 662.5,
    "minResTime" : 331.0,
    "maxResTime" : 994.0,
    "pct1ResTime" : 994.0,
    "pct2ResTime" : 994.0,
    "pct3ResTime" : 994.0,
    "throughput" : 1.4104372355430184,
    "receivedKBytesPerSec" : 0.6955769569816643,
    "sentKBytesPerSec" : 0.4118366537376587
  },
  "Total" : {
    "transaction" : "Total",
    "sampleCount" : 8,
    "errorCount" : 0,
    "errorPct" : 0.0,
    "meanResTime" : 3257.5,
    "medianResTime" : 1054.5,
    "minResTime" : 259.0,
    "maxResTime" : 18327.0,
    "pct1ResTime" : 18327.0,
    "pct2ResTime" : 18327.0,
    "pct3ResTime" : 18327.0,
    "throughput" : 0.3946914006611081,
    "receivedKBytesPerSec" : 516.4721025642607,
    "sentKBytesPerSec" : 0.2527528183432829
  },
  "GET Buyer Product" : {
    "transaction" : "GET Buyer Product",
    "sampleCount" : 2,
    "errorCount" : 0,
    "errorPct" : 0.0,
    "meanResTime" : 10917.0,
    "medianResTime" : 10917.0,
    "minResTime" : 3507.0,
    "maxResTime" : 18327.0,
    "pct1ResTime" : 18327.0,
    "pct2ResTime" : 18327.0,
    "pct3ResTime" : 18327.0,
    "throughput" : 0.10912860806460414,
    "receivedKBytesPerSec" : 570.9601313976646,
    "sentKBytesPerSec" : 0.04177579527473127
  }
}