timeStamp,elapsed,label,responseCode,responseMessage,threadName,dataType,success,failureMessage,bytes,sentBytes,grpThreads,allThreads,URL,Latency,IdleTime,Connect
1666671352816,1242,POST Register,201,Created,Auth (10 users; 20 seconds; 1 loop) 1-1,text,true,,592,1507,1,1,https://market-final-project.herokuapp.com/auth/register,1242,0,870
1666671354059,344,POST Login,201,Created,Auth (10 users; 20 seconds; 1 loop) 1-1,text,true,,505,268,1,1,https://market-final-project.herokuapp.com/auth/login,344,0,0
1666671354816,1176,POST Register,201,Created,Auth (10 users; 20 seconds; 1 loop) 1-2,text,true,,592,1579,1,1,https://market-final-project.herokuapp.com/auth/register,1175,0,832
1666671355993,344,POST Login,201,Created,Auth (10 users; 20 seconds; 1 loop) 1-2,text,true,,505,268,1,1,https://market-final-project.herokuapp.com/auth/login,344,0,0
1666671356814,1097,POST Register,201,Created,Auth (10 users; 20 seconds; 1 loop) 1-3,text,true,,592,1579,1,1,https://market-final-project.herokuapp.com/auth/register,1097,0,769
1666671357911,326,POST Login,201,Created,Auth (10 users; 20 seconds; 1 loop) 1-3,text,true,,505,268,1,1,https://market-final-project.herokuapp.com/auth/login,326,0,0
1666671358816,1091,POST Register,201,Created,Auth (10 users; 20 seconds; 1 loop) 1-4,text,true,,592,1507,1,1,https://market-final-project.herokuapp.com/auth/register,1091,0,762
1666671359908,329,POST Login,201,Created,Auth (10 users; 20 seconds; 1 loop) 1-4,text,true,,505,268,1,1,https://market-final-project.herokuapp.com/auth/login,329,0,0
1666671360814,1121,POST Register,201,Created,Auth (10 users; 20 seconds; 1 loop) 1-5,text,true,,592,1561,1,1,https://market-final-project.herokuapp.com/auth/register,1121,0,788
1666671361936,328,POST Login,201,Created,Auth (10 users; 20 seconds; 1 loop) 1-5,text,true,,505,268,1,1,https://market-final-project.herokuapp.com/auth/login,328,0,0
1666671362814,1112,POST Register,201,Created,Auth (10 users; 20 seconds; 1 loop) 1-6,text,true,,592,1561,1,1,https://market-final-project.herokuapp.com/auth/register,1112,0,773
1666671363927,328,POST Login,201,Created,Auth (10 users; 20 seconds; 1 loop) 1-6,text,true,,505,268,1,1,https://market-final-project.herokuapp.com/auth/login,328,0,0
1666671364814,1185,POST Register,201,Created,Auth (10 users; 20 seconds; 1 loop) 1-7,text,true,,592,1543,1,1,https://market-final-project.herokuapp.com/auth/register,1185,0,835
1666671366000,345,POST Login,201,Created,Auth (10 users; 20 seconds; 1 loop) 1-7,text,true,,505,268,1,1,https://market-final-project.herokuapp.com/auth/login,345,0,0
1666671366815,1111,POST Register,201,Created,Auth (10 users; 20 seconds; 1 loop) 1-8,text,true,,592,1516,1,1,https://market-final-project.herokuapp.com/auth/register,1111,0,777
1666671367927,326,POST Login,201,Created,Auth (10 users; 20 seconds; 1 loop) 1-8,text,true,,505,268,1,1,https://market-final-project.herokuapp.com/auth/login,326,0,0
1666671368815,1096,POST Register,201,Created,Auth (10 users; 20 seconds; 1 loop) 1-9,text,true,,592,1588,1,1,https://market-final-project.herokuapp.com/auth/register,1096,0,769
1666671369912,343,POST Login,201,Created,Auth (10 users; 20 seconds; 1 loop) 1-9,text,true,,505,268,1,1,https://market-final-project.herokuapp.com/auth/login,343,0,0
1666671370817,1127,POST Register,201,Created,Auth (10 users; 20 seconds; 1 loop) 1-10,text,true,,592,1507,1,1,https://market-final-project.herokuapp.com/auth/register,1127,0,784
1666671371945,333,POST Login,201,Created,Auth (10 users; 20 seconds; 1 loop) 1-10,text,true,,505,268,1,1,https://market-final-project.herokuapp.com/auth/login,333,0,0
