{
  "articles": [
    {
      "title": "BCHN v26.0.0版本发布公告",
      "date": "08 January 2023",
      "author": "Bitcoin Cash Node Team",
      "img": "/static/thumbnail.png",
      "filename": "BCHN-v26-0-0版本发布公告",
      "tags": ["announcement", "chinese"]
    },
    {
      "title": "Announcing Bitcoin Cash Node v26.0.0",
      "date": "08 January 2023",
      "author": "Bitcoin Cash Node Team",
      "img": "/static/thumbnail.png",
      "filename": "Announcing-Bitcoin-Cash-Node-v26-0-0",
      "tags": ["announcement"]
    },
    {
      "title": "BCHN v25.0.0版本发布公告",
      "date": "30 November 2022",
      "author": "Bitcoin Cash Node Team",
      "img": "/static/thumbnail.png",
      "filename": "BCHN-v25-0-0版本发布公告",
      "tags": ["announcement", "chinese"]
    },
    {
      "title": "Announcing Bitcoin Cash Node v25.0.0",
      "date": "30 November 2022",
      "author": "Bitcoin Cash Node Team",
      "img": "/static/thumbnail.png",
      "filename": "Announcing-Bitcoin-Cash-Node-v25-0-0",
      "tags": ["announcement"]
    },
    {
      "title": "BCHN Technical Bulletin 2022-06-09 (Bitcoin Cash Pay-to-Script-Hash (P2SH): Past, Present, and Future)",
      "date": "09 June 2022",
      "author": "bitcoincashautist",
      "img": "/static/thumbnail.png",
      "filename": "BCHN-Technical-Bulletin-2022-06-09",
      "tags": ["technical-bulletin"]
    },
    {
      "title": "BCHN Financial Report 2022-06-07",
      "date": "07 June 2022",
      "author": "Bitcoin Cash Node Team",
      "img": "/static/thumbnail.png",
      "filename": "BCHN-Financial-Report-2022-06-07",
      "tags": ["financial-report"]
    },
    {
      "title": "BCHN v24.1.0版本发布公告",
      "date": "30 May 2022",
      "author": "Bitcoin Cash Node Team",
      "img": "/static/thumbnail.png",
      "filename": "BCHN-v24-1-0版本发布公告",
      "tags": ["announcement", "chinese"]
    },
    {
      "title": "Announcing Bitcoin Cash Node v24.1.0",
      "date": "30 May 2022",
      "author": "Bitcoin Cash Node Team",
      "img": "/static/thumbnail.png",
      "filename": "Announcing-Bitcoin-Cash-Node-v24-1-0",
      "tags": ["announcement"]
    },
    {
      "title": "BCHN Technical Bulletin 2022-05-16 (BCHN Network Architecture)",
      "date": "16 May 2022",
      "author": "matricz",
      "img": "/static/thumbnail.png",
      "filename": "BCHN-Technical-Bulletin-2022-05-16",
      "tags": ["technical-bulletin"]
    },
    {
      "title": "BCHN Technical Bulletin 2021-12-23 (Evaluate Viability of Transaction Format or ID Change)",
      "date": "23 December 2021",
      "author": "bitcoincashautist",
      "img": "/static/thumbnail.png",
      "filename": "BCHN-Technical-Bulletin-2021-12-23",
      "tags": ["technical-bulletin"]
    },
    {
      "title": "BCHN Financial Report 2021-11-24",
      "date": "24 November 2021",
      "author": "Bitcoin Cash Node Team",
      "img": "/static/thumbnail.png",
      "filename": "BCHN-Financial-Report-2021-11-24",
      "tags": ["financial-report"]
    },
    {
      "title": "BCHN v24.0.0版本发布公告",
      "date": "November 21 2021",
      "author": "Bitcoin Cash Node Team",
      "img": "/static/thumbnail.png",
      "filename": "BCHN-v24-0-0版本发布公告",
      "tags": ["announcement", "chinese"]
    },
    {
      "title": "Announcing Bitcoin Cash Node v24.0.0",
      "date": "November 21 2021",
      "author": "Bitcoin Cash Node Team",
      "img": "/static/thumbnail.png",
      "filename": "Announcing-Bitcoin-Cash-Node-v24-0-0",
      "tags": ["announcement"]
    },
    {
      "title": "Bitcoin Cash Upgrade 2022",
      "date": "November 15 2021",
      "author": "Bitcoin Cash Node Team",
      "img": "/static/thumbnail.png",
      "filename": "Bitcoin-Cash-Upgrade-2022-Statement",
      "tags": ["announcement"]
    },
    {
      "title": "BCHN Technical Bulletin 2021-10-31 (LMDB Preliminary Technical Report)",
      "date": "31 October 2021",
      "author": "matricz",
      "img": "/static/thumbnail.png",
      "filename": "BCHN-Technical-Bulletin-2021-10-31",
      "tags": ["technical-bulletin"]
    },
    {
      "title": "BCHN v23.1.0版本发布公告",
      "date": "August 15 2021",
      "author": "Bitcoin Cash Node Team",
      "img": "/static/thumbnail.png",
      "filename": "BCHN-v23-1-0版本发布公告",
      "tags": ["announcement", "chinese"]
    },
    {
      "title": "Announcing Bitcoin Cash Node v23.1.0",
      "date": "August 15 2021",
      "author": "Bitcoin Cash Node Team",
      "img": "/static/thumbnail.png",
      "filename": "Announcing-Bitcoin-Cash-Node-v23-1-0",
      "tags": ["announcement"]
    },
    {
      "title": "BCHN Financial Report 2021-06-11",
      "date": "11 June 2021",
      "author": "Bitcoin Cash Node Team",
      "img": "/static/thumbnail.png",
      "filename": "BCHN-Financial-Report-2021-06-11",
      "tags": ["financial-report"]
    },
    {
      "title": "How to set up a Bitcoin Cash Node on a Raspberry Pi 4 running Ubuntu Desktop 21.04",
      "date": "9 June 2021",
      "author": "Josh Wong",
      "img": "/static/thumbnail.png",
      "filename": "BCHN-on-raspberry-pi-2021-06",
      "tags": ["tutorial"]
    },
    {
      "title": "BCHN v23.0.0升级的5大亮点",
      "date": "19 April 2021",
      "author": "Bitcoin Cash Node Team",
      "img": "/static/thumbnail.png",
      "filename": "5-Awesome-Things-about-BCHN-v23_0_0_upgrade-zh",
      "tags": ["editorial", "chinese"]
    },
    {
      "title": "5 Awesome Things about BCHN v23.0.0 upgrade",
      "date": "19 April 2021",
      "author": "Bitcoin Cash Node Team",
      "img": "/static/thumbnail.png",
      "filename": "5-Awesome-Things-about-BCHN-v23_0_0_upgrade",
      "tags": ["editorial"]
    },
    {
      "title": "BCHN Financial Report 2021-04-17",
      "date": "17 April 2021",
      "author": "Bitcoin Cash Node Team",
      "img": "/static/thumbnail.png",
      "filename": "BCHN-Financial-Report-2021-04-17",
      "tags": ["financial-report"]
    },
    {
      "title": "BCHN v23.0.0版本发布公告",
      "date": "April 14 2021",
      "author": "Bitcoin Cash Node Team",
      "img": "/static/thumbnail.png",
      "filename": "BCHN-v23-0-0版本发布公告",
      "tags": ["announcement", "chinese"]
    },
    {
      "title": "Announcing Bitcoin Cash Node v23.0.0",
      "date": "April 14 2021",
      "author": "Bitcoin Cash Node Team",
      "img": "/static/thumbnail.png",
      "filename": "Announcing-Bitcoin-Cash-Node-v23-0-0",
      "tags": ["announcement"]
    },
    {
      "title": "BCHN Financial Report 2021-02-08",
      "date": "8 February 2021",
      "author": "Bitcoin Cash Node Team",
      "img": "/static/thumbnail.png",
      "filename": "BCHN-Financial-Report-2021-02-08",
      "tags": ["financial-report"]
    },
    {
      "title": "BCHN Financial Report 2020-12-05",
      "date": "5 December 2020",
      "author": "Bitcoin Cash Node Team",
      "img": "/static/thumbnail.png",
      "filename": "BCHN-Financial-Report-2020-12-05",
      "tags": ["financial-report"]
    },
    {
      "title": "BCHN v22.2.0版本发布公告",
      "date": "December 2 2020",
      "author": "Bitcoin Cash Node Team",
      "img": "/static/thumbnail.png",
      "filename": "BCHN-v22-2-0版本发布公告",
      "tags": ["announcement", "chinese"]
    },
    {
      "title": "Announcing Bitcoin Cash Node v22.2.0",
      "date": "December 2 2020",
      "author": "Bitcoin Cash Node Team",
      "img": "/static/thumbnail.png",
      "filename": "Announcing-Bitcoin-Cash-Node-v22-2-0",
      "tags": ["announcement"]
    },
    {
      "title": "BCHN Financial Report 2020-10-20",
      "date": "20 October 2020",
      "author": "Bitcoin Cash Node Team",
      "img": "/static/thumbnail.png",
      "filename": "BCHN-Financial-Report-2020-10-20",
      "tags": ["financial-report"]
    },
    {
      "title": "BCHN v22.1.0版本发布公告",
      "date": "16 October 2020",
      "author": "Bitcoin Cash Node Team",
      "img": "/static/thumbnail.png",
      "filename": "BCHNv22_1_0版本发布公告",
      "tags": ["chinese", "announcement"]
    },
    {
      "title": "Announcing Bitcoin Cash Node v22.1.0",
      "date": "16 October 2020",
      "author": "Bitcoin Cash Node Team",
      "img": "/static/thumbnail.png",
      "filename": "Announcing-Bitcoin-Cash-Node-v22-1-0",
      "tags": ["announcement"]
    },
    {
      "title": "BCHN Financial Report 2020-09-03",
      "date": "3 September 2020",
      "author": "Bitcoin Cash Node Team",
      "img": "/static/thumbnail.png",
      "filename": "BCHN-Financial-Report-2020-09-03",
      "tags": ["financial-report"]
    },
    {
      "title": "BCHN v22.0.0版本发布公告",
      "date": "17 August 2020",
      "author": "Bitcoin Cash Node Team",
      "img": "/static/thumbnail.png",
      "filename": "BCHNv22版本发布公告",
      "tags": ["chinese", "announcement"]
    },
    {
      "title": "Announcing Bitcoin Cash Node v22.0.0",
      "date": "17 August 2020",
      "author": "Bitcoin Cash Node Team",
      "img": "/static/thumbnail.png",
      "filename": "Announcing-Bitcoin-Cash-Node-v22-0-0",
      "tags": ["announcement"]
    },
    {
      "title": "BCHN就11月份BCH升级的常见问题集锦",
      "date": "12 August 2020",
      "author": "Bitcoin Cash Node Team",
      "img": "/static/thumbnail.png",
      "filename": "BCHN就11月份BCH升级的常见问题集锦",
      "tags": ["chinese", "faq"]
    },
    {
      "title": "BCHN FAQ on November 2020 Bitcoin Cash network upgrade",
      "date": "5 August 2020",
      "author": "Bitcoin Cash Node Team",
      "img": "/static/thumbnail.png",
      "filename": "BCHN-FAQ-on-November-2020-Bitcoin-Cash-network-upgrade",
      "tags": ["faq"]
    },
    {
      "title": "BCHN Survey of Chinese Ecosystem about DAA Change in November",
      "date": "12 July 2020",
      "author": "Bitcoin Cash Node Team",
      "img": "/static/thumbnail.png",
      "filename": "BCHN-Survey-of-Chinese-Ecosystem-about-DAA-Change-in-November",
      "tags": ["survey"]
    },
    {
      "title": "BCHN Financial Report 2020-07-07",
      "date": "7 July 2020",
      "author": "Bitcoin Cash Node Team",
      "img": "/static/thumbnail.png",
      "filename": "BCHN-Financial-Report-2020-07-07",
      "tags": ["financial-report"]
    },
    {
      "title": "BCHN 首席维护者报告（2020年6月15日）",
      "date": "17 June 2020",
      "author": "Bitcoin Cash Node Team",
      "img": "/static/thumbnail.png",
      "filename": "BCHN 首席维护者报告-2020年6月15日",
      "tags": ["chinese", "survey"]
    },
    {
      "title": "Bitcoin Cash Node Community Survey - June 2020",
      "date": "17 June 2020",
      "author": "Bitcoin Cash Node Team",
      "img": "/static/thumbnail.png",
      "filename": "survey-june-2020",
      "tags": ["survey"]
    },
    {
      "title": "BCHN lead maintainer report 2020-06-15",
      "date": "15 June 2020",
      "author": "freeetrader",
      "img": "/static/thumbnail.png",
      "filename": "BCHN-lead-maintainer-report-2020-06-15",
      "tags": ["maintainer-report"]
    },
    {
      "title": "Bitcoin Cash Node: Vision and Objectives",
      "date": "12 June 2020",
      "author": "Bitcoin Cash Node Team",
      "img": "/static/thumbnail.png",
      "filename": "Bitcoin-Cash-Node-Vision-and-Objectives",
      "tags": ["announcement"]
    },
    {
      "title": "BCHN welcomes Tracy Chen as Representative",
      "date": "4 June 2020",
      "author": "Bitcoin Cash Node Team",
      "img": "/static/img/team/tracy_chen.jpg",
      "filename": "BCHN-welcomes-Tracy-Chen-as-Representative",
      "tags": ["announcement"]
    },
    {
      "title": "BCHN Financial Report 2020-06-03",
      "date": "3 June 2020",
      "author": "Bitcoin Cash Node Team",
      "img": "/static/thumbnail.png",
      "filename": "BCHN-Financial-Report-2020-06-03",
      "tags": ["financial-report"]
    },
    {
      "title": "关于发布BCHN版本0.21.2的公告",
      "date": "20 May 2020",
      "author": "Bitcoin Cash Node Team",
      "img": "/static/thumbnail.png",
      "filename": "关于发布BCHN版本0-21-2的公告",
      "tags": ["chinese", "announcement"]
    },
    {
      "title": "Announcing Bitcoin Cash Node v0.21.2",
      "date": "20 May 2020",
      "author": "Bitcoin Cash Node Team",
      "img": "/static/thumbnail.png",
      "filename": "Announcing-Bitcoin-Cash-Node-v0-21-2",
      "tags": ["announcement"]
    },
    {
      "title": "BCHN Technical Bulletin 2020-05-04",
      "date": "4 May 2020",
      "author": "Calin Culianu",
      "img": "/static/thumbnail.png",
      "filename": "BCHN-Technical-Bulletin-2020-05-04",
      "tags": ["technical-bulletin"]
    },
    {
      "title": "Bitcoin Cash Node Korean 비트 코인 캐시 노드 한국어",
      "date": "3 May 2020",
      "author": "Bitcoin Cash Node Team",
      "img": "/static/thumbnail.png",
      "filename": "Bitcoin-Cash-Node-Korean-비트-코인-캐시-노드-한국어"
    },
    {
      "title": "Informe del responsable de mantenimiento de BCHN 15-04-2020",
      "date": "29 April 2020",
      "author": "freeetrader",
      "img": "/static/img/unsplash/city-complete.jpg",
      "filename": "Informe-del-responsable-de-mantenimiento-de-BCHN-15-04-2020",
      "tags": ["spanish"]
    },
    {
      "title": "BCHN flipstarted - thank you to the community!",
      "date": "27 April 2020",
      "author": "Bitcoin Cash Node Team",
      "img": "/static/img/unsplash/city-complete.jpg",
      "filename": "bchn-flipstarted",
      "tags": ["announcement"]
    },
    {
      "title": "BCHN首席开发者维护工作报告（2020年4月15日）",
      "date": "22 April 2020",
      "author": "freetrader",
      "img": "/static/img/unsplash/city-complete.jpg",
      "filename": "BCHN首席开发者维护工作报告2020年4月15日",
      "tags": ["chinese", "announcement"]
    },
    {
      "title": "关于发布BCHN版本0.21.1的公告",
      "date": "17 April 2020",
      "author": "Bitcoin Cash Node Team",
      "img": "/static/thumbnail.png",
      "filename": "关于发布BCHN版本0-21-1的公告",
      "tags": ["chinese", "announcement"]
    },
    {
      "title": "Anunciando Bitcoin Cash Node v0.21.1",
      "date": "16 April 2020",
      "author": "Bitcoin Cash Node Team",
      "img": "/static/thumbnail.png",
      "filename": "Anunciando-Bitcoin-Cash-Node-v0-21-1",
      "tags": ["spanish", "announcement"]
    },
    {
      "title": "Announcing Bitcoin Cash Node v0.21.1",
      "date": "16 April 2020",
      "author": "Bitcoin Cash Node Team",
      "img": "/static/thumbnail.png",
      "filename": "Announcing-Bitcoin-Cash-Node-v0-21-1",
      "tags": ["announcement"]
    },
    {
      "title": "BCHN lead maintainer report 2020-04-15",
      "date": "16 April 2020",
      "author": "freeetrader",
      "img": "/static/thumbnail.png",
      "filename": "BCHN-lead-maintainer-report-2020-04-15",
      "tags": ["maintainer-report"]
    },
    {
      "title": "BCHN客户端首席维护者的工作汇报（2020-03-31）",
      "date": "31 March 2020",
      "author": "freetrader",
      "img": "/static/thumbnail.png",
      "filename": "BCHN客户端首席维护者的工作汇报-2020-03-31",
      "tags": ["chinese", "maintainer-report"]
    },
    {
      "title": "BCHN lead maintainer report 2020-03-31",
      "date": "31 March 2020",
      "author": "freetrader",
      "img": "/static/thumbnail.png",
      "filename": "lead-maintainer-report-march-31-2020",
      "tags": ["maintainer-report"]
    },
    {
      "title": "BCHN客户端关于BCH5月份升级的技术规范公告",
      "date": "27 March 2020",
      "author": "Bitcoin Cash Node Team",
      "img": "/static/thumbnail.png",
      "filename": "BCHN客户端关于BCH5月份升级的技术规范公告",
      "tags": ["chinese", "announcement"]
    },
    {
      "title": "Anúncio do BCHN sobre as especificações de atualização do Bitcoin Cash (BCH) - Português",
      "date": "25 March 2020",
      "author": "phabulu",
      "img": "/static/thumbnail.png",
      "filename": "Anúncio-d-BCHN-sobre-as-especificações-de-atualização-do-Bitcoin-Cash-BCH-Portuguêss"
    },
    {
      "title": "BCHN announcement regarding Bitcoin Cash upgrade specifications",
      "date": "25 March 2020",
      "author": "Bitcoin Cash Node Team",
      "img": "/static/thumbnail.png",
      "filename": "BCHN-announcement-regarding-Bitcoin-Cash-(BCH)-upgrade-specifications",
      "tags": ["announcement"]
    },
    {
      "title": "Bitcoin Cash Node 2020: plans for May upgrade and beyond",
      "date": "22 March 2020",
      "author": "Bitcoin Cash Node Team",
      "img": "/static/thumbnail.png",
      "filename": "Bitcoin-Cash-Node-2020-plans-for-May-upgrade-and-beyond",
      "tags": ["announcement"]
    },
    {
      "title": "BCHN的5月份升级规划和未来工作计划",
      "date": "18 March 2020",
      "author": "Bitcoin Cash Node Team",
      "img": "/static/thumbnail.png",
      "filename": "BCHN的5月份升级规划和未来工作计划",
      "tags": ["chinese", "announcement"]
    },
    {
      "title": "BCHN客户端首席维护者的工作汇报 (2020-03-14)",
      "date": "17 March 2020",
      "author": "freetrader",
      "img": "/static/thumbnail.png",
      "filename": "BCHN客户端首席维护者的工作汇报-2020-03-14",
      "tags": ["chinese", "maintainer-report"]
    },
    {
      "title": "Bitcoin Cash Node Community Survey - March 2020",
      "date": "14 March 2020",
      "author": "Bitcoin Cash Node Team",
      "img": "/static/thumbnail.png",
      "filename": "march-2020-survey",
      "tags": ["survey"]
    },
    {
      "title": "Pesquisa da comunidade Bitcoin Cash Node - março de 2020",
      "date": "14 March 2020",
      "author": "phabulu",
      "img": "/static/thumbnail.png",
      "filename": "março-2020-survey"
    },
    {
      "title": "BCHN lead maintainer report 2020-03-14",
      "date": "14 March 2020",
      "author": "freetrader",
      "img": "/static/thumbnail.png",
      "filename": "lead-maintainer-report-march-2020",
      "tags": ["maintainer-report"]
    },
    {
      "title": "Bitcoin Cash Node - Portuguese",
      "date": "02 March 2020",
      "author": "phabulu",
      "img": "/static/thumbnail.png",
      "filename": "Bitcoin-Cash-Node-Portuguese"
    },
    {
      "title": "Bitcoin Cash Node 2020: planos para atualização de maio e adiante.",
      "date": "04 March 2020",
      "author": "phabulu",
      "img": "/static/thumbnail.png",
      "filename": "Bitcoin-Cash-Node-2020-planos-para-atualização-de-maio-e-adiante"
    },
    {
      "title": "El plan de trabajo de «BCH Node» ante la actualización del 15 de mayo",
      "date": "03 March 2020",
      "author": "DarthRoison",
      "img": "/static/thumbnail.png",
      "filename": "El-plan-de-trabajo-de-BCH-Node-ante-la-actualización-del-15-de-mayo"
    },
    {
      "title": "Signatures in support of Bitcoin Cash Node",
      "date": "26 February 2020",
      "author": "Bitcoin Cash Node Team",
      "img": "/static/thumbnail.png",
      "filename": "Signatures-in-support-of-Bitcoin-Cash-Node",
      "tags": ["announcement"]
    },
    {
      "title": "ビットコインキャッシュノード（Bitcoin Cash Node)",
      "date": "21 February 2020",
      "author": "emergent_reasons",
      "img": "/static/thumbnail.png",
      "filename": "Announcing-Bitcoin-Cash-Node-Japanese"
    },
    {
      "title": "Bitcoin Cash Node客户端即将发布",
      "date": "20 February 2020",
      "author": "Bitcoin Cash Node Team",
      "img": "/static/thumbnail.png",
      "filename": "Bitcoin-Cash-Node客户端即将发布",
      "tags": ["chinese", "announcement"]
    },
    {
      "title": "Announcing Bitcoin Cash Node",
      "date": "20 February 2020",
      "author": "Bitcoin Cash Node Team",
      "img": "/static/thumbnail.png",
      "filename": "Announcing-Bitcoin-Cash-Node",
      "tags": ["announcement"]
    }
  ]
}
