<svg width="24" height="24" viewBox="0 0 26 19" fill="none" xmlns="http://www.w3.org/2000/svg">
    <g id="root">
        <rect width="26" height="3" rx="1.5" transform="matrix(-1 0 0 1 26 0)"/>
        <rect width="14" height="3" rx="1.5" transform="matrix(-1 0 0 1 14 8)"/>
        <rect width="26" height="3" rx="1.5" transform="matrix(-1 0 0 1 26 16)"/>
    </g>
</svg>
