{
  "name": "classnames",
  "description": "Haxe utility for conditionally joining classNames together.",
  "version": "0.1.2",
  "releasenote": "Haxe 4 compatibility (See CHANGELOG.md)",
  "url": "https://github.com/kLabz/haxe-classnames",
  "license": "MIT",
  "tags": [],
  "classPath": "src",
  "contributors": [
    "klabz"
  ]
}
