<svg width="32" height="32" viewBox="0 0 32 32" fill="none" xmlns="http://www.w3.org/2000/svg">
<path d="M13 13V26" stroke="#49536E" stroke-width="1.5" stroke-linecap="round" stroke-linejoin="round"/>
<path d="M4 13H28" stroke="#49536E" stroke-width="1.5" stroke-linecap="round" stroke-linejoin="round"/>
<path d="M27 6H5C4.44772 6 4 6.44772 4 7V25C4 25.5523 4.44772 26 5 26H27C27.5523 26 28 25.5523 28 25V7C28 6.44772 27.5523 6 27 6Z" stroke="#49536E" stroke-width="1.5" stroke-linecap="round" stroke-linejoin="round"/>
</svg>
