<?xml version="1.0" encoding="utf-8"?>
<!-- Generator: Adobe Illustrator 22.0.1, SVG Export Plug-In . SVG Version: 6.00 Build 0)  -->
<svg version="1.1" id="Layer_1" xmlns="http://www.w3.org/2000/svg" xmlns:xlink="http://www.w3.org/1999/xlink" x="0px" y="0px"
	 viewBox="0 0 152 150" style="enable-background:new 0 0 152 150;" xml:space="preserve">
<style type="text/css">
	.st0{fill:none;stroke:#4A5261;stroke-width:7;stroke-linecap:round;}
	.st1{fill:#4A5261;}
	.st2{fill:#6FAC2F;}
</style>
<g>
	<g>
		<path class="st0" d="M58.6,114.8c30.3,0,54.9-24.7,54.9-55.2c0-30.5-24.6-55.2-54.9-55.2C28.3,4.3,3.7,29,3.7,59.5
			c0,10.3,2.8,19.9,7.6,28.1"/>
		<path class="st1" d="M96.9,103.3l8-8l10.8,10.8l-8,8L96.9,103.3z"/>
		<path class="st2" d="M106.8,114.9l9.3-9.3c2.4-2.4,6.2-2.4,8.6,0l22.8,22.8c4.9,4.9,4.9,12.9,0,17.9s-12.9,4.9-17.9,0l-22.8-22.8
			C104.4,121.1,104.4,117.2,106.8,114.9z"/>
	</g>
	<g>
		<path class="st1" d="M25.3,95.3c-2,2.3-1.7,5.8,0.6,7.7l8.9,7.8c2.3,2,5.8,1.8,7.7-0.5l0.7-0.8c2-2.3,1.7-5.8-0.6-7.7l-9-7.8
			c-2.3-2-5.8-1.8-7.7,0.5C26,94.5,25.3,95.3,25.3,95.3z M19.6,90.4l0.8-0.9c4.3-5,11.9-5.5,16.9-1.2l10.4,9.1
			c5,4.4,5.5,11.9,1.2,16.9l-0.8,0.9c-4.3,5-11.9,5.5-16.9,1.2l-10.4-9.1C15.8,103,15.3,95.4,19.6,90.4L19.6,90.4z"/>
		<path class="st1" d="M43.6,94.1c-0.1,1.7-1.7,3-3.4,2.9c0,0,0,0,0,0c-1.7-0.2-3-1.7-2.9-3.4l0.8-9.3c0.1-1.7,1.7-3,3.4-2.9
			c0,0,0,0,0,0c1.7,0.2,3,1.7,2.9,3.4L43.6,94.1z M26.8,113.8c1.7,0,3.1-1.4,3.1-3.1c0,0,0,0,0,0c0-1.7-1.4-3.1-3.1-3.1l-9.2,0
			c-1.7,0-3.1,1.4-3.1,3.1c0,0,0,0,0,0c0,1.7,1.4,3.1,3.1,3.1C17.7,113.8,26.8,113.8,26.8,113.8z"/>
	</g>
</g>
</svg>
