{
  "kind": "collectionType",
  "collectionName": "recipes",
  "info": {
    "name": "Recipes"
  },
  "options": {
    "increments": true,
    "timestamps": true
  },
  "attributes": {
    "Name": {
      "type": "string",
      "required": true
    },
    "Checkpoint": {
      "type": "richtext"
    },
    "Slug": {
      "type": "string",
      "required": true
    },
    "Serving": {
      "type": "integer"
    },
    "Preparation": {
      "type": "richtext"
    },
    "Direction": {
      "type": "richtext"
    },
    "Photobooth": {
      "collection": "file",
      "via": "related",
      "allowedTypes": [
        "images",
        "files",
        "videos"
      ],
      "plugin": "upload",
      "required": false
    },
    "Coverphoto": {
      "model": "file",
      "via": "related",
      "allowedTypes": [
        "images",
        "files",
        "videos"
      ],
      "plugin": "upload",
      "required": false
    },
    "categories": {
      "via": "recipes",
      "collection": "categories",
      "dominant": true
    },
    "styles": {
      "via": "recipes",
      "collection": "styles",
      "dominant": true
    },
    "IngredientServing": {
      "type": "component",
      "repeatable": true,
      "component": "recipe.ingredient-serving"
    },
    "Description": {
      "type": "richtext"
    },
    "Sorting": {
      "type": "integer",
      "default": 0
    },
    "Publish": {
      "type": "boolean",
      "default": true,
      "required": true
    }
  }
}
