%!PS-Adobe-3.0 EPSF-3.0
%%Creator: cairo 1.10.2 (http://cairographics.org)
%%CreationDate: Wed Sep 16 09:43:32 2015
%%Pages: 1
%%BoundingBox: 0 -1 303 315
%%DocumentData: Clean7Bit
%%LanguageLevel: 2
%%EndComments
%%BeginProlog
/cairo_eps_state save def
/dict_count countdictstack def
/op_count count 1 sub def
userdict begin
/q { gsave } bind def
/Q { grestore } bind def
/cm { 6 array astore concat } bind def
/w { setlinewidth } bind def
/J { setlinecap } bind def
/j { setlinejoin } bind def
/M { setmiterlimit } bind def
/d { setdash } bind def
/m { moveto } bind def
/l { lineto } bind def
/c { curveto } bind def
/h { closepath } bind def
/re { exch dup neg 3 1 roll 5 3 roll moveto 0 rlineto
      0 exch rlineto 0 rlineto closepath } bind def
/S { stroke } bind def
/f { fill } bind def
/f* { eofill } bind def
/n { newpath } bind def
/W { clip } bind def
/W* { eoclip } bind def
/BT { } bind def
/ET { } bind def
/pdfmark where { pop globaldict /?pdfmark /exec load put }
    { globaldict begin /?pdfmark /pop load def /pdfmark
    /cleartomark load def end } ifelse
/BDC { mark 3 1 roll /BDC pdfmark } bind def
/EMC { mark /EMC pdfmark } bind def
/cairo_store_point { /cairo_point_y exch def /cairo_point_x exch def } def
/Tj { show currentpoint cairo_store_point } bind def
/TJ {
  {
    dup
    type /stringtype eq
    { show } { -0.001 mul 0 cairo_font_matrix dtransform rmoveto } ifelse
  } forall
  currentpoint cairo_store_point
} bind def
/cairo_selectfont { cairo_font_matrix aload pop pop pop 0 0 6 array astore
    cairo_font exch selectfont cairo_point_x cairo_point_y moveto } bind def
/Tf { pop /cairo_font exch def /cairo_font_matrix where
      { pop cairo_selectfont } if } bind def
/Td { matrix translate cairo_font_matrix matrix concatmatrix dup
      /cairo_font_matrix exch def dup 4 get exch 5 get cairo_store_point
      /cairo_font where { pop cairo_selectfont } if } bind def
/Tm { 2 copy 8 2 roll 6 array astore /cairo_font_matrix exch def
      cairo_store_point /cairo_font where { pop cairo_selectfont } if } bind def
/g { setgray } bind def
/rg { setrgbcolor } bind def
/d1 { setcachedevice } bind def
%%EndProlog
%%Page: 1 1
%%BeginPageSetup
%%PageBoundingBox: 0 -1 303 315
%%EndPageSetup
q 0 -1 303 316 rectclip q
0 314.197 303 -315 re W n
0 g
297.508 241.838 m 265.426 254.779 l 263.465 265.139 255.594 273.428 
245.469 276.002 c 243.73 295.998 l 243.484 298.849 241.57 301.283 
238.855 302.197 c 236.145 303.111 233.148 302.33 231.223 300.209 c 
222.832 290.951 l 217.68 308.974 l 216.824 311.978 214.129 314.084 
211.008 314.193 c 207.891 314.291 205.055 312.389 203.988 309.451 c 
159.562 186.885 l 127.602 178.584 99.691 158.135 82.551 130.303 c 
66.852 104.814 61.973 75.611 68.82 48.076 c 72.82 31.982 80.414 21.377 
88.188 14.424 c 82.074 14.424 l 82.016 14.424 81.961 14.424 81.902 
14.42 c 52.996 13.717 26.203 30.15 13.695 56.267 c 11.977 59.853 7.676 
61.365 4.09 59.65 c 0.504 57.932 -1.012 53.631 0.707 50.045 c 15.355 
19.467 46.371 0.002 80.137 0.002 c 217.602 0.002 l 221.578 0.002 
224.801 3.224 224.801 7.201 c 224.801 26.58 209.344 35.416 195.699 
38.658 c 202.078 51.092 202.629 62.033 201.906 69.185 c 203.789 69.439 
l 246.941 3.267 l 248.273 1.228 250.539 0.002 252.973 0.002 c 279.176 
0.002 l 281.801 0.002 284.215 1.428 285.48 3.721 c 286.746 6.017 
286.668 8.818 285.27 11.037 c 284.988 11.478 257.938 54.435 243.391 
78.486 c 243.391 199.467 l 245.531 199.221 247.938 199.096 250.059 
199.096 c 270.945 199.096 290.59 210.881 301.168 231.775 c 301.176 
231.791 301.449 232.357 301.492 232.467 c 302.98 236.154 301.195 
240.349 297.508 241.838 c h
297.508 241.838 m f
Q Q
showpage
%%Trailer
count op_count sub {pop} repeat
countdictstack dict_count sub {end} repeat
cairo_eps_state restore
%%EOF
