%!PS-Adobe-3.0 EPSF-3.0
%%Creator: cairo 1.10.2 (http://cairographics.org)
%%CreationDate: Fri Oct 10 08:24:12 2014
%%Pages: 1
%%BoundingBox: 0 -1 126 190
%%DocumentData: Clean7Bit
%%LanguageLevel: 2
%%EndComments
%%BeginProlog
/cairo_eps_state save def
/dict_count countdictstack def
/op_count count 1 sub def
userdict begin
/q { gsave } bind def
/Q { grestore } bind def
/cm { 6 array astore concat } bind def
/w { setlinewidth } bind def
/J { setlinecap } bind def
/j { setlinejoin } bind def
/M { setmiterlimit } bind def
/d { setdash } bind def
/m { moveto } bind def
/l { lineto } bind def
/c { curveto } bind def
/h { closepath } bind def
/re { exch dup neg 3 1 roll 5 3 roll moveto 0 rlineto
      0 exch rlineto 0 rlineto closepath } bind def
/S { stroke } bind def
/f { fill } bind def
/f* { eofill } bind def
/n { newpath } bind def
/W { clip } bind def
/W* { eoclip } bind def
/BT { } bind def
/ET { } bind def
/pdfmark where { pop globaldict /?pdfmark /exec load put }
    { globaldict begin /?pdfmark /pop load def /pdfmark
    /cleartomark load def end } ifelse
/BDC { mark 3 1 roll /BDC pdfmark } bind def
/EMC { mark /EMC pdfmark } bind def
/cairo_store_point { /cairo_point_y exch def /cairo_point_x exch def } def
/Tj { show currentpoint cairo_store_point } bind def
/TJ {
  {
    dup
    type /stringtype eq
    { show } { -0.001 mul 0 cairo_font_matrix dtransform rmoveto } ifelse
  } forall
  currentpoint cairo_store_point
} bind def
/cairo_selectfont { cairo_font_matrix aload pop pop pop 0 0 6 array astore
    cairo_font exch selectfont cairo_point_x cairo_point_y moveto } bind def
/Tf { pop /cairo_font exch def /cairo_font_matrix where
      { pop cairo_selectfont } if } bind def
/Td { matrix translate cairo_font_matrix matrix concatmatrix dup
      /cairo_font_matrix exch def dup 4 get exch 5 get cairo_store_point
      /cairo_font where { pop cairo_selectfont } if } bind def
/Tm { 2 copy 8 2 roll 6 array astore /cairo_font_matrix exch def
      cairo_store_point /cairo_font where { pop cairo_selectfont } if } bind def
/g { setgray } bind def
/rg { setrgbcolor } bind def
/d1 { setcachedevice } bind def
%%EndProlog
%%Page: 1 1
%%BeginPageSetup
%%PageBoundingBox: 0 -1 126 190
%%EndPageSetup
q 0 -1 126 191 rectclip q
0 189.295 126 -190 re W n
0 g
125.957 8.858 m 125.039 16.487 116.613 17.35 111.711 16.827 c 106.496 
36.471 124.691 65.749 125.762 72.682 c 126.914 80.131 120.438 123.483 
119.754 145.432 c 119.047 167.967 86.32 192.842 80.855 188.877 c 75.441 
182.889 88.656 174.807 81.699 167.881 c 74.98 161.186 73.23 156.686 
68.242 149.112 c 55.461 129.71 90.094 129.463 90.094 129.463 c 90.094 
129.463 62.988 109.377 56.957 99.252 c 51.406 89.924 49.074 79.495 
42.375 70.702 c 27.098 50.659 30.539 15.717 30.539 15.717 c 30.539 
15.717 1.605 25.186 17.527 58.221 c 29.652 83.37 35.621 120.479 8.348 
110.936 c -2.203 107.245 10.707 99.475 12.938 96.987 c 20.391 88.667 
14.09 74.67 9.598 66.577 c -2.434 44.905 -6.801 22.198 18.52 8.198 c 
29.77 1.975 44.965 0.436 60.258 0.21 c 99.168 0.1 l 111.988 -0.54 
126.488 1.858 125.957 8.858 c h
125.957 8.858 m f
Q Q
showpage
%%Trailer
count op_count sub {pop} repeat
countdictstack dict_count sub {end} repeat
cairo_eps_state restore
%%EOF
