%!PS-Adobe-3.0 EPSF-3.0
%%Creator: cairo 1.10.2 (http://cairographics.org)
%%CreationDate: Fri Jul  4 09:53:02 2014
%%Pages: 1
%%BoundingBox: 0 -1 73 53
%%DocumentData: Clean7Bit
%%LanguageLevel: 2
%%EndComments
%%BeginProlog
/cairo_eps_state save def
/dict_count countdictstack def
/op_count count 1 sub def
userdict begin
/q { gsave } bind def
/Q { grestore } bind def
/cm { 6 array astore concat } bind def
/w { setlinewidth } bind def
/J { setlinecap } bind def
/j { setlinejoin } bind def
/M { setmiterlimit } bind def
/d { setdash } bind def
/m { moveto } bind def
/l { lineto } bind def
/c { curveto } bind def
/h { closepath } bind def
/re { exch dup neg 3 1 roll 5 3 roll moveto 0 rlineto
      0 exch rlineto 0 rlineto closepath } bind def
/S { stroke } bind def
/f { fill } bind def
/f* { eofill } bind def
/n { newpath } bind def
/W { clip } bind def
/W* { eoclip } bind def
/BT { } bind def
/ET { } bind def
/pdfmark where { pop globaldict /?pdfmark /exec load put }
    { globaldict begin /?pdfmark /pop load def /pdfmark
    /cleartomark load def end } ifelse
/BDC { mark 3 1 roll /BDC pdfmark } bind def
/EMC { mark /EMC pdfmark } bind def
/cairo_store_point { /cairo_point_y exch def /cairo_point_x exch def } def
/Tj { show currentpoint cairo_store_point } bind def
/TJ {
  {
    dup
    type /stringtype eq
    { show } { -0.001 mul 0 cairo_font_matrix dtransform rmoveto } ifelse
  } forall
  currentpoint cairo_store_point
} bind def
/cairo_selectfont { cairo_font_matrix aload pop pop pop 0 0 6 array astore
    cairo_font exch selectfont cairo_point_x cairo_point_y moveto } bind def
/Tf { pop /cairo_font exch def /cairo_font_matrix where
      { pop cairo_selectfont } if } bind def
/Td { matrix translate cairo_font_matrix matrix concatmatrix dup
      /cairo_font_matrix exch def dup 4 get exch 5 get cairo_store_point
      /cairo_font where { pop cairo_selectfont } if } bind def
/Tm { 2 copy 8 2 roll 6 array astore /cairo_font_matrix exch def
      cairo_store_point /cairo_font where { pop cairo_selectfont } if } bind def
/g { setgray } bind def
/rg { setrgbcolor } bind def
/d1 { setcachedevice } bind def
%%EndProlog
%%Page: 1 1
%%BeginPageSetup
%%PageBoundingBox: 0 -1 73 53
%%EndPageSetup
q 0 -1 73 54 rectclip q
0 52.627 73 -53 re W n
0 g
12.863 11.987 m 4.34 11.987 l 4.34 11.987 0 11.99 0 5.381 c 0.207 1.108 
3.539 0.424 4.133 0.424 c 21.492 0.424 l 21.492 0.424 25.84 0.42 26.031 
5.639 c 26.039 5.838 26.055 5.643 26.059 5.842 c 26.066 6.615 26.059 
10.596 26.059 10.596 c 26.066 11.162 26.5 11.803 27.082 11.803 c 40.676 
11.803 l 40.875 11.803 41.047 11.643 41.066 11.444 c 44.277 4.182 l 
45.473 1.213 47.805 -0.967 51.695 0.436 c 55.375 1.76 55.566 4.678 
54.918 6.729 c 46.934 30.928 l 45.734 33.795 42.707 35.467 38.918 
35.467 c 20.199 35.467 l 10.066 35.467 1.566 23.662 13.074 12.315 c 
13.156 12.131 13.062 11.987 12.863 11.987 c h
12.863 11.987 m f
72.535 40.053 m 72.535 33.104 66.902 27.475 59.957 27.475 c 53.012 
27.475 47.383 33.104 47.383 40.053 c 47.383 46.998 53.012 52.627 59.957 
52.627 c 66.902 52.627 72.535 46.998 72.535 40.053 c h
72.535 40.053 m f
Q Q
showpage
%%Trailer
count op_count sub {pop} repeat
countdictstack dict_count sub {end} repeat
cairo_eps_state restore
%%EOF
