{
    "name" : "Send Notification",
    "description" : "Send Noitification Message from GNOME Shell Extension",
    "shell-version" : [
        "3.36"
    ],
    "uuid" : "send-notification@example.com",
    "version" : 1.0
}

