{
    "name" : "Direct gsettings",
    "description" : "Get or Set gsettings with direct schema id in GNOME Shell Background.",
    "shell-version" : [
        "3.36"
    ],
    "uuid" : "direct-gsettings@example.com",
    "version" : 1.0
}

