60
72 8092298443302005772
61
40
68
31
13 D
90 5860636199812275787
26 D
86
43
14
65
64 7537561330997118247
82
86 2307246503880507287
53
13
20 2867786110093590298
46 222066721651880648
46
89
67 7919597133196948774
9
68
23
69
5
69 2155471865397771591
98 D
89
11
53 7104005515308432936
24
43 2502138676196675042
94
40 3885556759723770280
30
34 8911827450378708487
80 7352791438468782348
77 D
1
78 4164642929091994978
66 4825684289337194608
96 9204014158276485430
79
62
33 D
61 3500948448813037088
41
16
56 5291416818054225364
8 6378586615501821806
45
67
58 2844227058611801319
29 2394944695140094955
9
8 1048511962879395086
93
44
63 3126900442013481404
17 2633211247850379317
8 6561991126208327345
55
60 2964442980123323122
82 7921311695702276325
56
100 3532224355090772589
66
31
65
49 D
27
74
68
39 6044472738011566564
38 535561196740240105
25 698256416660881711
86
93 999669619639507102
97
93
80 6779104286292315179
36
33
51 1740942943791987417
76
62 4728409538922153267
64
25
2 3367517486442098014
8 8836181287152458931
65 3452363920806064467
9
45 D
59 2966418860085013673
53 8622795389963678272
91
56 8545742235038653183
25 929002625831915503
58 D
72
36
54 6740530884802885689
45
86 3742757500149767808
50
26
18 5268507208990391953
28 8640205669709480893
42
31 5342772488134740187
13
98
48
52
60 5629420782743510371
45
13 D
35
71 1133698895857556353
48 D
67 6939655141973070717
63
10 D
25 8804132083135156523
60 7659587797345683001
14
14 9220660446553066086
16
91 2826386530950439267
33 D
22
2 5176781994852182064
81
7
67
28 5146530087525838381
79
1 8176097666717070725
9
36
91 434094824547267102
6 4746200739756648781
90
13 D
99
83 5999185334131087387
57
40 5327339779176516449
6
91 3544034382781989383
19
92 D
82
13 D
47
24 900381867544767257
13 3529655335496637475
32
18
9 D
47 2432227125093946461
93
30 D
21
45
32 5013164863093555337
21
99 7926053224883705345
64
64 9096920781892318935
77 4565599090191450748
58 D
100
24 D
2
79
84
24
14 4024555210597331024
0
27 D
79
53 D
48
45 2224683612181842037
56
69
81 3537350627315736144
68 6624738355043083028
45 3809220740086735672
92 6089225288853168192
80 2432204518826644856
100
62 D
88 D
37 7742744615597534252
86 3867489602171938900
11 336709739684464662
16 D
82 D
82
55 558935248553691664
26 D
71
95 4620318341319529591
18
70
7
66 7744247505706481685
51 5539626382584160706
94 D
92
97 3868841859042569183
82 6175620561639744014
19 7621507367669155608
57
58 D
84
46
33 5268148989100593540
77
47
18 5231039819317002517
1 D
58 1738454223986921520
72 1413387325176185065
83
86
99
90 D
46 5429858602499044963
18
56
35
72
44 7101668840206430172
99 1417616280881371192
32
48
20
33
18
47
17
61 D
55 822551381079974873
27
61 D
90
9
58 D
1
37
99 8698465395179596411
39 D
85 D
65
71
93
17
52
19 1715716282641274760
25
88
12
96 991255527343416472
27 8333594145205303240
37 7882533706626053303
12
90
34 1090395423593243430
33
53 6027629174880645764
10 D
45
83
80 6441175990342999558
69
41 D
45 2233187371017835008
58 5609333181885780066
0 7451013905681694205
14
87 5923492293972083432
27 1159951888736586338
79 2662529690464739095
97
56 6697658948430972074
68
89
94
40 D
52 2338549468333135622
23
84 D
44
55
85
96 5027303548150464031
42
87 3193696719401321225
28
83
16 5675842514106960175
92 2585031579734557035
94
81
78 2299308140011718234
49 8292478200256618856
21 4342704564896094263
44 3596982544066802943
5
37 1053746688290254735
41
42
87 1724410786058900481
19 1000977457750261092
18
82
68
89 D
97 8327065185745365750
74
36 7303390599448714614
85
60 6055182346354456572
60
39 7411875332445481006
22
73
52
51 7653323848119801685
77 1107829291434556794
58 3591620348125644293
41
93 1712978583472570073
54
98
78
42
30 8945220427910458195
86
57 D
96
82 9060399136335242545
22
56
93 6645498904156017559
1 D
46
9 8387653339849372438
49 6891791674339043901
76
28 9016408277454329182
12 3042566454644024806
14 5257644418348740815
87 4561691155923786022
44
87
0
37 6597934552312755752
42
0 4363510760030443794
19
57 5699690305948492773
65 4038284213627748980
98
96
96
84
70 3342841237395398787
43
46
19
67 364547033556241845
8
22 D
30 1264237501040835933
3
71
24 1936694901770797598
73
57 5627880688026843267
94
14 D
4
89
65 D
32
20 3955531993843162906
32
49 D
70
19
22
52 7796450683068065932
57
84 4894301920411478271
52
91
59 8373747316773563672
55 1834061893466404127
27
20
30 7029329075524442161
33
73 2847747311899944850
3 2632126976969577954
94
61 4179673035809926096
80 8994679121512315697
94
84
67 8931120243166805509
92
65 5588214729793008042
25
40 366594336784209707
65
66
60
55
78 D
0 5564263931152905183
92
79
63
45
40
5 D
60 5865717306269599443
90
84
36 D
74
29
29
84 564985361854764064
91
19 2493478543676767239
56 2463534559493575755
3 3768164234341744944
36
55
17 D
4 3370919733153859578
78 7340838553006604534
7
60
8 8160754117378230461
95 54797257035004167
70 205291969133826650
6 7658348513780567022
44 1213454013796946432
74
16 7579069220480057597
22
57
76
28
86 8227948676585454220
80 2025363168877181887
78
7
71
31
37
47
51
52 5832924017179728561
3 988189840016913965
74
68
68 502552122798356204
83
0 D
15 6888006045762495908
25 8368336376059002738
44 6716091956998405132
56 3851005525762134592
25
43 D
76 6438458634844080430
23 2532338511984346236
62 D
47 7126639017013050364
88 D
25 D
8 D
51 5435558213099582990
93 3950157242772668280
31
54
96 4193360809293347562
64
18 5439277134720912903
60
72
80 5395730941379885733
60 6665822279820674281
17
31
20
39
7
8
1 D
11 422968438021607496
11 8145232582801288556
33 689486165616654558
97 D
30 493141216251194259
15 2459433669498280121
89
72
15
98 D
30
40 D
89
46 116319771891464756
69 69690159337025971
1
53
67
79
43 D
6
44 6688779358737478707
39 1106584582130125327
23
40
21 9202216070014009329
13 3999618212002047797
33
16 2110485654525000699
34 3958501887143142686
37 D
83
87
40 5893247185295740689
8 D
45 2908412214786908637
36 1454569170448957225
71
50 7834447528971079949
37 3043131403609424219
20
28 3254292970261796445
55
2
18 4181684590198557629
39 8868378013901234473
61 1902242992580779211
25 4397677022289932273
51
83
44 2041747923159764935
33
100 8509306391189990207
63
78
72 4068679928767344877
56 D
58 D
11
74
83 1572562395466587059
99
88
20
27
32
69
99 424380628823941418
76
79 1320147999535051500
68 D
10
22 D
93
43 D
9
37 D
52
12
3
98 3359584668215545809
1 5067099208895395010
52 3628880878235949568
98
51 D
68
65 D
18 1459228123111041825
77
48 4612600623159399205
88
2
80
95 4747544836492879848
58
21 1954647741154155875
51 3397252161206148389
20 8716418969543920757
67
31 428059280524407349
58 8493706845765839457
0
95
39
28
32
88
7
79 626300259614369465
28
62
11 4637694728458532624
64 D
46
31
57 D
27 1319954313754984805
64
81 4374295874303295017
23
96 D
34 1236598785049756100
64
42 D
75 1406948681802750109
7
7 8691080372019363464
56 6664621073214948434
76 D
64
58 D
69
12
12
83 1887296399699823620
35 8422755294189766721
100
37 4779230840933487365
85
77
96 1523335837037703019
49
10 7363699659623638496
64 8120049629417103852
50 2737689464127608961
18
4
57 7024937543160680200
29
17 8212279868194796865
70 2485407825832864224
61 2872746477366433643
6
76
76
24
92
53
17
13 1050837734597749754
18
12 7072510573952935252
84
98 D
55
72
2
17 D
58
83
45
15 D
95 1161415581846943975
28 D
94
49 3700570904110301069
100
53
31 585268600543767377
40 1060629563396714761
16
15
78
0 2229012082137380337
43 7101002768134147889
16
56 6743965270462016302
49 8547617470899904585
31 7733374035114677285
44 4705416114171245921
16
66 8375159673434840998
86
34
5 6794281350506258797
58
48
64 4899740540407265507
54 D
50
63
81
82 D
36 1724074607735730004
35 3230202768574456466
51 2722583081522854717
59
42
100 5892114847185105445
45 9100817683139751728
66
67
92 2111474216996720967
93
38
47 8036256549151235237
51
77
42 D
35 D
37
93
21
91 D
16 530767440538779865
38 8657454193010677174
72
96
84 D
12
0
41 4995941405399799038
73
28
8 D
65 D
42 8573787354786698878
92 5584323030778505913
48 3212507273655927734
36
91
49 1655165847012162653
14 7535532102385724013
78
34
100 D
29
91
45
1
53
79
23 7719782366924104689
96
99
94 D
20 1237523050911289887
79 D
58 5520972266650807821
47
81 6695092901670361316
88
90
44 940111067250798925
27 D
13
82
100
90
81 5340882756979972274
16
50 5618293323365161792
62 6355505258780144383
99 294587067526846428
66
53 D
61 1715300519091770610
69 8364751726370566829
68 3952290833594624525
80
68
82
68
93 1739323122649535772
41 5030710521689374282
34 8646066244921277378
77
12
15 D
85
86
99
38 1134027592395898040
5
81
22
71 4737706709027184180
22
1
11 D
1
2
21 4087527308219613575
47
24 D
35
49
27
20 D
57
100
52 4933573945833911768
94 D
10 8910761867429106495
33
56 4651613679342852601
5
24
34 5101652033888136726
88 4460056626916727003
75 4975598970950458312
56 D
36 D
73
44
45 3327652444368075489
5 6377598492458821767
82
50 D
72 6837449628400743877
42 D
22
37 3278110743864330112
61
49
14 D
96 3961053155706270871
5
33
68
64
5
4 254611757804027786
88
71
49
39
52
16 3787566885563585205
2 D
23 D
49
47
62
20
58
52
70 1028477184746920722
31
78 D
2
58 D
63 1923459791587519095
66
64
48 2812869397862258098
26 D
14
35 D
63
37
70
28
28 5294273933933547668
35 9033463325752931488
79 D
8
6 D
80
28
1
4
82
75
10 D
0
16
54 7659553288272004252
47
73 D
72 642381888201787933
12
52 1287500338529154658
57
51 5888324455278713352
91 D
75
55
19
44
49
28
76
55
71
62
43 5240870464667449169
48
26
67
79 D
63 1648057111294364850
99 2592303554195397192
49
100
91
23 7821328068473374938
98 3158932439635175518
70
4 191729418264458008
9 D
97 D
72 805903054179277951
90 D
11 148782781845218870
35
99
34
81 4684871607100136629
6 D
98
91 D
44 D
40
50 2052332996344367660
82
0
57
53 D
82 D
40 3253275277800630123
61
54 3037246137631501368
5
26 D
17
63
38
76 D
73 6669015746327880603
72 6932978172927903687
6
13
0
28
11
44 1330497730703672207
25
9
95 8521770575532352214
11 4069718882097194459
90 4527230838854698411
79
67 4346368835419671206
36 2023117562578682900
73 D
52
88
37
38 5848872803304800422
0
84
76 D
36 4692333903733349988
3
11 3716478665610872548
92
96
13
40 2828508063345345830
35
61 D
4 9021187539107073856
35
70
50 2414198066340219323
26 5626325294656790864
26
56
71
22
23
32 3175316878944154870
72 D
65
94
84
61
18
73
32
71
63
49 7615792571254891120
83 4708601381876135404
98
73
49 9213496975606319232
36 5677920376802753959
61
50 2867619112242262612
14
31 7493476800266390527
50 234214329086335851
45 5019661786965234802
47
51 2597168438784960152
99 3989905956281030763
72
57
49
32
40 1317570224118486912
7
79 4022273666011007813
2
2
65 8381054217273522224
73
28 D
71 1812408654820746910
32 5677376669899570533
100 D
53
26
83 1767731136742486375
86 D
3
34 5002246639540733243
74 D
85 D
1
77 D
96 D
67 6251884473190553588
4 4097919949804559594
28
65 8190609575362872600
48 D
92
2
40 3087561641909757019
54
53
50 7231717136472496166
15
70
61 5723308129473547936
65
21
50 D
74
99 8312895458172594496
95
12 D
13 6289227918171129492
16
91
65
76 6534977996112826488
63
52
70
65 D
20
24
17 D
78 D
54
44
83 562083090460824342
78 7286763529349084995
30
25 6516709834592978223
97 5113989807769804541
30
30
3 2965744637142306884
64 D
70
72
32
84 1069614673185038406
36 6875299040806538008
57 3900330628058773886
66
47 1533684050047647269
56 D
29
69
70 617205006133750289
59
90
32
18
13
27 4247895515886065759
74
28 685648757948152850
93 5769300805559430199
61
82 2106748237236754529
14
15 D
82
6
11
28
8 7351733816786272964
13
77 7645395659176132839
13 D
3
1
87 509020331662319059
24 7255129163956913496
40 D
79 8706436316480835788
51
96
89
9
26 5799174793154113256
29
72 488364103231610689
28 8826519529308716835
100
22 8202205500657556895
97 242446536023296179
28
48
56
90 D
27
76
85 7225295545879942935
6
34
40 173120590689721693
15 D
78
27
44 1166975920410407119
9 D
39 5083924186548313380
1 D
100
19 90686568318028683
57
25
19
14
74 D
57 2213503421756959083
40
80 3502659254654319181
44 4484904339899589177
48
74 D
61 7639996382847019403
42
37
15
65
23
30
81
37
28 7369639923107175704
74 3044635715107791250
17
71 9042298182302078510
53
95 1614591813172923875
65 7604825491511333877
65
36 5730550821075012247
47
78 1151659553113380454
81 3323812692780626892
75
31
9
8
10
61 D
50 5525201390154582430
99 157907055139486880
89 D
21
81 6702017301367073323
2 452868740277642188
86 1591494290956354161
74
78
23 3691452703704454314
98 8199408625569001982
47
54
95
61 3021204539120445594
72
20
60
51
61
67 2108581531565891267
25 D
55
67
73
81
77 3960146659339695702
16
99
43
32
23 836336610211167539
89 8500904348188395040
65
56
22
10
60
3
69
0 3040015278370370720
33 D
32 D
87 D
44 4416084939959043159
24 D
96 5087711676567953426
52 6344618751659823190
73
79 5483991949357206018
64 D
29 D
5
26 7039324020498269247
72 4029395750616240097
61
55
24
88 D
9 D
81
58 2519883077649702565
34 D
1
84 D
63 1836730145241136964
24
85
19
95
0
96 D
68
86 8243669126212865480
11
77 8634281788990108025
5
45 8718823021346493084
52 4917738745830025208
53
27
99 D
60
24 D
87 7549052670459344950
13
91
85 8418571193819828588
32
49 D
47 D
97
5 8062317185169279509
99 D
38 D
69
48
78
39
66
73 D
50
21 7727843580134873466
1
78 D
2
73
97
92
94
96 4150081869140917287
29
30 6210729168482854952
48
43 712798886982440562
79
19 6355225474143479046
89
10 3632787226575825946
42
31 5857865197522783278
68 5269097333194036495
15
66 D
52
54 1139032225965259911
6
5 3140022891567082193
77
7 7306882834322119040
72 D
79
30
38
95
37
11 2852824350486108016
99
14 5318225977720687075
62
64 5560220707373167200
42
66 5754175647010612219
79
72 D
21 D
29
8 5663014160748147596
72
54 6244752761270397254
4
49
54 D
79 4105757378481375024
82 D
23 D
68 5859832793965539980
39
68 5662439075956454120
12 8436584477417035328
71
80
15 8168236388448603263
43
58
91 2071664614258057492
0
1
69 D
72
73 5041937571108926235
74
17
75 2525761423076568244
52 D
86 2507010488037028418
12 D
82 D
24
66
41
11 299108843775212213
78
76
23
39 D
33 5274226096381085642
83 1373204680327556173
73
24
44 5454233057903959955
35
93
31
8
41
67 2734638791096202130
88
51
81 D
84 D
63
13
20 D
40 8627656285452236439
60 5404313683048014521
70 4059183560575125797
50 7663897294977217569
98 8817261026560904073
0 4027239442134983561
61
70
40 D
44 502991759219961096
67 7599136521519724779
69 D
74
100
14 3822284681465171944
75 5139473507406180925
19
47
80
77
40 D
61
38
65
58 3120577903756789510
68 D
33
54
85 D
74
67 4173801336729755663
95 4863494286631681817
71
10
68
84
60 7124333940401195455
83 D
91 1073753172507017368
49
29
29
29 D
69 D
82
1 6028050790994202155
21
66 7606985769635034041
63
100
94 5343761528732749162
73
70
80
5 1239572488235620616
11
36 190805669560441294
24 5867148896171157836
41
1 7556866491907887326
40 4629783786872795822
39
16
10
32
44
60
69 3890409236662094003
18
24
16
14 D
9
31
37
71
97 4639860962766558911
38 D
99 D
14 6286410315115769548
95
67
36 1697465762557292292
32 3133590124540813634
87
2 D
31
15 D
72
21
43
75 8911464692079331108
31 1234893486483737150
11
91
73
40 347776853066625346
43 1307103966658968828
19
94
84
65
73 8065825064128149090
22 4289238410725100945
19 8429822081750723320
49
2
83 2910557643969015378
30
0 D
29
73 4732397952783005430
11
16 1086579187958993371
67 3054252696843264789
13
33
4 8994061493444764746
63 6753496341429950869
51 7722879271511267292
51 D
93
8
70 8307376701527284695
68
50 6782673126337316804
38 D
33
27
35 1015877029843498338
26
95
38
19 6136731165190315317
88
52 D
86 3060306235791156702
77 D
2 D
80 6597562666764025666
66
14
58 6815533763914818815
50 2614139165906477636
98
98
63
76 19066223904278004
48
70
63
5
78
63
23
14 3630855824504182459
18
57 2843824776295599930
98
5 1616735594722243267
67
4 5689105931085225387
79 4683335277430245572
94
26
77
95 6690016482372346369
47
58
47
67
73 1819394081275568278
76 7736015855951700630
14 5534639646660925106
15
88 780881435592579372
45 3099422475790512082
86 D
9 2495074563302297972
9
37 D
29
32 9163877841594952796
28
68
47 4637806940645224025
79
15 3714155508557945603
84 771938749491616079
20
59
10
35
82
98 472972636165065077
85 D
83
30
59 D
9
26
74 1995643388860622461
60
9
28 D
56 8083419923976143094
66
66 5721008585209557187
37
34 D
58 5727627991310646519
36
5
72
91
96
33
76 4980640985405932816
89 5603944047246507578
62 D
83
34 1632916850826098304
17
0
49 235337653384821986
58
21 D
95
97 8822327142649295412
27
39 4667972679902156286
27
10
27 5714080204386035053
40
22 2329594742369625518
17
38
68 9053335245666753270
78
98 4093202845853653942
84 8885666368506997245
29 1229580916787977680
69
86
59 5767757500410905698
80 6271992139723482225
50
65
14 7451143195102217124
2 5992034488354534653
19
91
25 8913842287952261581
73
8 2296185132962408831
75
36 4023266292789725363
65
17
8
68 D
3 6442637975602091095
34
85
70 D
75 4542434986177809335
17 7123792239378095466
26
7
36 7206173488541894786
7 D
56 1211301246302800892
99
33
82
92
43 D
59 7709609291116600929
30
4 D
42 967554459915992629
88 8824458857003714723
74
61 1207543161033679282
53 7069119741631673817
68 D
42 D
15
97 1721290312833870794
0
99
42
79
62
8 5724312372925445060
40
91
31
21
87
54 6201814795945476898
26
46 D
66
27
6 7551380349495054578
8 2192673134639935427
68
33
54 1731533231058106490
99 1271261679041778486
61
40
43
92 3304202096704155040
13 8889371784614040686
69 527286978054976691
0 D
64 8184122022094101873
100
32
2
77
93
19 1137609577067234296
66 D
68 6824381241393454507
71
65 3963011842166168206
98
57 D
19
84 D
32
77 D
42
3 520046467293204347
12
51 5487576661786404925
74
47 2773513989936036740
33
63
67
31
38
65 D
16 1697315063163732503
37
60
26
99
41 D
79
61
78 3516035957612987956
79 6128171880893431175
66
4 167846141294809509
83
48 8775319416232361616
37
46 D
1 8063593783574200314
56 5817665339985976087
65 8247364312353427567
37
83 D
11
15
50 7417032393966963514
81
92
59
69
67 D
91
23
97 D
27 4368147093712133830
36
41 3139913989922203836
10 6984610330450125835
30 7550115759053987769
77
46 D
47
54 8399340049933158878
74 6957012937761026436
17
49 3870732773730724473
11
72
27
88
86
96
20
40
82
100 3775636580635212780
89 6119734980175951476
8
92 D
29 D
55
74 8033363249976485921
90
54 1494527979493394177
7
84 D
57 1209845012182035881
61
17 D
7 8375532168723532739
86 5725665631581598332
0 9126771111839181829
0 1994492960675080568
49 D
52
75
19 1944760824511479897
50 D
68
23
13
53
3 D
23
3
78
56
65
20
39 9090133955221348284
52 5716270907114961753
76
77
97
31
47 D
50
65 D
27
17
5
45
69 D
64
75 3350206584292050954
76 8587352340650682695
6 399416229152211740
29 1170859961711141118
37 4003965387809942246
46 2400921365953649150
31
6 D
96 356645025777671897
30
36
1
48 1357996719648763410
94
73
50 433985728331762910
84
33
62 D
50 4856518952455638802
91 3508921709867379933
6 478787008952152522
90
27
18
51
47 2331119540702271749
15 8923078248454568219
57 D
99 D
1
60
12 2353908359615527612
98 D
69
16 4378170543692961762
13
32
74
52 2293831464657141971
84 7467625806190058894
77
26
18
88
37 3169339019797523667
29 D
46
94
59
63 5415352605096396090
97
98
75
23 3441214708072586054
69
1
1 6282351864529296622
65 9133566248778242210
71 4546968639998062975
68 1515916464125512968
90
8
87
98 7328662540440013566
48
24
59 D
9 6238296979519626750
4 D
84 D
67
50 6011017563452940002
80
22 2225937199230065837
10 1001348045442764182
37
80 3293400832711767134
5 D
2 D
0
22 5539717955027684104
41 7170258465220619296
71
45
78
27 5689734791737597089
38
22
23
7
24 6540564787667880933
40
8
98
55
17
97
50
19 6985540507913596030
59 2975520168388879270
50 7811460573089667568
5
47 1000112788581221537
73 D
56
72 7003929334653246747
53 2731597948368651607
18
67
86
12 D
80
89
28 D
23
92
87 D
13 6395306026423371931
87
62 8922241671223816774
46 1560901099517068460
45
51
41 9108026797259962793
30 2659835708978566004
66
2 3318724924998637372
90
58
12
56 5170196412222863957
78 5679866332214032916
79
46
40
18
59 D
35
14
50
58
95 502220634788475936
2 D
98
52 5177700998295881452
77 5691461498646304101
74
16
17 D
1 7829803697352377500
63 4065477317826041365
29
4 D
87 3316882431633926409
4
100 D
2
18
39
28 4561766777514094072
28
0
28 670487250335141558
43 7412567607433048862
45
4 2036162652484401967
24 5651494745083105047
62 3849569618901847530
0
12
87 8288111013520732974
24 5596626225663245596
35
29 7248167585093004875
45
79
96
90 D
46
49 5912797808154154747
45
26 D
47 8065019471093513254
87
81 5408800344845917907
38 6036885334952389728
4
28
88 6593799369465904712
15
6
25 D
82
84
40
11
62 469257082268480917
12
42 8785541509324328919
30
70
87
61 1469089982118076253
41
77
60 2931746505940432193
99
1
64 D
36 7940512706472678262
84 2536250244414791280
41 D
20 D
20 1940667805548007151
79 7173842687177075125
100 149630348143677319
2 D
39
91 5742852295138053758
54 1388990733957642336
23
0
36
84
18 7103113777769957821
33
57 D
29
21 544425500214554314
42
39
56 D
87 5105280249650768998
77
69 1292527257378908127
59
40
90
53 895747238740543197
69
70
36 6763607568508722705
96 2418699417307396796
94 8137334516368295193
74
46
83 1516982216839280813
81
65
54 D
1
74
55
70 929586912707222005
50
54 D
32
12
79
49 D
59 815355046874741892
16 4242027841798895423
51 4988977346721322524
35
99 2878800671460193804
13
47 9028882559235591961
21
39
29
65 6141950008436009331
38 D
87 7048868380193214243
86 6288826150411761333
84
61 D
13
99
48
37 8197313730944600591
21
14 3114870046888248011
94
35
93
17 1478576214643388922
7 D
17
56
79
12 4966596986009801698
23
23 283806883888375266
46
90
51
71
59
6
71
28
53
72 D
22
65
87 6761250808483261566
33 419363745096413106
48
15
85
59
68 D
35 7695983032262630424
12 D
86
19
20
21
27
58 D
27 5265170251166559443
80
57 2465316010624862375
87 5401506490119956564
11 5691477060904985965
3
48
76 1640859426271608595
40 D
29
22
99
67
13
45
62
96 D
97 5865747956868347617
85 1696175601826656387
53 7245267130033185918
20 D
47
59 368371090890046624
92
49
46
88 D
19
10 4339321826178374771
6
39
40 1709430806954199015
47
25 D
75 517765273210103730
17 2661079072273653250
96 D
75
46 7205377716793904252
99
82
44
6
77
44
10
57 D
39 8244835520013604619
37
71 D
81
70
33
32
18 D
50
24 4656581168130202845
12 5027104101875943893
57
66 2449863663332517455
76 5937740762375728132
8
7
97
81 6996492725509579069
1
14
83 5025252209834481604
72
68
49
84
95
76
92
76 6531029258101069969
63 D
98
39
81
72
36
26
2 2574939092539108835
75
1
29 6484959559265689749
93
46 5149481189853094582
45 6783806080235170621
20
38
53 7609773589987543262
98 7083047425555430192
21 3336127912691760612
19
70
83 8285066409297284707
64 1252906638909731486
43
45
34 D
54
23 1573336871980703436
52
21 D
98 6857994578623854139
47
70
58
14 8091873996039103347
74 3646224071979971819
100 1177413467558596825
21 5418304867645261276
16
3
76
57
29
6
19
89 D
85
13 2472899285890221488
91
98 D
95 528365243974404713
45
87 7982566231752838718
23
1 7805231075393120562
63
38 1283144794459754001
24
61 3868328351221058301
16 658967431509610283
6
39
81 29809440423639292
35 D
13 8980258204553742572
62 1140680548855924368
52 5271844024193333809
75 5769635129835122785
81
97
27 D
1
88 2511351780248749700
84
67 4788825275755216154
31 4114279715862498612
99
3
83
60
8 5249740828195637244
58 7444170851362639744
1 7009570970723159614
45 2598482197984259431
14
20
57
53
22 D
3 6021372108446654403
6 D
69
31 1557330848133919669
0 D
40 494280741046721336
87
30 D
82 84939940093522433
28 D
63 3805141268127998959
1
2 2464580700848249522
1 D
21 4287257748150060838
64 3096225969025055397
3 490217285384008061
54 1632635539436633700
10 6530902160354994530
92
49
54 4702417839799396847
72 5508716013505696050
70
75
80 7474906692015318738
55 4372746304078619269
56
41 8913984849954206336
64
93
51
4
80 9065933751500328821
96 D
92 D
12
36
92 103982563019451160
72
69
93
19
14 4356102739545551260
66
81 D
49
38 6329032235395097166
66
46
1 7176682068924728203
45 7553161045080831256
89
77
46
55
53 6795971093859703722
58
38 7957892889511495929
28
25 9064052021217136635
13
1
29
69
80 7869600225568777304
65 1879476868705825375
99
46
9
75 D
5
17 8880271762311127759
10 7129766737621377124
62 D
95 2849728551148864618
41 D
75
97
26
10 4434786833478924796
91 2113847726302454555
82
51
28 1881123252647341703
40
18 2805366593657531781
15 D
37
6
91
78 4722197143292949301
34 D
49 1961087819075997833
83 736620180256915783
92
2
76
96 5224710932330372337
9
84 1421119693898321199
49
38
40 8344541571371634394
45
17 3776978529248359110
33 3982650604638275071
90 4994709617392478228
20 D
64 99126988010009004
24
100 300697824334822510
12
84 7691449607953741428
72 3904553956892336024
96 245489479116261950
64 D
92
12
80 8170961733664642746
44 5405271626343742428
43 7242025967742968045
84 8425663229220987677
81
26
58
81
43 D
90
12 8423297332886539085
77
27
96
96
34
44 8184189481958444667
90
27
55
9
55 947071578546429620
30 D
60 6049235674311304772
8
90
69 3549108607612996765
53 D
11
5 4351550720784060343
12 D
52 1592753790012128919
11 D
10 507768049962935936
37
37 7529253261056651568
14
14
32 5701367890218346506
30 7420454981017724110
5
8
40
44
25 2746342574599403871
91 6896818928790885165
42
71 D
0 D
49
11
52
89
22 7463792480115229456
5 D
63 7388570966235407273
93
16 4128866532739783291
6
68
94
28
99 376281326496033052
56 3485605015961075455
93
42 4761640004359677698
8
82
96 2746826256610992258
10 1964019260796577893
18
37 2894903417591142163
100 8366167397392805517
32 6569221376967983266
14 D
21
78 4042539898366097239
31 D
9
72 1775158456953454962
65 5607155090957073813
13 D
74 9084453903240144861
89
8
19
8 D
2 5867520971868734064
31
85
18
22
62 6786860518116077762
81
88 D
43
8
27
4 D
17 D
27
5
11
52 7867187379728968775
89
32 7482192558233216427
38
30
1
55 8056786616060014096
99 7559062223585037365
5
3
7 5455247351278462413
79 9007177166628395398
60
91 3849263046726264811
44
79 1903069580698128878
45
95 D
44
73
22
96 3983119154919194057
66
96
40 603565878342191589
4
75
32
80
44
47
97 8703972827948404425
17
79 7839856655381137550
22
85
25 6900807566137116421
100
84 3831850162530468937
56
13 D
72 5514717304436454412
86 3420390469645318478
68
58
20 4289255646218981355
67
7
29 6497846351659255867
93
54 D
83
54 5698544983081469342
65 8947681040466165064
72 6826773055244011957
57 8019334494350859844
58
13
24 7088021908499770753
99 6801187885402939040
10
99
22 2270746954642243158
78
40
72 8424271588334762132
0 8549736177801169150
26 7018583904396414184
87
80
43
30
60
20
17
10 8907243029121104857
20 4348022215852436879
96
56
2
32
30
66 1595519227802396462
20
100 2627965539435564195
99
28
69
29
20
16
59 812638186243999428
89
73 4314535964023712491
29 D
53 5744646837635400090
52 4492444093925327023
56 7958950634419254323
37
52
52
21
3 8076777390341351026
11
74
52 8711028998444127249
46 D
36
42 D
13 766828593961474697
15
86 4989413700225297242
83
37 D
42 1299372363075599892
74
51
82
34
44 9101219312175611429
89 4891893452064444478
91
8
72
51 6195521910758254119
100
4
27
86 1417850419171332465
51 3417512822953371394
62
41
28
39
22
36
34
54
58 D
86 3903551784539147702
62
96
83
60
57 1497503521183798690
42
22
16
41
22 2860457347517382815
44
72
42
76
7 2855097322863375275
30
47 2355810804822066889
1
29 D
12 4195246460964349613
22
33 9125510005731870868
12
0
62 D
18 3194145272184276251
52 2426513904923522020
18 D
67 4131625176593224426
27 8885598642388064021
17
6
29
38
28 D
93 D
66
41 1930745127000807769
26 2633969393815633296
82 601724553945052029
93 D
52
85
46 1386172409239847330
31
47 D
98
65
6 150114057409647326
81 8828598593704644982
13 D
39 7323938937210983510
14 5836524055931480656
26
55
43 3580632862792555661
22
64 5459803594490304663
73 6529381517367294542
53
34 2729046841115813159
19
77
94
6 6557234506875057385
31 D
73
100
40
26 8366776250400454389
9
21 4581126546635037132
99 4684100390590044175
23
35
48 D
20 4611971645948675784
20 1612793847209290577
47 4276388773322836462
14 2761550144469941752
30
2
49 D
86 2117735532846112162
8 4609409147191771585
71 D
37 D
85
57
47
82
89 D
80
38 7249523914005226642
98 3514398133586985353
47 D
25 D
35
94 9161721788499863358
64 407609846979392673
88 33586215308010003
79 4083262183506994326
63 D
78
53
41
74
17 3592345681728021966
17
3
42
56
33 3281185333897182372
5
67
62
13
93 5251335056960065496
74
11 3526756705866161680
19 5271716536085517037
50
83 7439333767880691921
32 D
16 1369396856825290313
95 2585996689138956545
82
31
32 D
65
34 1133336377991928039
19
37 D
67 6999717906425358241
58 2265823480877215182
32
64 D
30
17
73
80 3826137355738165035
20
94 1775717701824030239
51
39
98
31
57
20 D
52 4061880981657808382
64
64
32
75 D
40 D
7 8609285011548253338
80
73
95
38 D
54 323992321854185712
90
61
91
93 2653117259561745162
9 2085271526287408325
3
25
70 4950457204609966739
46
30 D
30
53
74
63
65
45
54
92 D
5
2 8323821714414860234
50 D
91 D
85
32
8
32
85
86
47 8799121290770951187
22 4587280951061789754
44
95
27 D
18 D
24
91
98
62 5378350275514990217
29
99 2362098435858315088
78
31
76
76
51
28
62 922761592526145375
26
12 7400338130790477219
37 3092120249571417494
96
32
65 2143903182351015833
27 7864089669047460982
85 D
88 8585221192114955489
68
24 D
52
67
87 6756258993584776012
31
1
10 7848566866920575847
68 382727923940812876
46
37
51
33 D
15
19
19
98
23 7694519027603322456
77
24 8247220459265302824
35
18
98
95 3476100914296626822
38
77 4097295414069988025
98 987088654384565889
81
51 1361531924639942636
21 4907586374299313293
13
1
22
37 D
73 4689480868799896938
92
97
98
95
56 D
63 4078156554878312371
22 9205511355968419800
31
79
35
94
46
96
72 7448075519346085135
30
21 1741034795968571044
17
90 6404937098851839045
11
58
28
28
29 2300564711808584996
16
18 842682552282513806
67 2744004138031588882
0
31 8934079653487117039
98
44
65 4016109946910065119
55
37 D
13 D
19
81 3873526607663306885
50
39 6766216909561343961
74 3045754807051590690
82
88
16
52
46 6805570948907096938
76 D
97 D
15 1595334109916150261
30 D
90
38
100 3795292712528155878
89
65
88
48
33
60
35
36 5188895316021555168
56
56
36
67 6895773242823068693
29 862413596456324102
37
79 2606300631938585291
67
46 4696507676796438376
39 447364553615574215
42
31
89
92
60
60 3684438235120721179
71
7 4818279729414557816
70
74 D
28
53 5413347235051469163
23
97 D
47
55
52
4 6448965640365652709
81 D
52 6726710160017973762
89
63
21 129095797002309255
82
53
47
95
33 D
87
68
43
47
70
30 2635477244093710754
3
13 121636588911988318
58
22 D
38
91
62
97
27 8103450304131957612
88
32 D
36 6005218456063307679
75
93 8426598021028475727
47
80 4498918729069859293
78
70
99 D
61 8224937006985249386
45
5
61 2590914422976672403
52 7177435069510526646
90
61 6129942407216908767
68
46 D
69
53
68
12 3831842138688073989
37
93
49
31
14
19 D
38
94
76
11 1364221676455987840
61
7 D
31 5950645599773316591
17 3830689891142381051
55
43 2889963529860397460
40
92
84
17 D
98
31 D
31
94 3933876333519153401
39 3642025744898163875
32
25 3617365735181638723
4 5617832100996755523
15 7696638036548789663
45 D
94
39 D
92 D
56 4749674160732316960
5
24 5504921261687055373
83
11
40
83 9033866657295088600
34 455960620587324425
21
64 D
4
70 2692214231122731329
32
98 2929905649097982308
53
71
53
4 D
54
41
53
22 4575578631562086962
57
7 8240687460011318896
21 D
99
22 4460229776587123154
66
2
80
24
40
23 D
8 7755516321025507086
31 4321732168475871139
88 82881788571859099
65
89
12 7016495927993721216
36
18
33 4683363136229269719
60 143125730745761890
17 6543073014556341554
40 661328030518329824
82 8720603608851764818
2
89
98 7571184947440358482
36
75
72 5425006115878722607
63 6890039868018666185
33
16 4985618364780904903
98 6464236668923668367
92 6530483947443893907
69
32 D
79 D
19 D
82
67
83
29
47 D
2
97
50
78
3
64 853742531408775882
30
21
10
36 3756147453543380205
43
1 3741962380297797850
83
78
44
46
45
19
15
3 92827729130123547
21
100 6379513135413861104
25
43 5011849322712062861
3
38
55
28
67 D
81
55 D
74
74 6438281383596794485
81 D
84 6116372761804145732
39
68
89 D
7 3749526993387611677
61 8730794369109503931
98
98
61 1936714751429322310
4 5999064923094809342
11 5546528004978799288
95
25
85 D
35
67 D
98
83
88
94
1
3 5774191747486074371
32
41 7094303226411973550
5 6392510079681636509
0 6583862397950039917
99
70 5235298777112532848
16
43 D
18
88
78
63
56
16 689844368186609572
90 3049298753454143733
29 D
40
12
74 D
39 D
29
95 7296741693925087922
11
90
58
47 3326435972547181971
84
73
49 5021967343054064107
23
86 1817133379895119938
15 6881482972778565732
51 D
66
0 1754296385886894458
4
59
32 5700151780331398744
6 6142826634676095897
47 D
28
4
63 D
8 3101364360687823869
29
17 1759980381696059875
46 2716957583462837874
18 D
49
39 5114088979664703146
32 2455232217107198400
36
74
98 D
96
74
59 D
32
18 3595875341328012512
38
14
86 D
67
42 D
44 6819232448060281080
96
78 4793193485300165559
32 D
46
90
46
44
80
35
6
33
71
78
29 1350582401630735339
24
46 6770139466682055382
100 D
72
87
12
61 D
52 1170373322795524270
83
24
2
56
33
86
66
97
61
65 6883228681176486628
55
26 D
74
48
21
15
39
65
84
44
69 7029852008492169231
12
26
52
39 6769458719464528592
73
20 6590705848938204953
69 2787251275948052701
50 6938628670280438483
53 D
34 8246015137805616833
67 4108278120700249923
94
25
99
87
27
23 2121420920753937570
65 7099854076616356137
77
25 2448233745421714471
10 3484341354871473753
72 D
46 9157561422884333151
37
77
100 2147883706161334138
25
91
23
13
83 4318046071299384065
84 D
91 D
5 D
19
65 2813736953814428353
3
90 D
68
69
62 2866048344727120516
80 8428523108768565932
72
25 D
50
54
56 4095463948463039600
17 378554391862250448
6
69
88 7806348058444938790
9
97
82
52
36
32
86 744681347658481998
50 3772340971508205235
83 D
27
80
76 3640786905543500975
77
84 3440318674467910703
24 D
100
83 6356841361097217753
2 D
83
29
94
43
96 2052940417741362384
51
42 7652506855802987676
97
47
19
58
43
75
73
76
64 1758094887680754328
35 8090184120044403119
33
36 7237597632342826411
12
92
42 7024035750400731306
29 D
89 4539946793713162958
73 5754435012686240494
35
65 2239104070817414041
95
92
72 D
53
44
95 5221989352030529345
96
81 6384897927950795909
24
11
98
25 2070152840346605545
15
38
45
57
31
4 115127340550445804
14
21 582340275648201012
4
87 3440628739688010400
4 9114397945836328140
96
83
48 D
62
84
5 2853126405581804052
75
29
13
79
61
33
67
23
71 5893560715676465260
60 D
14 4970131589571470455
96
23
0
49
24
96
71
69
33
36
18 3680000474560891051
72
69
34
39 1376088430300254888
2 8056625580107010398
67 9033953685252906765
31 5881006372946418648
29 1657475231940754145
47
54
82
71
30
6 2553155332956005881
56 D
52
95 2073065397467842941
10
22
55 D
25 4570460849485318431
70 9179989452321702606
72 D
87 8710927606321918534
92
80
27
32
32
60
90
1 4954650051704592007
76
42 7545960999910362304
37 2010228700164785859
37
100
75 2203115177131452605
45
87
14 D
9
6 2518712775287161051
43 D
5
22
66 D
18 D
3
93 4136801567563662958
59
96 5127429846000758419
60
11
13 D
49
44 6953024827714858077
37
79 1201137056363081957
30
39
45
67 5566119380809291701
8 2756157461541073483
51 D
59 7674735277520029033
57 D
38
12
40
49 8500196995626699878
47 D
58
92
16
31 2788166186095056668
74 8010444753403711645
83
32 6324729283701093671
15 D
26 D
97 802912974198886603
49
47
6 6613348929097511061
38
17
44
73
34
58
89 6932278574441206113
71 6372538418917197990
41
25
74
31 7932935013014884354
25
2 3444559922604411114
15
6 4628938217649039015
11
19
11
54 D
86
76
74
76
41 6798590258613132742
89 7760966841961149676
92
71 5441500684697609091
29 3706718132575093349
16 D
46 5655197305611385940
53
22
43
90
59 D
35
54
95
18
9
56 5457746024502719143
51 D
88
73 4932449565805195522
100 D
68 3232038659258543547
80
8
28
0
76 5632843740577509931
29
23
10 840532828279030441
91 6444033857676951758
63 8277636221916157333
28 D
97 8451891071493153982
10
98
22
76 4623118265885864100
36
10 D
81 7261730428124197002
52
6
66 1693756673747218307
67
84 5358274001446631512
99 D
60
74 8746507748013042500
74
39
1 8615837583182620695
69
91 8354961065779347854
99
22
17
99 8038050026675581962
44
81 4725983631697412708
61 9165039504621191170
98
88 D
92
28 2810072985113319681
18 4741198601380106198
55
21 D
88
38 279764579510885671
15
92 5599525413088226315
79
0
62
93
79
75 D
47 7026270566470487489
1 D
36
48 7508498902011807479
86 8911604932756737798
65 D
57 D
35
34 D
86 2984759683031857377
89
76 D
21 7236780662922079984
78
34
27 203403518111470123
89
69 D
92 4421146943222987040
67 D
80
47
97
45
51
79 D
59 D
21 D
50
62 1542836827625661264
34
26 660082993291436472
68 D
46
34
79 1027981998465279386
54 2391373929888856896
61
87 D
62
89 D
57 D
66
15
22 781613718685050440
79 7437261803081748492
1
14
4 1021241691945890039
42 D
78
65
60
9 1922252953519489968
98 3687297571054530355
58 D
90 8494568993422008785
37
13 D
68 1497423680239666115
11
50
88
80 D
14 3313934231552736093
30 3266566677674609817
0 7989639730497965059
13 2219882336081409155
76 8219938347877716370
83 D
75
22 3782752669746341994
11 1122181616143857901
11 3524165404648355578
36 377944916153839957
5 1760770602687460570
97
84 D
41
48
43
94 435969733832382085
25
23
81 2999717280787455222
29 6280173670848428398
71
57 D
85
61 4269190532822317550
6
99
74 7918884687423762110
77
17 4576788809602624943
80
67 1346916633764611666
9 D
57
42
86
46
54
16 7905924171910516035
25 2760129654604229030
71
45 7782586193261344891
5 D
83 5027207151007063028
34
94 793389600537325806
18
59
82
50
49 6742226011956123242
78
3
100 4958085338162127574
5 D
0 5119110179614640981
54
69 3614513061193790777
76
56
27
11 3116978592222854020
30 974976915086342355
85 7196064529526240190
36 8696189203088596531
76 8265560183405106904
25 6551482565463006885
26 3826752830364110524
89 D
33
5
52
29 5633434355478171204
30
18 6541726479943464644
89
51 950842433955434144
10
47
3
63 5914236595432343146
4
36
90
22 D
34
99
92 269999341163089482
12 5417327351713130081
62 D
43
98 D
50 9127852958187610657
41
53 591025527787017343
2 8796573647297045952
56
19
65 1844332838535446265
36
80 D
35
61
72 5129046771417838055
69
25
91 D
64
10 2898810021975566799
77
63 9168605838285014252
42
5 7271102055995457050
70
57
86
56 4054250230728288064
98 4727024555207891474
67
6
95
78 7749812448711850430
88
0 4244417501374573490
3 7095514231540113508
57
29 D
15
97 2404252583362961651
81 5498430480495654267
25 D
50
90 D
91 6276783552157935006
41
20 1073994177912856760
30 4137436918088351511
6
50 3050407700604850338
41 4150999631905854619
45
54
15
95 5730204742261384211
7 1485574698324903912
53
75
60 6484255663813120737
80
86
1 D
96
28 696105087868002313
85 1334195311479190845
85 5450896379547992918
21
38
50 7342038090072877857
46 8618724456738584616
15
16
1 6296736931600160615
34 6292771007371012141
86 7318262490869058480
40 6733779412186352052
75 6934712562495264091
51
89
58 1662625359270606122
90
48 3802939071089454381
28
58
44
36
51 366215944352082912
38 5673272079096602339
17
35
31
77
47 2436724306216857728
66
98 D
90
97
33 2706429082601796495
0
25
82 6526627641290770711
70
97
25
54
54 D
10 D
68
1 9140741252148964324
23 9057920096462292690
3 6648485395537371028
35 D
99
3 4623391500142486813
19
9
3 5175076428091343234
61
57 9109420490165346122
61 6422637177848059331
24
13
22
4 4385982361719716475
58 507082355335583836
6 6519067194886067291
20
16 5840031139618356785
54
70
22
80 9121488619703582871
27 9041322086622325792
88
13 D
50
26
95
28 D
14 5004145130007050609
51 4167433142662264958
89 D
12
78 1517828314252630248
94 D
50
23
57
12 909248867781458214
73
59
28 1447172243737025787
31 6558950730964118227
76 899696158775959218
39 6741541167983924876
85
33
29
82 D
74 7966519166678491954
60 D
79
30 D
44
67 D
75 D
73
33
18
57
29 3447962540488592219
89
21 3093730676360443924
19 951149971302394096
45
78 2132993095332015346
5 D
35
41 296228829085938754
10 D
26
16 2870228720405272925
96
0 D
14
23
75
56 497017173937299757
33 4459291040006567517
55
65
85
52 7354660276413527176
28
23
87
1 483803161882943993
70 D
46 2207017067339601120
49
100
70
10 D
41 6040661681095795351
45 4063810859498126403
44 873425796428801804
52
71 2482161219031949177
53
5
38
34 9083191499471386450
5
67 1005141256999609885
38 7884841029967486680
63
42
11
7
83
46
2
15 8283519513603943212
12 757633790699495893
56
27
90 5040731945482929516
34
81
1
95 D
30 D
29 D
3 6818750043862136920
81
4 D
54
93 D
50
42 D
99
70 883359630838741599
92
80 4126060906152819233
58
60 D
79
55
55 D
76 D
80 D
52 6638137678481160472
67
86
28 D
41
31 7024989817094203265
58 4873290064352467238
37
82
54
3
19 4227462229115028810
13 2042643633294916957
36
91
42
41 D
10
63 2426164753544930803
92
85 7879876732063120142
31
93
35
100 4894504568270178768
12
44 4917829594476542894
66
72 D
67
50
95 D
76
69 4917998680079724773
84 D
73
99
23
62 4188709048078964177
7 D
30 1780457078926162206
72 D
87 7631967260953807053
86
34 6600353827711969995
20 229452940684471445
39
21
38
2
86 5541413564027909897
77
10 2848735247185266194
91
79 D
32 3446540837340944485
67
6
42
83
41 8375727494506851936
19
11 3305608461928783368
48
17
14
62 255995951186104955
96 5445571395116024216
17 1630858750951272452
90 7002980914779920201
71 D
64
82 4192091930896348554
5
86 D
37
47
51
25
44 4016038456842094682
80
89
100 D
30
65
0
17
49 3480985851520774839
26 7595890101513872213
32 D
25
13 7583065161838554282
85
83
40
21
21
7 1265901116731729408
1 D
79 9207984577986942761
46
92 808113258243005280
3 284442774390515604
90
70 606811977910246903
73
72 3353624104298352671
95 8523185761604941114
77
66
46 3204166263456542670
87 794555519120186758
80 4882602584929833743
40
94
59
46
57 D
57
7
58 2960519723966457767
19
49 7161364373139169722
51
15 3377323613745676971
60
85 4061058388324727941
89
84
55
85 6012604240388729899
27 D
62 2579455561188070882
75
11
61
32
81 4308344454030238697
66 3023539154336793043
48 3289871239201153301
17
75 D
75
8
100 3407933643716972254
90 7980096367209317635
48
26
38 7636482035237771349
6 D
61 8096768025692630093
56
99
61 2893373328905461091
68 D
92 D
31
4 6505070334819254949
70
10
4
83
5
100 D
0 6383654211131628236
5
31
52
56 2533387038219522052
85
31
37
9 5966744828399894187
24 6465384762708349061
51
86
67
1 5389426844656992532
79 D
68
1
26 5854323229727795741
31
8
47 8086586260388186947
29 D
95 4784084842851705146
91
67 D
55
16 2526059667694673842
39 2462965749926290705
73
66 102948078373438112
65
73 D
46
48 1330151158790379488
19 2552506657887341331
87 3988181698748566015
23 4159230119240285597
10 8303437036605032918
55 D
15 981569218681836079
62
93 D
5
78
7 5677913208508405580
53
27
89
85
59 8068568346311239283
7
25
44
0 8917222866119407315
29 3687972668366562835
86 6536890367634692244
99 D
34
64
73
60
85
74 D
53 1872438093005832272
61 D
66 954588187435170970
30
77
46
76
0
97
47
94
29
86 889264527505025238
19
5
42 7112693752167760398
93 8789048534539596329
72 3978335526056459116
5
49
61
5 8052838677336187580
25
25 5107228844671805321
57
15 4265018244479238632
84 D
26 7989283701808835454
99
35
96
16 6508398674521686818
97
80 8528583192167083221
16
92
79 3728143551203257815
24 8070379693227501756
90 6683849684122002670
9
82
60
8 1000560147273895024
46 3326816011567569432
93 D
88
19
62 D
0 5133628915562759297
70 3390235294122235531
44 4084141680303650102
10 2017996643833667506
45 D
93
88 D
39
100
59
5 D
36
80
43 6538696174389118401
8
57
37
50 667979800534343564
21 D
10 8988459511639439077
37
90 8559579582912987036
59
47 D
10 D
5 D
21
6
88
17
86
76 D
18 3935679996386981763
83
95
94
35 D
91
2
87 5821422180054591601
47
38 8546658402258001838
89 D
36 7960222255931989787
73 2415595784981537321
54
60
16
30 3738673414877050977
33
13
15
44
11
75
98 5867110363022736370
71
6
42
4
89
93 3222415075317312239
23 5615253685702668396
72 1677109559821997310
66
76 7858744122431807514
31 D
95
82 D
36 D
69 4992725836837092360
4 D
45
59 1619612218454462115
93
93
61
61 7775553927895819041
30
29 3265834266388963809
45
70
70
87
12 5462869830124734237
77 7712051377503872249
89
77 D
34
56 5204485236571997779
15
63 3597409930614279087
35
16 D
55 4403721016231866600
3
53
73
61 8194230260434372894
35
68
65
32
44
24
77 1631715432158086368
56
90
9 3827555809120327763
46
24 3452064531270437894
15
81
9
21
62 894001581767006842
42
45
8
43 D
54 7496479466795600153
99
92
49
71
34
97 3934709269055847813
56 1576051173430914648
17 D
77
44 1953770136606978585
37
56 6217240059492871554
2 D
46
11 838643664945652204
89 8337794028082721836
7 3895928976826527881
57
88
6 3244320935300411852
6
71 778447844160086494
2 46861472082602171
39
59
91 D
97 1966078282978731504
16
69
61 4388309473879785665
35
41
17 D
5 3733559181372426902
2
11
37 5605513017064549081
25 2857683547285950145
91 2168394374421441511
26
3
51
95 8563091601614715847
20
15 5423873221697016470
18
66 958364560875359571
82
71
31 4195264722314503393
9 4696909821251763665
9
35
69
90
85
69 D
23
73 4697680403307285788
74
87
26
16
71 D
78
47
22 D
12 D
71 4450467478851693129
76
6 1172579710286110708
13
42
5 2624620601186776104
70
9 4775715864906852775
27 7038027574789371039
86
86
70
24
55
8 346823284233588300
31
97
82 5290265346012042657
61 D
87
38 3748652361996875484
33 7590085873003814685
23 4133058036646235355
28
64
63
100
48
76 D
9
68 5746472217980737875
7
69 3808445118629149638
71 D
41
14
2
71
84
100 1611592128618078930
22 D
95
8 6011068573626169735
100 8239920186443371144
37 5026802913349856159
64 D
90 3946194115560054701
43 2198125911715324311
26 D
3
17 779536126266465816
92 D
8 715608839113534112
77
77 8585751324794622931
25 7869928947474034514
78
42 6498901985285032199
53
47
0
41
3 8331217183144072153
94
40 5761546704767012201
78
42
4
85
40 D
39
16 7935664535005273498
21
19
97
24
75 D
38
43 D
79 3909594557400148176
29
15
5
9
24
64 2021426709563452629
92
31 1643499406073091368
98
49
5
36
40 3493113110155435911
4 D
73
92
9
37
30
38
80
8 8231294700298761826
88
12 2045920057606655140
33 D
7 2464704561348509950
9
0 465777658002336377
75 8301177402182796954
44
58
2
91
69 6110930947188781394
0 2619466337696266348
92
44 6315781426315563345
19 D
9
19
55 2964562038964237250
47 4100667056804624417
73 D
66
86
33 D
16 4522505109202695711
34 D
27
92
61
19 D
66 1539101422213992860
76
43
18 2076505112779741243
22
80 147498551745978825
78 645272947865425098
94 7927107202848422608
73
53
81 D
40
82
72
52
33
91 7997255872563988646
42 6489105740634676652
81 5034834819597662584
16 4963129575557880722
32 D
81
21
54
53 3136630762732568775
31 6096118541347154418
6
100 5420836711633988047
89
95 5642078565625925700
22
93
79
45
66 5575086046882290386
99
34 3986478581048797245
59
46 3312916171649206317
26 673061450654939818
50
25 8706828470882876796
63 D
96 5607666935089082624
26
41
6
40 D
67 6270327874181195952
7 5800790253163854918
57 7270751586465972277
90 D
81
37
27
37 D
72
37
40
28
44 8243996501666079476
16
11
35
6
13
37
44
74 8389887043438052818
21
3 6686176690036034904
66 3904700570208998980
38
5 2166753411451371311
14
15
66
4 D
17
60
80 7728254911252592643
40
57
82 D
97
71
2 7737972190938690773
43
5
31 4099326494367966732
2 4802979932988101445
32 443003702304223436
35 3769656190610280112
69
91
61 5092569151958928728
44
43
26
78
60 D
24 D
52
51 D
100
79
88
10
33 2913006707804796513
81 6449120362311733029
61
50 2742517312707358499
55 7346113572228212774
15 4313558963958222520
5 963089749789318630
94
56 4715746240341311022
74
35 D
47 2298400351002341849
75 1795319968276791035
81 2655893287726721059
52 5268931602399665705
52
75 243339529134611047
67 5571203419118680891
59
42 D
65
92 6089132655963927796
97 7428915934769875410
17
58 6441155735008449627
74 3437920595344657276
4
27 7724978242819171380
33
99
39 D
84
86
66
91 2242673008870143079
83
60 D
36
60
87 5746416277791022999
20 D
40
93
20
53 D
6 3294000036348216549
44
22
10 D
81 5264483285669866606
83 5559009987489061947
74 8664757992679148728
32
57 9175137421165020921
46 7376899262492107458
34 7027064584124172659
29
56
72 D
81
34
80 D
68
14 8028877947215407618
72
42 8520974318039649281
18
14 2535299718091641783
98 D
31
34 4156257493375372164
78
94
57
78 D
24
53
68
25 D
28
49 7996926988661872608
59
81
64 449223143807417189
68
4
35
32
9
3
49
41 8677416065133919623
10
54
92
44
89 4322251845303875897
62 607629711369556429
50 7507533884493421090
17
71 5790860242739219078
84 D
2
28
42
1
14
40
24
32 8433834873080128
28
14
57 D
7
35
44 8380387119771722490
89 D
6 6552023025857550686
14
24 3971256445969029642
14
65 D
51
44 3617116927526346165
64 D
75
23 D
21 5875334045617550851
81 4820323929046236118
61
3 8133051621395318852
26 8694714205351417690
14
46
30 2773874841519988182
86
69 8096893643853372878
26
50
28 D
7
51 D
27 5936562740856796607
0 7027788921952868665
97
79
43
87
66
82
65
5
91 5515265114053275687
97
0 3526848121131696046
25 691047664526545319
37 8197955657924174409
1 512599197335562317
14
94 1025719306782535131
31
71 D
55
98
26
7
90 4519518195308254156
30 D
40
94 9022423455406838875
26 77323483179228589
99
29
36
34 1820450309551111764
1 5964734521069608419
91 D
60
96
10
62 1277782786664948069
4 D
42
55
56
26
31 D
18 3906466545762134648
29 D
57
88
77
82
17
31
83
83 1710192510536810758
11
79 418266165513970162
98
40 1911679978411246638
7 5210141766542001217
12
90 7525748040533893006
75
20
84
97
87
11
0
65 D
64
55 37099992688295851
59
86 D
79
96
47 8901938014864597994
74 D
33
7
24
78 2527332554246470388
77 2046725737994252496
56 3136698113238454606
98
2 1464362203426389428
44 D
74
70 1414797863890879721
9 2001934810200524294
83 D
97 D
62 D
1 5772151568740275443
14
13
55
27
42
41 D
40
34 195698476739396275
24 7364427108501322337
77
94
66 4434385635549110772
34 1203159751370522619
26 2356424118297831241
84 D
93 1894102789433724505
80 D
98
63
14 9027927432389346296
21 452386789480070614
8
97
50
8 4684849377170548173
38 D
68
87
19 2919024714441392586
72 4724322882556562287
91
70 5313902279695476314
99 4144973067674901881
64 1038376973852857132
88 164907255868041336
6 1888269313148059338
19 5175942280793355993
9 983261577904077027
60 1126690652423714554
24
82
31 8826410292424939774
72 D
3 5335714967640378471
83
96
49
30 D
94 265996724686685965
91
29 3309874993984847053
83
22 1376570812856738644
91
39
70 3051084352076042397
52 3480747642179973262
37 8054208130865991497
12 2005540402620739444
53 D
76
33
59
78 D
86 D
19
40
31
49
19
98 3860698759956240300
8 1898065914935105180
80
94
40
6
40
9
13
52
2
80
20 D
87 9184586741437942202
8
42
73 D
43 8036933665058877266
10
15 780711884766817049
31
79
19 4643133688621979820
12
9
96
91 3526642763757491209
91 1482194091732741571
45
50
83
92 8449641621822120751
91
61 5760400738933826535
79
79
52
71 2669598537000799836
62 3612231688136192845
75
7
51
34 4879837304565368974
18
31
37 4996507220853272961
40 6012011958919952206
29
82
71
91 D
23 6764238228903114951
49 578129285654156112
40 1046260246339874912
67
22
14 2738191544610302532
61 8497769085343190002
17 6689968375848338805
17
65
39 234138089172403373
44 1091596454787232568
30
22 3647513728992965286
35
71 5646893830201842555
75
88 5918676316797847932
20
50 238412307504207702
88
92
62 5733388269561586635
66
35
93 D
34 D
79
79 5181932849268033508
88
53 243581195131820206
23 D
63 6802246910224479777
82
4
26
95
92
87 8699767452391279320
0
80 D
100 2143662177835763964
77 D
9 4000500894900025030
50
31 D
19 D
36
90
90 D
50 D
36 5056643621349849765
89
73 D
45
50 6920842150181894040
4
21 1989319995037253120
18
62
13 2404926094307605668
86 D
32 D
47 3280762066385925976
4
26
5 8812912781319571061
7 D
13
94 D
0
99
13 7054504293602329603
82 8491090460535190035
95 8505633065609882079
60
34 7112763570062070634
33 8101836951378429598
5 D
65 2901756973465754276
13 8225413873853049088
50
14 6128179447274288441
6
74 6455765196303161712
8
93
100 D
16
82 D
5
3
72 D
23 5596068224846858791
32
53
13
38
7
82 4792336407282104670
32
83
76 691149625059468404
11
21
45 2384096418839412201
88
82
7 3545019417764896770
43
9
77 1428919692884626085
93
88
31
7 1334795146654027691
20 4483757172619426266
94
80
54
45
43
90
49 8215264194981243839
45 D
8
78 5253351485312833176
47
52 6215761714294322666
15 D
67 D
83
48 1142564412096209997
13
38
57 6400807747505896115
56 8657044187906814472
53
17
9
98
20
75 D
46
37
75 D
69
52 D
95
62 3142678838207083072
25
22
37
62 3193116600255706409
74 176484570342604801
40
66
28 8229308168756952032
50 8972968304908291637
13
43 421295369016974732
43
58 4029705560954899492
13 4315481264254566490
33
42
52 7984076881705136386
57 2117839661003608718
99 3758379903490757262
56 D
2
78
29
83
30
69 7108855629728258605
55
12
84 1775301786234699240
5 211270974025297449
88
48
68 3157861838782434541
49 D
17 D
44
67
6
67 3311429460523159321
73 D
6 8970951034628116484
26
64 6627987053341278333
50 7889830889582175033
87
9 692310834939419603
65 62912295987314903
25
84 D
15
54
48 7680064920628764227
53
13 4118200743054563442
98 1246470470921847708
8
53
28 D
36
16 8246633683901392230
44 6660199331941968973
8
87 3741096688541940962
27
94
6 4720911836259644884
64
89
70
15
86 4461795441204641399
72 3976899007934930362
44
72 776928709642642274
28 D
93 D
63
25 7530081148582007074
92
25
66 4842471248691494733
2
19
86 2317945406028995723
86 D
51
99 D
14 D
43
56
40
9 9154995051049042142
46
74 D
4
7
12
57 2811771132567606944
30
64
1
7 3568137287011222194
52
4 8767400885442538623
30
36
89 D
6 D
97
60
92
85
59 847036190601885380
61 7149800072655895078
46
5 3804735537030029990
41 D
8 4579503685008434674
37
32 D
82
84 7280529193175482418
93 D
69 8031641310786226600
38 6712213021319557791
14 7944779812347443497
92
44
56
81 D
87 4667958947975847474
0
31
13 D
11
100
72 8981166273319942044
87 6906355542442625224
0
99
72 D
99 D
17
82 D
59 194630835957584912
19
78
79
44
4 7106869620058307522
70 2875681173493959984
83 3683087243387170990
63
42 2801525786229074184
75 D
43 D
72 1566791624204567301
36 D
59 D
10
25
29
20 6448810872812492371
22 6086957425291573062
50
34
4
20
89 8465659654567186475
92 D
56
10 D
69 D
59
4 D
33
78 D
90
31 4343240016411716584
6 1501796032806112993
80 7125710444002655205
71 2192988778576499095
29 8902929517440658402
47 D
64 D
19 D
43 4287512751134705156
14
12
91 1727652436069130452
94 3676429487893783824
77 D
14
72
40
88 D
25
71
18
33 859735407739321956
7
31
1
71
72
49 2886022907169627620
6
49
42
91
94 4907509130994187973
30
41 D
7
51 D
46
37 5666314017361205045
16
69 D
69
100
10 7696715795650729928
83 6011336875386707483
61 6941784041470045413
11
99
43
82 D
76 8262333243002386813
24 6008733849370058128
66
47
31 6432263059228615467
90
45 3871102101526987272
6 3486677498518149157
82
3 937441349654867418
23
72 487248028620672539
64
2
17
89 3935388191466993515
11
31
44 D
91
74
55
53
96
3 2047089578475703311
45 232624715236833018
73
21 5431929760692031887
23 1500359305081428060
56
46 1056898764551934140
6 4889868190880854297
47
49 D
90 8679997232574727769
41
44
81
37
15
16
5 3942952449101884537
74 758138186161691438
36
60
53
24
46 7359823540194587420
42
90 2981041867292685332
26 D
68
81
53 2732607716209059511
41
17 D
91
44
4
72 3971974084014926319
96 4289467632975811582
35
79
85
49 D
71
50 979829366254080461
49
30 D
89 D
53
12 6329566183085352952
16 2103296786688669518
35
85 D
14 7630655924017120969
26
90
85 D
16
85 D
30 7927172867310147603
88 4234531819293148938
18
47
85
88 212042691829927337
91
8
37 2370861661254178381
86
55
0 5055706339258190089
11
14 6149743747605250099
61
29 187196621567804360
23 5524096464999609306
25 7622599567486579548
47
25
86 2150683840497517618
43 4836188667002946449
68 1523290038819459268
41
79
55 7631550010911030578
71 530422289605211597
70 1196349541050588209
40
21
30
10 5757604844460503799
29
10 D
61 D
5
49 4838650276683072527
19 8183289381338997912
94
52 D
39 2236663885658968687
20
77 3610038438866251484
8 351777354745067666
83
3 7224202992347010288
16
89
97 D
24
18
81 2616115786287189373
72
59
68
58
29 D
54
16
99
69 5530496211065396124
51
91
26 D
18 D
31
71 8591296782037047911
17 941702798840945789
21 3963249737659700575
18
58
47 D
44
35 D
73
73 6428304696259437977
36 1222912607714071834
91
2
19
52 8685295470688253791
83 D
1 1520189341951406773
68 306118640256627119
98
38
84 D
85 9179778915891332795
72
18
5
55
80 2628794220864898162
75 D
95 D
2 6821123710532640014
1
59
22
40 D
1 885581307526484581
83
68 4318460815493836012
68 1569224783883185669
31
13 746116842599367805
34
75 3580593119499525230
35
38 7378348498379368617
59
73 5845523928285590552
65 7267713545715991943
95
71 8713641404332056416
4
73
43 5714152947542656362
70
76
32
20
23
87 9131240704910880419
100 2236416789285963367
11
57
62 2411731613409938920
1 4149716412123611211
8 2391936909897100943
98
60
37
47
30 D
100 8201946617061484351
89
71 6281465614623809637
38
9
97 4857491484600059391
62
77 D
74
98
52 334049967594555738
29
69 D
51 8685404023211224368
42 1875169938746984212
58
0 2185052208130590664
49 5391300217695123786
96
37
80
87
64
84 169972559951187424
13 1424391340820997679
23
54
45 6720512060450329591
74
6
65 3598014662696384927
54 4510921540844098913
79
93
91
28
46
35 3465900582977613354
65
7
0 D
30 9216825519290522518
7
38
44 2286330586990762076
94 D
13 4691110854027935464
85
23
63
95
65
25 4816721361940842563
44 8006057241582470945
0 6131421827161848083
20
60 566295606713581476
5 3891836686269638894
57 D
66 1795031750321688421
27
46
41 942014830959474717
2 5763360733263125063
6 939973618442452977
2 1332837563069685407
15 5191923716054210078
11
70 3151475763639667556
32 D
68
10
48 3633069091379214853
32 6544501290105888048
66
44
30
80 6579116324716900711
33
74 D
42 D
5 2859493133515235297
62 8342768444641986322
80
79
39
74
95 612019625321498417
13
7
70 5348190457162682218
96 2242863972569764106
84
93
77 1383000789640352420
97 5174530953469317011
39 132565131969061325
42
73
7 3848132412765885342
80 D
38 7563299201150529797
93 D
100
52
41
72 D
30
82
25 4021877878654459529
68 5369612297155338648
61 D
4 2967224215557046765
14
49 D
5
61
85
16
55
75
68 7099966892058519714
29
5
99
19
67 7200363345993046735
1
6 1964541107912720111
99
16
34 2588937130826636260
78 482912659631285387
36 4774664425541564475
27
57
31 5765074681372846861
37 5408963363790260467
62 1847649315414161826
9 D
47
66
4 9203339940610783185
31 5333220997070444000
37
77 4688619488125780309
4 2643423611596246554
8 D
52
19
84 1621036899173053849
26
56
59
62 D
68 1785451073947767352
67
98
36 D
2
100
80
82
72
65 4208956062443746008
59 3925412309035408014
65
54 4613457139412655048
99 1754482292580471852
28
60
62 D
94
54 5077754929144791362
17 822580118454339997
95
46 5409112961699919310
28
30
91
92
18 7450632324880452771
74 8174339272412276385
1 7242162871115593456
39 4503699931091761298
60
1 D
24
92 2537218018572535649
95
74 D
88
72
98 D
19 4525464562874110971
14
9 124527837147307417
86 D
13 8605035929994928181
54 4213743239657177065
38
19 8185188556027677884
2
43
21
93
84 7033383518186178282
86
83 2197642583947535444
1 6518886697682835211
57 8783527218912029775
19 D
95 5308611264640512112
5
54 8450631960159485603
11
62 4227262230922008769
84
31
65 389845631937055422
58
50 6427811640204071628
91
13 2761945100788199612
74
40 497554308329761946
36 1836494312022264374
16
15 D
1
8
51
10 1836413614978553415
92 D
64
34 2701542088580735400
61
77
75 D
53 6769378990858762380
94 5221364681404615824
30 5042685390050984708
5
13
17
8
99
29 1849439418009453048
77 9161330140412761326
93 D
93
71
81
17
19 D
43
34
33
24 D
24
68 D
21 8672757956301071723
5
53 D
38
71
58 266873844414871303
47
97 D
83
15
18
45 D
36
55
87
64
93
4 1509961829153268169
89
88
71
60 1664613763956889390
39
11
99 1639616392162523212
54
67 809676247101548644
68
99 D
37
17
74 489014637877381078
19 2165448328391093578
28
20
13
43
13 D
34
47
51 D
22 7020917213432346903
31
33
7 D
44
77
84 2755955010024251515
3 D
8 284827144941218349
19 D
27
0 5357930681955979028
69 3431210207673281105
5
84
52 D
28
71
81 8854255958586806511
60 8331060351185311121
17 584311156486425565
57
97 4845340592126005631
89 8954446491167657855
48 5021765916543738661
88
89
52
52
28
52 D
13
23
36
72
45
44
32
31
45
100 6018076302095051989
28
21 6162314363313211425
5
19 5569206872882891982
91
5 1790146503685573476
84
69 8565513828431407620
73
31 724511316496561808
100 2070934481825443921
32
91
55 3124749403369922373
29
11 3193751593257266312
66 D
5 9165005057329888614
52
86
71
31 7480796226317961487
2 4999484280480916079
10
4
55 5494879439048021462
65
74
56 D
37 5098297490147297488
15 867686020278869081
29 7955862485566158168
50 D
73 7521799453462141402
13
57 4187189546910393041
71 3452898339298175779
15
97 D
87
91
59
97
68
72
85 8552544308985624609
55 341183944861785083
46
13
68 2056136246424440748
57 6381317379743283572
55 6660135134088651925
51
51
66
48
72 3975091942791758329
8 D
96
57
68 D
43 D
97 2604203150466969490
94
28
87 D
23
20 6619103950409182094
4 D
37 D
64
20
2
84 1080788499959388511
93
53
63
8
59 2165041098749247222
87 5699123718359762629
31 3158065590427864050
50 D
14 D
95
43 D
44
72 4024818426386566448
88
48 2525744050388894817
58
27 637790008748336100
59
65 6537826603529547281
64
30
95
6
70
78
16 2318188906038353829
87
77
99 7695131100466349851
55
49
12 D
9 4410542771872255238
68
91 231065948341633749
3 D
44
83
21
87
68
55 788482003024976509
23 D
42 7262347674508108122
85 5126434427321802786
85
74
50 3433615369921034919
35 4284761265588852445
8
65 7526977739239654190
42
65
46
23
2 8302681378738829327
33 8292822563752796930
53 3726644576054590338
99
56
78 539729552176342614
73
16
31
89
19 1552466400130042139
58
73 D
91 D
54 4264866179499221164
27 2882116395227376668
4
51
46
22 3596150890077835049
36 D
92 D
50
48
82 2693626290852291042
25 7725289667494961608
53 8133667713674178678
69 4066132601546489366
87 9108614180384007729
88
58
39
40 D
50
100
11
76
30
58 D
50
71
37
8
42
34 D
62
66
69
53 D
31
98
33 5272980677263676892
87 D
16
7 8327252177216908002
67
46
41
81
91 D
98 D
11 5564032749994344895
53 D
28
87
29
86 D
63
34
35
81 6384079781407690365
41
49 7998406839113855652
22
19
88
62 8220228414196157546
13 D
52
86 2103577562093974422
39
34
7 D
46 3588037021544771958
63
11 7229174247606531691
38 5088317950481269300
29
21 4279104755975214023
51 D
76 D
13 2876149838723867042
19
22 5434161759802383459
45 8526276906198608323
7 5094551366326428419
47
51
67 D
28
100
30 1564274831804535936
66 3094841904221872496
3
77 4318445933882801789
43 D
84
69
34 235172000136581144
47
64 2293308466408272665
72 870626704344889846
84
78 163688785810056730
52
28 3718846742815017083
57 D
81
51
84 8837600426853309195
97 6658134787251991732
47
54 D
40 7179575882230633840
24 1602137561805594646
75 5116229255333892677
0 3095036033825390886
75 D
15 D
15 2941076134384048050
11 3704881689667694502
87 42956943506518749
96 D
22
52
31
73 3924155309059468483
53
76 1285655446310002219
7 7055039947181978916
76 5752437445539000784
57 4872864547253478339
58 3941319965210126443
61
32
94 3619926844115123218
61 3598376206488521821
69
8
70 D
29
77
12
94 5547478542319070187
46
57 6841358780164638774
55 374168755416230375
93
22
59 3767853745123227758
88 D
21
58 8323408681407646178
16 8711486347019845759
80 6221792177094291512
53 7136146902508130390
98
22
88
49 5954985359551610043
24
35
50 D
70 4433266500559761403
61 D
4 D
73
58 3773699420956723082
48 172659713177418291
96
59
97
96 D
58
77 4615007360675544892
61 D
45 D
93 2740290593979670523
68 1362090487955278112
6
1 3960026606545821647
100 1812712414481007803
31
92 8718083549655205459
16 D
98
54
94
7
19 D
81
84
42 4208229102888735599
58 4497251288323200887
44
88
89
24 5173064423522521940
55 949624115145396154
86
6
1 465987987005297561
22
46 8560883636268329676
34 2042856195812814963
94 D
90
44
26 6618314977752248996
93 9017656058104932298
51 8982655769613588332
98
29 1359499530133919565
91
22
82
85 6663387568339835380
67 3543785388356496473
49
12 1837835497164701443
12 D
24 8034584925029203814
98
68 4792072281096531406
89
32
36 5565907820034702835
34 D
67
49
95 6688496327494214457
34
88 D
34 6226200270977946808
15
87
24 7326954619454106585
55 D
74 4223728862533332715
67
0 8199421481410579371
46 D
47
85 6023201979580766633
87 7038296040494919564
77
100
21
67
79
2
81
71 5111540921124962088
55 D
83 D
3 140980714570275464
27
82 D
47 7182914200691885385
86
6 D
64
8 D
13
12 2719283738521757569
18
56 7424870848698296447
84 4443851253151600871
41
41 2810193974173510814
82
56
12
57 D
13
76 4137640923077708470
89 1236332263279737505
64 9024917454981571640
73 2743563204554929052
85
46
95 5179297295962226910
79
59
95 5367658151030692923
5
84
30 4185653656884790979
62 D
74 D
17
62 D
63
67 D
24
77
96
91 9103272869189572004
53
29 3556697989298621603
54
56 D
61
96 D
41 4498676073338987659
8
82
82
66 1749129196337591657
63
59 5567858432826391748
56
41
93 2221621631759724989
47 D
23
30
54
45
90
37 204024365697835241
61
67 6588095886235242651
32
63
35
94
97 4913757742641564017
90 D
62
53
17 2593462160152347740
8
91 5884865096481736591
47
57
46
47
99 2773010181659059562
30
34
94 1430829544798169337
59
44
4
48
21 6976796047147032136
19
57
37 7739628023326941616
3
94 7112936059377125979
24 6478652374344290648
32 2393897978541333894
76
53 3596623647753664994
68
87
52 8707307685278140737
45 3684544952204126210
63 1306211920069455063
38
76 2743184727660096271
31
87
64
8 D
86 D
87 4546111270031735545
48
84
41 D
84
40 D
87 1250098162577673865
71
76
98 D
6
60 5512607936637574853
19
57
46 9071999470101558367
41 D
58 8417677160080095491
15
13
70
4
6 D
85
50
35 2529230438627508906
10
89 1008115086564026270
25 3781931707046538372
70
20 D
99 3784739346994605378
67 8786601040637674270
71 8674302187567845351
90 6576104082016005033
65 6715629178903774697
39
74
84 3064381106351493215
69 1212074951018698230
79
20 D
88
30 1191369746504107425
0 6215394241870100374
84 D
16 711658899790916328
17 4093096137626147125
90
45 49837086821060199
95
84
83
85 2561858512480477666
59
55 6039261067199039476
12
78 D
9 8273063155298631603
6
26
28
54 367815985237238314
91
19
67 1566958739810047626
17 6485899766368637885
92 D
9 5063706288130839915
66 D
5 1824462587647677065
53 4646575665069783850
6
82 D
11 3254684136515773524
89 77743382562187404
14 4522131565843138028
54 4349141207613100241
87
69 8124303371796726935
30 D
64 D
66 D
49 7186374789694015842
2 2891193793425911220
45 4120456132079089740
89
21 D
30
18 1462538785941394583
72 2617852046385144241
98 D
80
40 5442324698573361356
2 9217400217836583869
3 5653941293077465296
97
76
63 4179929251415434038
5
41
31 6233780578128803950
59
46 D
85
36
12 5188246084689685758
20 D
37
86
65
81
42
86
12
74
79 7349920032824918737
93 D
98
89
45 D
37 2204957772418994641
5
93
58 8337730820068579435
38 7448218077055771109
94 824697525604165886
33 D
21
48 D
52
40 5013005265615323237
31 2048825213435674762
30
94 245356063387556873
9
13
47
77
60
27
65 D
85 6951909847379713791
1 2125449796242206508
27
97 4302219640493361320
46
27 D
39
26
25
1
26
57
43
88
3 6327800586362328667
59
52
38
5
6
26
43 8363484388954886559
24
21 2400790529351462229
47 3788606056254480377
47 576487438579031544
28
81 5075533966523317723
24 5647657388663441098
9 4252587719914831499
58 585982057481374162
82 D
24
100 5519620900481671045
97 6883732058873916845
77
29
60 391655356456106023
78
69
95 3310496075723669787
71
37 4478051685202422343
95
99
57 D
47 6474486983332989593
20 8971087533125501320
91 D
94 D
86 8722666559894519418
29 5531478596533106954
75
11 709237456802876375
68 696117636531315632
26 D
47
89
98
80
9
78 D
51 8852244848427064069
38 5440804405177868268
63
17
62
65
5 2989084687587270807
91 8326504268358539668
58
81
60
57
5
51 5156035549689778267
71
95
43
37
1 D
94 2789909972439690941
19 D
50
73
91
43
95 7321509769459438967
12 6020227560396677578
66 4390238839115571843
25
93 4786025905858556806
97
93
43
83
92 7863937623525589950
32
46
31 7033784617688796431
35
50 6749338284743761408
97 791511817278409529
55 3253564002312115911
94
16
93 D
14
96
94 D
4
52
85
9 9165083521052259159
62
96 D
82 5280691757019962296
43
98 7317949422567147444
51
16 4492181828193182637
49 D
70
36 D
77 2108065402488260714
26 D
85 7194548698052355629
57 7972245156910551718
32
75 8186372383053470056
61 4834521924247514649
0 4298269825972834334
85 4507642081251170364
38 3767234570175092361
37
39 5223244237900968016
3
91
44 D
32
13 2343688968591793623
45
19 D
5
30 7301756335620893112
13
58 499997132597152106
95
8
77
93 8326023936042917895
16 6536116403263448703
79 303154173095272172
35 6848450890473375314
0
72 4897542150769499721
39
29 D
44 5880588753169774698
10 8903273824553074389
62
86 D
19 7753307391726197035
65
21 4681477664632352561
9
80
2 2623348594768131453
51 3727413635089977272
78 9005244785285768847
39
79 7912703920242273204
82
72 D
21 3392179484294806435
44 D
33
65 D
32
89 5496360507353282670
3 D
55 D
79
6 8691769130417806538
9 D
22
39
64
29
72 3812924959599937989
27 7968029136661057497
25
47
82
29
17 2645889773567133859
49
9
91
28
13 D
2 D
18 6273191025762113902
80 5370762391780210846
40 4215358792630796810
18
26
47 D
64
67 D
56
4 D
90 493109541755091575
32
27 D
32 4993303185237653028
84
31
46 4958548338950996890
64
6 D
28 1212603389209228904
18 1301654850666642195
93
73 D
90 6786766307209999013
95
80 D
4
12
50
44 D
82 8694199644945427124
43 8294421138731024307
63
61
50 D
67
4
33
53 D
9 6258569591183111230
24 7977569654091222413
17
8 8634167186378812274
11 D
33
40 3661913312770460367
25 D
58
58 6915037056404915768
38
2 D
36
15 5870604883558673029
48
69 5999143877553251831
46 6113141521061646148
88
39
9
61 D
67
18
66 5424791728914795679
42 1738912830284445447
38 D
89 D
93
29
55 D
29
95
59
82
92
41 6396092654867660471
58 D
9 D
60
73 2285610371682737328
7 D
93 D
15
91 D
42
66
38
4
6 2421857291015178493
16 86073321703110566
2
50
9 D
99 8954154205182836693
57
32 D
37 2430400894748483469
79
0 7535836059806337709
6 3206143908897345487
14
59
99
43 5836411014501966534
11 1463936864961536919
72 D
46
18
45
33
64
92 1763776245951902883
92 958823366447318026
91 D
78 5101576210511014909
19 2946501974368799383
25 D
45
53
79
4 4896921876004273510
44 2896700796339290376
57 6875138736627929253
83 5244077050500566702
10 675172780334198139
67
49
60 D
68
2 5922108098958055959
78
73
85 4026997757664950222
69 D
81 3454743989350755247
90
66
27
77 8887614080995255816
23
38
41
96 4329015580663467004
88
53
81 D
95
72 D
47 7512419350764960448
26
35
74
79 199616620845220782
72 3420128795321139064
91 2042820774468795585
57
27 D
0 2468545630353410748
0 D
42 3070357861629077520
35 3481786390861396346
52 2715505994020635211
67
54
84 1279119032886063150
8 D
95
14
91
75
17 5913541150169703550
67
72
90
51
15
24
96
26
65 1582543869253635878
67 6074552097021974088
19
87
8 7047238661490152073
77 D
76
34
20 2577684478736102268
15
39
42
67 D
6
16 4185558508818799759
31 251428939156364820
23
28
55 318663437254071940
68
46 6258956377915169564
37
78
59 3556685389474259106
25
86 4996572895439160261
25
42
61
44
10
59
42 D
74 D
10
96
9 1576365744187143316
15 D
5
78 D
81
38 5956837360972889945
87
66 1293039119057557749
63
56
62 4147861615626520949
45
60
60 4369241714998760655
60 1617478185225805684
4
69 D
70
18
72
84 D
55
49
10 D
71
12 2442322416585602846
10
81
28 2768248265147013516
41
8 D
16
6
16
69
62
23 D
73
56 D
2
46 D
6 D
54
39 8119000029925687280
56 2357361749380952732
58 D
83
91
52
37 2687639491279727127
13 8107304716944769655
74
0 846085690747128865
27
82
74
7
32 D
17 8747718451925230929
46
96
11 6503252819762967244
81
98
64
90 6989542395020576615
24
74 4636490504408816968
69 D
12
18 3951421049056499960
2
17 4785175963669558645
78 6652937640812481485
23
52
40 5156219205538573436
1 D
56
66
42 792017097248468221
63 5718052611917260897
61
34 D
83 D
90 8461560352462888870
69 D
30
26
94
41
12
69 337531906642647845
89 5050648163478993887
3
31
25 D
92 7111136054778252032
95 5113506218267680755
21 4020220784253287904
72 1043673104530356266
28 D
97 1541396564261549040
78 D
71
40
75
94 4171968576366490496
26 1177148406946052731
32
73
86
63 3504335601958180950
98 D
50
67 3244042214306999176
62 2001780560535700148
10
79
14
67
32
51 1895940693649336550
21 2433199438526774151
93
76
91 4224053696895615112
17
100 D
51 D
97 2228496491204047045
43 D
90
88 D
32 2129848289782105939
15 7441987269406733192
39
77 3920809687774582492
99
68
74 D
62
19
19 8326903222262778471
0 1722816895223207041
11 D
81
48
45
73 D
99
76
51 4112173361552604288
44 9032199650469108517
74 7073464084226031311
72 1411654286648563045
28 D
38 D
15 1281612937271462364
5 D
62
81
93
80
10 3023040465293773974
44 2133866110167261126
57 9028202160276078491
41
68
88 D
16
59
94
57
24
96
95
55 D
11
73
54
50
14
98 1993292136454182659
55 8435834359795113638
23 791422911089474062
94 7451863651955705842
97
82
97
56 8058726965471443359
65 D
94
68
83
94
50
29 116153004138045096
46
28
30 6306880421652491449
56
79 4085622921755211280
33 D
23 D
37
71 2911326801172282555
60
15 4158412187077895392
83
77
10 7425338323951973775
35
93
42 4159121583362787227
40
63 7450415166644824083
28
27
4 900964556959570098
97
35 948776968214201716
91
71
63 218185916827665371
54 3663867190720107768
5 7236404892308836151
78 7695388781494856266
65
28 4193303228978873799
74
29
66
38 7533556507482282049
40 888794848546620679
25 2274988183330222080
47
59
44 4314378949092443597
37 5799385288904291597
12
32 8722783028635460131
18
81
97
55
62
53 8108257893529157690
57 7157780763315635045
82 4622864384441138112
39
13 7595021673169608508
75 D
12 8226501086763693491
96 D
19
55 7062936908130046659
71 2024893308042359115
8 5104899397661648303
56
74 1633810381162042180
36
81
25
73
9
47 989433931540158526
53
3
2 5717043441188179181
52 D
17 6446146205736294960
95 6799951526319719804
57
46
86
61 4839433248013749495
9
37 7643655881082832289
34
28 D
52
3 7267544304664649029
23
75
84 5664505667653414411
92
44 6924695951066440940
45 813446945243013787
33 722102250756594234
74
55 4506617793987854646
4 3642098938765851235
89 7624433422672548803
98
25
11
17
22
46
96 3612194316634861971
11
73
31
97
69 D
100
11 3143712780088479108
12 8057648982383103932
89 D
76
59
70
61
79 D
69
16
74
57
41
61
42 D
98
75 5342921254387726892
48
86 1087798802125043257
17 3261884744555590509
84
34
29 6637332408220680772
44 1981621221496126147
70
9 D
93 D
53 D
4 D
10
40 3718845759772665970
70
11 6845878769889710816
71
66
38 D
86 3448909930031054044
76
28 6790621870260297585
59 8821960996382653102
28 7079203603370463667
62 4466371172750497333
87 D
67 5359465003374619511
40
25 D
96 2178295628809570016
82 4593529219088692938
79 6851054670225457743
42 8459480992247902953
8 3238143695760813001
34 D
43
36 1768943081264893096
82
2
30 261318502000938917
99
33 D
54 4684865999727364527
97
59
39 7370214940337966285
45 6500104489985539973
32 D
87
74
4
60 4960470055790498181
55
70
74 2221450177374722859
61
54 6467163733654430016
37 D
14
40
0
100
22
30 757845475880013215
9 D
99
79 5687632914709567810
40 456113624977839027
1 D
75 778228465999601809
51 8370352578851255051
40
24
65
63 D
7
5
57 3293180242612580452
6
78 D
7 5120381892192940686
16
69 D
27 5043611318154523032
79
66
32 1785929800049330474
32 5011821899351940454
54 8011396164070355398
0
26 D
56 D
2 5651766805280631167
91
4 3583201045996912991
75
16 6859828323514039971
81
50 8468526436168055563
36 D
27 337858149329425704
38
0
58 6524071913125352324
66 264046195057381771
46 5076341545941651446
51 4387902110104888354
18 1365929363669375446
42 5199875089601757759
78
25 384391831173280630
48 715255230398290723
40 1788358608126959471
59
21 D
40
4 1576108749808257761
94 3139484319117190379
47
21
51
51
79
99 D
79 1000359030558693091
81
17
43
13 7213191583718317606
7 5849292049805024750
50
25 D
68 2614322145542300463
70
74
100 6759550687233269560
7 4426808430690407874
91
66 7906268790981139305
87
6
69
4
69 7119071967416719505
6 4942745000978854722
22 3340411923907536856
76
88
78
69 3291319456054595317
57
49 3132656333999687740
42 D
53
29 5563943671162219394
20 7876559032934613244
39
91
49
29
7 6517751401669562003
27
49 4410801407555497018
24
32
11 6372420855005670721
9
77
31
3
40
68 1582391051491177508
9 3481400924748443839
85 1028634814848820568
54
83
5 D
93 1976746850807270492
85 911178121063752187
24
14
51
28
58 D
72 4979403698505973545
47
62 3631673851367720139
70 5630337436363984595
6 5209727378728026718
16 D
93 2693402500587213000
39
63
59 7874628116865867590
71 7562824669581020495
13 805268308459986478
92 D
11
1 940210866092129560
89
51 6895747550572815170
17
22
95 7575142717545695491
77
88
49
45
77
80
60 125446447375660734
64
41
35
79
52
84
64 93757873201150624
78 D
3
40
34 8257449808832788444
47
28
27 5678228869523076792
72
34
44
28 3154882700278837867
23
19
3 5315208340119405414
77 9175981056601216208
81 5812573893966057359
15 7351906222818747646
39
69
100
71
80 8754936631950269163
61 5961482397885752882
49 7121292444534138897
31 D
87
8
33
64 5319053429196137387
48
59
75
8
96
44
55
100 664894404074583969
19 757796464119782664
28 3433788658129934171
55
27
55 2618161298994096603
65 7675126738597512125
81 8840464414888175093
20 2821253091202693101
12 807046338784217798
68 D
22 306566240958694724
74
29
51 4423371610442522692
63 9023032438762302752
82 3372628724015254877
99
29 7078732576589806882
71 5773716291343901431
97 2682663883095006031
57 D
75 5601586733272347935
22
39
22
67
25
0 6718678073369594294
65 3209745229132506345
69 133141280578277593
79
7
59 6417322903536589548
65 6811117196119217698
48
92
43
41
80
26
90
55 2524128136107631695
3 D
71 3567107093991002591
37
73 6049393556722368590
31
28
55 8583460960113756742
33
91
42 3892378076148223880
4
75 4359336321020047952
84
79
38
27
87 D
75 3736835171006360962
23 6727087647584613883
100
73
68 D
46
20 8554670166077349253
91
45 7989143788113750336
2
12
65
27
42 D
51
32
14 D
26 5833072237749342207
32
38 3676414303234443530
10
61
5 7530932305316054543
52 298188980012637798
3 D
67
22
81 2586589208047972894
81 1068800702888044505
59 6032065043120961574
100
39
53
60
82 D
21
71 4790368331924605163
27 D
4 D
65 3008126434870952496
95 621007184635748803
41
100
94 7544339696602354280
90
42
56
48 4226633078751034987
9
27
30 6837306423454102817
93 4499702433441613200
3
89
26
39 8450294273091676753
25 6190448906767617314
16 8895736787200348544
32 D
35 5895987428918305562
17 4842533466063338495
91
85 966528166256107647
79 8826007148729888159
78 4839255679383894918
65 4937772216818704744
87
77
8 7412371795470815189
18
41
52 6895786498807973844
59
14 D
27
78 860187169705087800
36 8741779972621515792
89
24
50
84 1682341689485583466
60 D
4
72
58 3732210419624641660
56
57 2421248536563089447
9
41
93 1298784760963984224
73
36
100
72 4414473555478824822
77
97
67 1784523569515635563
94 4808507188763278279
30 8883789223386099114
10 3393280197328126834
37
67
33
78
67 5607344664710250069
48
90 123658706420931295
60 1242813410639770576
47
31
19
7 D
99
39 2977588535983377459
43
91 1902327726455266416
83 8201419358024162436
41
53
16
32 1336049468470957417
79 864428171560435766
13
36 6200785797623636820
55 D
32
33
8
36 D
85
78 2074319589418439820
72
50 7654289367020132648
24 6961702548674613202
26
9 D
83
87
56
1 351624853034048932
64
93 D
14
50 2110835742133428820
72
11 D
85 D
55 D
29 8249970277350131157
1
41 6711563360460255209
76
57 4314656171513491378
85
5
27 3804093424638534502
85
90 4314312224511756773
92 D
14 D
64
63 D
47 1566088535376610022
24
71
97 8747560480932813840
77
29
15
30 D
70 8359826084493198172
63 6063898398542112292
39
98
16
63
7 5464597058562338721
64
50
73 D
78
4 4274798883760016953
21 D
8 1252993323851709006
37
62
99
37
29 6377412259302153425
40
12 3656746370843716368
3 D
96
72 D
34
34
100 D
44
18 D
2
80 D
38
83 4853093509229169121
75 2149487310924503432
46 3632016135725052982
37 1436408452292884428
96 D
100 D
13
90
81 1165332551667471058
20
20
19 8280574961871441519
34
0 4359803432671827990
75 6592289762187085378
36
36
82
28
30 4897999357126512326
85
50 D
48 7506180906637267748
85
39 4777915799432102441
20
96
69 8036121309114812313
41 5019712304788194790
47 3708200695705832476
61
59 1960412870807619079
30
56 7992557729647538509
8 8339827322311314536
3
14
45 634629231887172702
34 4382450145348550363
30 6681521337659689165
56 185767185759068221
44 D
63
82
18
33
89
71 D
49
45
37 D
98
26
6
63
97
74 1396161880222051067
60 2088073763735076034
5
73
38
61
41 D
9
28 5173067257285839726
82 7043854779830372242
91 3268777004143013304
77
32
63 D
31 350418545467295021
21 4716649691886237747
40
7 195140570603017603
86 D
46
61 1401284535613924052
12 1725000026126325463
58
89 6765731188906384615
80 6644448194651195329
51 3639116708844168380
11
37
45 1777214358109556044
64
46 9047505508390049730
53
24 6083397415696817640
83 D
18
11 7602480532036197080
90 D
91
50
31 6765201012037427153
48
53 4861173085963731846
67
27
50
91
16
48 952312778479522231
66 D
72
57 7706881023174038875
20
60
1
7 8958487331314464884
49 D
77
84
77
85 D
84 119080067252292077
16 1446240153161296083
80 1738340331522000380
8
93
59 1975407098520856637
1
91
44
3 372583365510374105
26
14 D
69
43
17 D
13 6221770208041067954
44
52
39
90
67
80
82
20
2
100
90
21
16
68 8329718375195475332
68
85 2145056894452808449
66
37
58 1347493742624696372
55 D
92
36
83
50
5 4407286050735201513
64
74
33 6921617374911474441
65 586308361732867216
43
17
96
66 D
50
67
18 160988214874967153
4
63 7841079922022255283
89
36 2037509913988986992
39
93 D
18 4186838512443524069
73 D
1 D
86
43 5262125655848316093
17 7047312124014062365
25 5558796298645782368
84
44 6336207616245796430
100
50
64
95 5960203431161221784
47 7102808538270090257
69 4822342355639967425
95
86
72
67 3416007842605207023
95
44
14
100
8 2576614425998844899
78
24 6238404874551687984
80
18
62 3770542273312747906
12
20
34
56
33 8501179270162569349
49
99
17 D
89
19 D
91
11 232832209151726350
21
73
58
26 D
66
95
83 6066138438746727955
62
81
29
55
17 5459351560904456465
45
19
69 2587054031034340729
10
88
85 2698588780085228954
65
30
80 8945374131537307957
7 7603473140362847121
42
89
85
51
45 7353531291580930458
21 8959367080028463625
13
83
60
50
85 4343163055580974791
49
57 D
9 2479467119853304551
48 1863084061806364705
47 9213825522025236216
56 D
47
47
15
13
52 8081890426258328188
14 D
64 D
87 8454663243634083854
47
77
0 D
5 5091687610292955274
85
71 D
69 4824343592584774098
75 2353702907606973199
48
65
13
44 4940231854127320447
85
39
20 2068354241464193515
35 8499445815896129708
39 D
84
62 587397617130005196
5
54
97 D
90 D
76
52
11
23
87
71
73
35
63
63
38 5241415130238518007
86
83
80 1177237884436292578
59 7234794310802186301
96
1 4325815080612872141
19 1603504693012611245
60 D
72
90
42
53
41
4
79
92
21 6011030154420296128
77
25 D
80
32
45
65
45 5718725425137385625
6 2242165754380672095
77 4643423634602802011
19
46
80 8074039875757638807
14 2030352538928292565
58 6889190938158751218
66
23 1504523473084441756
55 7925488558352049467
94 503660305053168869
17
21 6070334154468699883
64
27
33 D
24
29
94 1335190849515635258
86 6494802479077224693
84
25
81 9066282234735448736
62
55 309995411002487021
30
3
15
83
64 D
91
25
21
39
40
77 9103957503079511465
0 7741995177058967207
66
74
45
90 D
1 6287916847041902443
33
5
49 3304531171065726313
19
20 7541098501178233828
74
68 2520084627570323744
3
3
91
54
84
95 637922754099985035
22
52 D
73
42 2573444766865047232
68 D
71 5378148848236035574
44
33
72
22
23
9 912170239775793333
91 D
71 D
84 D
86
39
46
45
41
44
40 D
64 6748850183780617249
48 3944214019683612096
37
99 5751682233664208712
96 6781839801229916555
55
48
19
10
6
70 3444904761744639032
49
2
11 3303485092951046076
46 8020943688342572100
1 D
8
54 6040328997599731168
92 8098125176593977488
11 1021148933301987187
26 D
40 5680665387324110195
83 D
52
37 7991123444196085481
70
69 8157986981400573420
13
93
46 1423332459501485579
27 D
7
56 4894232784846175157
43
8
95
90 3858519678786237641
86
73 5398245976095125348
60 D
100 924494919287551897
47 8558638210291093230
5
29
17
3 136656994601553671
30 4470976543367012846
28
44
1 1026833148815537603
34 2795364427053436574
88
56
44
72
85
41
64
2 6230871861545411656
44
3
4
2 D
64 4752184424341979036
68
17
58
53 D
66 5420704282913904218
53 2439088584480464904
4 6935416537404345532
71 977271510436068996
91 2814564293142186472
51 1248632782070611958
66
64
99
88
94 2603014655610596171
73
45 2666413338343336641
52
59 3578523066858164625
75 2258643073732326745
62 143654236538783130
26 D
25
19 286604409030255398
12 4344667504728051235
82 4192907261223397381
37
22
85
71
98
68
62
44
61
76
70 8338406137793984188
8
49 7726913536772224673
38 D
33
75
57
64 8537409261235169292
77 2029728358578592451
85 7987041431790840402
73 1715169364901954817
53 D
22
63 D
9
75 D
20 D
24 D
52 4422945173297465346
79
8 8253190625897624134
71
40 6901046477219217924
63 D
71 D
39 5102581715960458614
43
74
67 7046207539297075185
78
14 7127043894684708792
90 4827235057211451455
39 D
89
16 322503354050016475
34 5390000277536878943
46
49
54
32 7503545190276164030
73 1540539976119673010
48
1 2223016162632378892
43
77 3194504141194140171
61 8358883954133419507
86 7320851002404633439
72 3462981341538653753
0
21
14
42
71
73
90
44
19
65
21
89
96
71
61 4776605158975655709
12
56
48 845830204634603987
12 D
69
5
94
56
37 D
35
79 4847707958501657043
88 7142987014743534994
74
28
8
70 38317788555575399
63 D
24 D
10 8712651502924624481
25 1247142422561591497
92 3785442476524718319
82
37
57
18
3 2664528797766421364
22 4388284236208760002
3 619525740350213417
95
79
26 2148156084034925228
69 6405987296181659908
29
56
100 D
81
15 4098013446288575231
42 2479027924947989558
1
1
34 3945355482738837977
25
43 8592453979301517478
69
76
69
66
100
71 6536547002570694073
24
25
72
7 2398430908619025100
43 295526087463696279
100
89
41 D
30 D
95 9187070749795396190
23
34 1927316698086866766
82 5744766118453212265
62
30
76
70 3327192371377703763
42 D
70 D
86
44
35
27 7204930656423589526
17 5307291518310943603
30 5867047418241024479
37 D
58
79 D
58
46
10
60
53
49 5109744034979134822
97
68 6937086601048451521
25
84
70
3
53
50 8744821486581673383
50 7217298524289752353
12 D
9
2
83
45
92
82 6268727724504848267
10 9001605370207738222
77 7606273129925175113
8
36
40
56 3636379620913339442
62
4 7788119502781456965
90
68 5416104144000781490
95
26
52
37
53
40 D
17
72 5364204979344357651
51 6812245537377781264
21 832306078372390420
47 D
85
56 D
36 9177411114147307753
62 1283949434723764859
42 4967782372087741602
67 4065340701492912257
11 D
59 3459390487482599196
90 2842658943796592106
78
47 D
82 7156810825627928069
54 2302752975417624310
78 378558736643774685
25 1600739618386982796
40 D
80 6253636239891741688
19 1614655543969045837
28
31 5307311630346768766
93
89
57 3555354606190521908
24
29
45
43
49
25 7531656885319719803
99
35 5133349277061019140
96
84
34 6127610257583511683
3
100 966363696325646815
63 1529209753650150627
18
66 D
48
96
14
67 1105837921508276878
96
52 2228433157239440072
16
9 D
75 D
63 3124254352959149789
93
11 3100700254062248058
100
4
61 D
100 3373726280492321549
3
41
92 3542042423563144095
78
2 D
82
29 1841753156042609111
67
22
56
56
0
7
62 3285470547818748372
11 D
20
100 5192444424222061339
94 4797649704222000349
65
34 3228518786545444555
25
89
55 D
8
63 D
35 1269342632503195045
22
27 1582955559964553762
57
23 D
4 D
31
4
16
22 5642604081134648950
18
98
73
28
76
100 8972723035315407320
86 D
44
53 D
73 2502168644800118722
30
51 6482924733881012632
90 D
68
43
80 6521369693723505241
100 4330586920392452902
73
5 D
0
89
47 1248874368241674957
41
97
49 D
81
66 5576957960400078872
0 D
37
86
77
72 D
36
32 D
94
42 7312323391939038976
34 2951267920483572500
83
85 1530886272401297455
19
40
18
78
9
58
54
69
77 4963509352787449432
1
20
54
53
62
1
12
61 3070746500726025749
31
88 D
39
90
41 D
54
15
94 7093738284351608560
32
79 D
65
15 D
37
83
29
97
67 D
6 D
54
65 6108769864335068719
61
15
76 8926773164430547992
100 2871898962450120862
5
56
16
80
96 5481335202350614265
80 5347888315781138515
87 5205846147850847880
66 3622010228627239659
41 569307463920860158
95
65
24 2577666885918886910
32 D
75 4385974075060933702
71 D
0 8059662635442773420
10 998674304312691834
2
64
83
84 D
3
38 D
88
48
78
65 5939991855046546329
53 D
35
67
89
81 D
56
47 3966592861830495528
65
50
55 8215126111646928544
31
14 D
55
81
32 1817552368571280861
78 6845021679390345757
79 1837603670073125090
47
2
13 D
9 5259292610135718967
33
15
46 1413759279644511357
35
7 1440072780932158347
68
80
50 D
21 D
16 716276351694327966
99
16 403432860567000984
24
1
17 D
19 D
57 6908256871406383746
68
46
62 778561031996885538
78 D
56
59
72
43 9219563990609600914
46
97 5012086275940906276
80
84 D
41 2710665430162126865
26 9206303296508973097
33
20
56 6831573497585580022
76
15
100 3243943167686695985
13
63 D
58
5 4272266151641443369
28
54 5367622732276078374
90
49
39 3778236895802613253
69
86 555680095332311279
96 4484254359702472030
93 D
50 5286487373694746504
60
39 6673736940554877142
30
72
93
99 D
35 3458431987030520390
100
45
3 D
92
2
0 2062570442655204248
15
60
28
80 1627202667267438517
26
47
99 D
34
58
49
42
26
29
63 5827818447389759195
93
67 D
5 D
4
8 D
0
91 1460471382464378085
31 8464864257564894829
31 4722104312803539538
83
28 548021588751747015
91 299612245356912875
65 D
1
12 6774111239629656008
17
53 D
42 D
41 4006691810453223864
38
84
54 6833880614760160135
54 1441667100370835538
100
28 D
79
100
66 8813947579426317488
63 172957546497660356
14 7218036914194440093
54
58 D
86 8183702847860597709
24
22 D
90
89 5931957132773499076
97
16 5895784290234118311
34 139800569256535576
3
70 119526443565065320
58
74
4 7594490728330211364
65
80
12
75
8 5077563244663623625
41
56
90
10 3023075645047153411
77
99 3106955350085572672
69 6644189640670320902
13 5328381215051487302
35
79 476655044828912269
62
56 6931903729614785465
52 4996304704996198383
70
95
68
14 7590183605559417645
41 7666476474228816515
21 D
57 1879113905604647761
0 D
52
0 6021876409997249863
5
58 6853622336058277556
67
22
57
25
43
39 7033408478650411000
22
77 1327147657104888862
17
7 4602463556111819806
92
9 D
55 6411520635343077089
51
25 5613367450687351453
27 D
55
43 1441173676248215887
76
7
98 6451228093463214472
72 2818445738717699205
30 820939971341516542
79
4 7798432550476244192
74
28 4190807888103337219
8 2533171274001551115
45
8
32 D
48 D
59 7725849664766795204
37 D
39
72
22
97 D
100 6917420837000320861
14 6530363080518196449
96 5317486558121942366
93 2214344849087472451
20 D
75
87 7216765297704083715
27
56
4
24 966071894400223794
24 5526697509857103934
44
18 5981012734685895060
50
73 939313855094417442
67
60 1822283289145369021
48
17
51
48 1184562075526994811
85
88
39 8174213681379865522
22 D
24 54056457458840427
70 D
47 2783412790681673713
99
100
67
63
88 D
18
38 3058372989272186367
41
67
23 137833687434038370
74 D
25 D
85
57
68 7809085718621452675
16 2193011959015021327
76 D
57
7
36 5774924434108323347
98 6927555832239794172
52 7794456333481790733
45 1459875063982160514
33
93 341416250746786180
13
16
48 1770406314222151713
31
41
8 D
86
96
49
57 1431202687638299509
13
59
59
3
46
14 4926962747952822304
5 2782507305283731624
19
37 6098222320575489877
45
77
16 D
51
8 6308898927340813902
62
59 7647547625593698709
71
33
42
49 2120519685020989007
95 2935058934732519341
29
78
3
62
59
31
14
5
24
30
64 3839108973765852364
82
57
47 D
36
18
78
88 4916050209840139617
95
63
12
74
18 D
42 5074784438435467914
28 D
61
86
53
97 3482455747063503919
0
56 7098849266203535365
56
43 6834413023407324371
56
89 D
2
41
4 7644402754444638980
44
70 563374529149456596
72
92
70
15
43 D
24 7876013991211451350
40
54
18
57
44 D
9 8934580769105928947
9 D
54 2931728755905566815
55 D
71 D
57 2249876360824726711
54
98 3403998776523624729
12 6571598132439607603
10
68 D
7 8424084221441575003
54 8120434884879555282
61 430023552023447166
38
24 5327908270547855557
19
68
95
63
53
9
45 4407906322057384393
23
45
9 D
48 4888413516912861043
100 D
82 20345517342807400
100
18 160163788327709860
42 4222990837448258878
20
67 1619534402096880698
0
9 401562068202559932
62
66
99 595921632119312293
32 2880921255966317954
65 8742345144807199412
51
10 D
92 D
57 5484979311950778883
68
61 D
66
27
62
17
3 3280978694238961220
3
83
42 4798813804997255717
34
30 8514910932925285610
32 7277329011215503297
93
8
13
61 1658129109701070551
28 3857828705795478293
67 4550599804886822785
51
66
37
13 622926339134052064
72 4435488409105861481
20 1983125169081373464
61 1108884901830348599
74 5539717238928665699
75
36
21 642183413817213998
52
44
4
6 3748844111696372505
70 D
51
13 639003184266783142
93 1907392564501606516
36
66 7506446897611042952
35 2268785718727449284
74 D
8 8789013190874337404
17
4
2 8359093499179522932
28
7 4533780008811054910
45
51 280695329768629357
78
71 227526156385790859
84 D
68
64
41 1160839425097048158
90 5167824380858453626
73
5
58
17 8426496899289040525
27 3970420102141192191
14 D
20 D
18 9100095425916901999
77
47
85
33 5491320731408156936
23
35 1828268032018634307
25
1
83
13
86 5112381803004450074
71 1624814780300240941
9 1283890393870403149
28
16
30
27 D
64 819868045564452198
48 3286384709180800337
12
40
88
77 D
92
10 400988701454711087
33
76 4335589193606683252
42
59
26
22
57 3424254224399321485
28
62
21
53
34
64 954733662850122184
75 8729651793012756531
92 4403221325808627171
61
83 6944763089813588450
74 348592135967237753
10
87 4512735535012662807
1
35
88 D
35 7890754886331378027
8
96 1990955249171374781
65
30 1946581895242305934
82
93 D
3
24 D
68
2 2794867936409799069
68
79
9 5206538302213166136
74 5443023125841252745
46 D
69 7408068332033931227
96 4769550144160042805
95 630860243459838826
2 D
48
85 6688283750294768423
85 9181174994578634515
28
52
78 6628325276698541458
45
12 7890306968938918496
60
12
92 967876960011742901
45 4746523557785979640
82
78
79 4100875306642203348
36
11
28 D
20 4273348012684823258
26
57 3185574880385927895
82 2057987318037839012
5 953795962728162609
26
66
12
49 3172827203162319539
26 D
42
91
21
71 579649701596723799
79
97 2403629364738150249
73
12 7712491185462218270
59 D
73
11 D
31
77 D
64
14 6536021772679323157
63 D
76 2227869575501786925
22 D
4
49
35
11 6533698192529239913
79
58 8568654141363765685
27
9 8938231756421631053
32 1745240888653320257
17
19
68 D
11 D
31 4144088322739790377
49 8522190451180235244
22
6 1755215874161584071
87 D
28 6207119541419428897
72
96 510779811196014289
39
11
89
75
1 8130578680581433143
62 4560670146696684277
51 D
24
72 1898590644204311376
99
83
59 4154348022681934181
79
27 8638592861372829158
11
95
11
27 2611739313629861606
73 6886657542481572357
69 D
77
35
22
56
51
2 7429097307900676557
72 6141823789127718911
9 3735038849100002170
94 D
48
66
41 D
21 1736281735664744573
56
55
62
45 D
55 6807725848393121446
20 2061652449901894653
86
70
80 D
35 6368725515831429322
36
17 D
100 7387621793715922691
62 D
29 374958102608349003
38
3 D
47
96 2805881280774354760
67
68 D
29
35 D
86 8892161968076062746
48 4159481888355637436
65 D
12
90
34
66
18
44 8005692508431873489
31
45
28 3932324830856412295
20
48 D
83
3 2441277180035890896
87 1935338303119140684
25 D
60 D
94 D
5
66 2417199663660242771
17
27
51
29 2760910391496100010
17 3154612650712753084
10
54 8610873542703192793
24 3259032017438776195
100
0
80
33 6143938856921750935
27 2192458069285037294
40 2679979517426654387
93 5537860674127455625
29 2940094902145215952
12 458481554632262996
32
84
56
57 8616866110231052175
32 D
89 D
59
24
65
98
36
73 D
43 D
92 3665957502589832644
71
24 848881512640905772
99
39 3705125196971441338
94 6182085407126475785
69 D
84
88 D
22 D
29
48 2742302646609315354
83
46
38
36 D
60
28 1703949144314183920
15
47
20
90
47 D
82 4650987725169998756
94
75
82
10 6170599619097552958
94
79
35 D
4
68 D
6
27
46
12
17
10
5
55
6 914555014894623991
60 D
64 7747086912837465404
34 D
70
18
33 D
76
74
17
58
79
54
71 2956310043735141659
54 8659145122261836011
28
43
15 D
92
13
18
83 D
70 7475244855385756942
42 6707975011527555430
44 D
54
57 D
12 D
87 8845252699165560970
77 3113141291135217170
14 4404208517177945863
34 D
17 664247814410289535
80 6464634811388757577
15 2025569201587570278
89
11
11
72 2069525531611223701
39
37 3263153311382784559
74 6120832069136776437
5 D
33 D
53
64 6233399158394555836
26
69 6087995615745450511
22 6160887451696372276
21 D
41
89
34 2533374356304860030
18
44
16 3966692210909406500
5 6189046521345371326
33
24
86
33 3706831871845462453
68 D
10 7754868844600621442
9 D
95
65
74
22 1202795190224725928
29 2220004737833378507
82
25
72 3275756023303090785
80 3654803730075185626
20 D
1
74
63 8295681535200080693
50 3484235979526993454
10 6702745501556110768
61 7827128639289431342
34 609707716866959588
6 7603674648525543398
29 2400395964599592964
80 8336702813515583208
80 3422451553910735276
92
72
90
78
43
58 4441059995157256788
8 8418566873383808466
14
49 439873355221895914
99
45 3625839175835945525
98
74
44
46
92 5544961925974208808
46
1
52
42 4306057432789583403
25
54
8 1913145240461921667
68 D
69
1
55 4050453728702566031
97 865608504284621395
0 D
5
0 D
39 364144638692511515
54 8509930611188222686
86 D
6
80
65
64
30
84
76
92 D
87
19 2397507098094467712
29
73
75
75 5862093439347050434
49
8
49
97
29
66
1 D
55
91 3005399059400999177
42
86 230783086710617733
47 D
53
50 9137156700881058741
21 281340921520610009
36 4134983904856449571
29 7201716512624767604
88
1 6257637289835881785
84
28 4665471617875542808
59 3593304889785458192
46 7670721507489350768
1 D
69 4851095612237861745
69 2387778544789436417
26
53 2042470145872638890
61
92 8441863809383852837
88
0
36 D
94
43 248351545941365262
21
80
33 7743988000194004896
63
6
80
34
57 2633235333267320623
79 465309889332377855
79 D
31
25
24 380028495261441924
56 3592346440694937261
3
92 D
100
81
31
59 D
0 3016080618189626685
55 1928661426407816269
31 879793932144155340
92
86 7618965741324979762
55
62 8187880751119422493
49
56
36 1015563400749860920
28
93 6126209377656202516
84
25
90
56
94
29 D
94
78 7109783577677800694
83
52
74
2
44 D
42 6459261649126166697
0
35 6752847296853647027
7 8017577009549582828
41 D
78
86 3330746888149033659
99
12 7019118450193314798
44
88
90 4587094464955116503
7 7224022332628412292
39
10
21
6 7081705448470537275
25 8658069834720959280
44
48 D
81
0
10 6394280162552748560
27 8172169184592211768
29 4315707058535214728
89
43 237917192182519852
37
52
30
82
7
36
75
70
22
98
75
33 6982110361226662304
66 8474713452033436348
98
59 169884047772144381
9 D
58 D
7 2541759403538067258
7 D
13
28 8688613286894345927
58 D
62 182792421671821643
50 4534815218633809094
59
43
28 2121215003015665176
48
41
70
0
59
65 7618907379813705395
98
87 3745452831988061059
61 2949890789037955888
20
88 1491645007778098236
46 D
60
27 D
87
81 6142404989083459476
21 3952242733407109489
22 D
44
2
78 5655437241586200381
79
70 3469475760856478199
35
14
100
29 8389918162443622935
43
28
38
35
37
89
62
41 D
17
8 4869767785490907282
74 D
50 8183837494810443332
79
10
32 2832915745745070680
93 D
25 1570919958272777655
5
70
46 D
20 D
73 5142521031633144438
30 5459421483702724368
23 5272157872942621876
64 8642090659565661654
73
47
94
97
80 8112878397899563167
4 D
5
17 D
45 8025680354481986354
66 7500021944619790790
54
64 5038338345338168661
87
24
72
43 1341802944159575549
7
65
89 7067384685090898530
60
61
34 765310583758794140
47 7323977770010147606
8 3370887696271107754
41 D
89
3
74
35 D
99
33
51 7487338367848369713
1
90
73
2 7822884973838760613
47
64
53
10
43
12
82
46 1590056301811353230
23
71
91 D
88
99
90
48 D
79 7342972520751914784
46 2194326939822780578
40 D
13
88 D
62 8209350688785688704
84 7001047204748299853
53 9058099478641153702
40
5
62
