%YAML 1.1
%TAG !u! tag:unity3d.com,2011:
--- !u!114 &11400000
MonoBehaviour:
  m_ObjectHideFlags: 0
  m_CorrespondingSourceObject: {fileID: 0}
  m_PrefabInstance: {fileID: 0}
  m_PrefabAsset: {fileID: 0}
  m_GameObject: {fileID: 0}
  m_Enabled: 1
  m_EditorHideFlags: 0
  m_Script: {fileID: 11500000, guid: a7cac035bd73d8345b1d2b134e26cbf7, type: 3}
  m_Name: Letter_R
  m_EditorClassIdentifier: 
  image: {fileID: 21300000, guid: e3fe5052c3eff8646b8364598637f86b, type: 3}
  id: 114
