%YAML 1.1
%TAG !u! tag:unity3d.com,2011:
--- !u!1045 &1
EditorBuildSettings:
  m_ObjectHideFlags: 0
  serializedVersion: 2
  m_Scenes:
  - enabled: 1
    path: Assets/Scenes/TitleScene.unity
    guid: 2ef80a523344fc64ab644e52f3c490f4
  - enabled: 1
    path: Assets/Scenes/MapScene.unity
    guid: 2264ca80145293f4f8381b8d96c7a4bd
  - enabled: 1
    path: Assets/Scenes/GameMode1.unity
    guid: 5154189133be02f4782091a684e04836
  - enabled: 1
    path: Assets/Scenes/GameMode2.unity
    guid: b3dc1b7e06f81ef4495fa79033624b5e
  - enabled: 1
    path: Assets/Natividad/Scenes/GameMode4.unity
    guid: 8eae2c0f1fb7fb64185ff96ba665abc5
  - enabled: 1
    path: Assets/Natividad/Scenes/LGM_N.unity
    guid: f0d50aaec0271c343a4bfe497e1bb6b3
  m_configObjects: {}
