<svg width="250" height="250" viewBox="0 0 250 250" fill="none" xmlns="http://www.w3.org/2000/svg">
    <path
        d="M70.6012 77.8C74.2012 77.8 77.4345 78.3333 80.3012 79.4C83.1678 80.4 85.6012 81.9 87.6012 83.9C89.6012 85.8333 91.1345 88.2667 92.2012 91.2C93.2678 94.1333 93.8012 97.4333 93.8012 101.1C93.8012 108.367 91.8345 114.067 87.9012 118.2C83.9678 122.333 78.0012 124.4 70.0012 124.4C66.5345 124.4 63.3345 123.933 60.4012 123C57.5345 122.133 55.0678 120.8 53.0012 119C51.0012 117.2 49.4345 114.933 48.3012 112.2C47.2345 109.4 46.7012 106.133 46.7012 102.4H58.1012C58.1012 105.6 59.0012 108.2 60.8012 110.2C62.6012 112.133 65.5345 113.1 69.6012 113.1C73.3345 113.1 76.3012 112.067 78.5012 110C80.7678 107.933 81.9012 105 81.9012 101.2C81.9012 99 81.5678 97.1667 80.9012 95.7C80.3012 94.1667 79.4012 92.9667 78.2012 92.1C77.0678 91.1667 75.7345 90.5 74.2012 90.1C72.6678 89.7 71.0012 89.5 69.2012 89.5C64.9345 89.5 61.8678 90.5333 60.0012 92.6H48.3012V55.3H90.5012V67.2H60.9012V79.7C61.9012 79.0333 63.3012 78.5667 65.1012 78.3C66.9678 77.9667 68.8012 77.8 70.6012 77.8ZM129.238 54.5C131.771 54.5 134.171 55 136.438 56C138.705 57 140.671 58.3333 142.338 60C144.071 61.6667 145.405 63.6333 146.338 65.9C147.338 68.1667 147.838 70.6 147.838 73.2V104.4C147.838 106.933 147.338 109.333 146.338 111.6C145.405 113.867 144.071 115.833 142.338 117.5C140.671 119.167 138.705 120.5 136.438 121.5C134.171 122.5 131.771 123 129.238 123H119.038C116.505 123 114.105 122.5 111.838 121.5C109.571 120.5 107.605 119.167 105.938 117.5C104.271 115.833 102.938 113.867 101.938 111.6C101.005 109.333 100.538 106.933 100.538 104.4V73.2C100.538 70.6 101.005 68.1667 101.938 65.9C102.938 63.6333 104.271 61.6667 105.938 60C107.605 58.3333 109.571 57 111.838 56C114.105 55 116.505 54.5 119.038 54.5H129.238ZM136.238 75.2C136.238 74.0667 136.005 73 135.538 72C135.138 70.9333 134.538 70 133.738 69.2C133.005 68.4 132.138 67.8 131.138 67.4C130.138 66.9333 129.038 66.7 127.838 66.7H120.438C119.238 66.7 118.138 66.9333 117.138 67.4C116.138 67.8 115.238 68.4 114.438 69.2C113.705 70 113.105 70.9333 112.638 72C112.238 73 112.038 74.0667 112.038 75.2V102.3C112.038 103.433 112.238 104.533 112.638 105.6C113.105 106.667 113.705 107.6 114.438 108.4C115.238 109.133 116.138 109.733 117.138 110.2C118.138 110.6 119.238 110.8 120.438 110.8H127.838C129.038 110.8 130.138 110.6 131.138 110.2C132.138 109.733 133.005 109.133 133.738 108.4C134.538 107.6 135.138 106.667 135.538 105.6C136.005 104.533 136.238 103.433 136.238 102.3V75.2ZM184.218 54.5C186.752 54.5 189.152 55 191.418 56C193.685 57 195.652 58.3333 197.318 60C199.052 61.6667 200.385 63.6333 201.318 65.9C202.318 68.1667 202.818 70.6 202.818 73.2V104.4C202.818 106.933 202.318 109.333 201.318 111.6C200.385 113.867 199.052 115.833 197.318 117.5C195.652 119.167 193.685 120.5 191.418 121.5C189.152 122.5 186.752 123 184.218 123H174.018C171.485 123 169.085 122.5 166.818 121.5C164.552 120.5 162.585 119.167 160.918 117.5C159.252 115.833 157.918 113.867 156.918 111.6C155.985 109.333 155.518 106.933 155.518 104.4V73.2C155.518 70.6 155.985 68.1667 156.918 65.9C157.918 63.6333 159.252 61.6667 160.918 60C162.585 58.3333 164.552 57 166.818 56C169.085 55 171.485 54.5 174.018 54.5H184.218ZM191.218 75.2C191.218 74.0667 190.985 73 190.518 72C190.118 70.9333 189.518 70 188.718 69.2C187.985 68.4 187.118 67.8 186.118 67.4C185.118 66.9333 184.018 66.7 182.818 66.7H175.418C174.218 66.7 173.118 66.9333 172.118 67.4C171.118 67.8 170.218 68.4 169.418 69.2C168.685 70 168.085 70.9333 167.618 72C167.218 73 167.018 74.0667 167.018 75.2V102.3C167.018 103.433 167.218 104.533 167.618 105.6C168.085 106.667 168.685 107.6 169.418 108.4C170.218 109.133 171.118 109.733 172.118 110.2C173.118 110.6 174.218 110.8 175.418 110.8H182.818C184.018 110.8 185.118 110.6 186.118 110.2C187.118 109.733 187.985 109.133 188.718 108.4C189.518 107.6 190.118 106.667 190.518 105.6C190.985 104.533 191.218 103.433 191.218 102.3V75.2Z"
        fill="black" />
    <path
        d="M104.118 136.1C107.051 136.1 109.651 136.567 111.918 137.5C114.251 138.367 116.218 139.6 117.818 141.2C119.485 142.8 120.751 144.733 121.618 147C122.485 149.267 122.918 151.833 122.918 154.7V168.4C122.918 171.2 122.485 173.767 121.618 176.1C120.751 178.367 119.485 180.333 117.818 182C116.218 183.6 114.251 184.833 111.918 185.7C109.651 186.567 107.051 187 104.118 187H100.918C97.9846 187 95.318 186.533 92.918 185.6V204.4H81.318V136.1H104.118ZM92.918 147.6V168C92.918 170.2 93.5846 172 94.918 173.4C96.2513 174.8 97.9846 175.5 100.118 175.5H104.118C106.251 175.5 108.018 174.8 109.418 173.4C110.818 172 111.518 170.2 111.518 168V155C111.518 152.8 110.818 151.033 109.418 149.7C108.018 148.3 106.251 147.6 104.118 147.6H92.918ZM155.072 161.6C157.405 165.8 159.772 170.033 162.172 174.3C164.572 178.567 166.905 182.8 169.172 187H157.172L148.372 169.7L139.572 187H127.572L141.072 161.8L127.572 136.1H139.572L148.372 153.9L157.172 136.1H169.272L155.072 161.6Z"
        fill="black" />
    <rect x="10" y="10" width="230" height="230" rx="55" stroke="black" stroke-width="20" />
</svg>