<svg width="44" height="44" viewBox="0 0 44 44" fill="none" xmlns="http://www.w3.org/2000/svg">
<path d="M4 4L39.3553 39.3553" stroke="white" stroke-width="8" stroke-linecap="round"/>
<path d="M4 39.3552L39.3553 3.99989" stroke="white" stroke-width="8" stroke-linecap="round"/>
</svg>
