%YAML 1.1
%TAG !u! tag:unity3d.com,2011:
--- !u!78 &1
TagManager:
  serializedVersion: 2
  tags:
  - Player1
  - Player2
  - HitEffect
  - Pikachu
  - Mario
  - Star
  - DeletePlayer
  - PlayerCharacter
  - PikachuCamera
  - PivotPikachu
  - MarioCamera
  - MarioShooter
  - MarioCamera2
  - AmmoText
  - Camera2
  - Camera1
  - CameraCenter
  layers:
  - Default
  - TransparentFX
  - Ignore Raycast
  - 
  - Water
  - UI
  - 
  - 
  - Character
  - 
  - 
  - 
  - 
  - 
  - 
  - 
  - 
  - 
  - 
  - 
  - 
  - 
  - 
  - 
  - 
  - 
  - 
  - 
  - 
  - 
  - 
  - 
  m_SortingLayers:
  - name: Default
    uniqueID: 0
    locked: 0
