28.1 - Input and output (I/O) streams:
    Definitions:

28.2 - Input with istream:
    Definitions:

28.3 - Output with ostream and ios:
    Definitions:

28.4 - Stream classes for strings:
    Definitions:

28.5 - Stream states and input validation:
    Definitions:

28.6 - Basic file I/O:
    Definitions:

28.7 - Random file I/O:
    Definitions:
