../Core/Src/Robot/Controllers/ParcoursControllerMk2.c:29:13:OnInit	32	static
../Core/Src/Robot/Controllers/ParcoursControllerMk2.c:42:13:OnUpdate	24	static
../Core/Src/Robot/Controllers/ParcoursControllerMk2.c:59:13:OnCollision	16	static
../Core/Src/Robot/Controllers/ParcoursControllerMk2.c:67:13:Configure	16	static
../Core/Src/Robot/Controllers/ParcoursControllerMk2.c:74:1:ParcoursControllerMk2InitState	16	static
