../Core/Src/Util/Util.c:7:6:Wait	0	static
../Core/Src/Util/Util.c:15:7:Abs	0	static
../Core/Src/Util/Util.c:23:5:Sign	0	static
../Core/Src/Util/Util.c:31:7:Min	0	static
../Core/Src/Util/Util.c:39:7:Max	0	static
../Core/Src/Util/Util.c:47:7:Clamp	0	static
../Core/Src/Util/Util.c:55:7:ClampUnit	0	static
../Core/Src/Util/Util.c:63:7:Sqrt	0	static
