../Core/Src/Robot/Controller.c:7:13:DefaultOnUpdate	0	static
../Core/Src/Robot/Controller.c:16:13:DefaultOnCollision	8	static
../Core/Src/Robot/Controller.c:12:13:DefaultOnInit	0	static
../Core/Src/Robot/Controller.c:29:20:InitController	8	static
