{
  "400": {
    "09158558-f8db-4c0e-b720-227a6c057683": [
      {
        "request": {
          "RequestData": {
            "method": "",
            "path": "",
            "query": "",
            "body": ""
          }
        },
        "response": {
          "ResponseData": {
            "code": 400,
            "codeDescription": "BAD REQUEST",
            "content": "{\n    \"message\": \"The browser (or proxy) sent a request that this server could not understand.\"\n}\n",
            "isFailure": true,
            "isBug": false
          }
        }
      },
      {
        "request": {
          "RequestData": {
            "method": "DELETE",
            "path": "/api/blog/posts/5874",
            "query": "injected_query_string=123",
            "body": ""
          }
        },
        "response": {
          "ResponseData": {
            "code": 400,
            "codeDescription": "BAD REQUEST",
            "content": "{\n    \"message\": \"The browser (or proxy) sent a request that this server could not understand.\"\n}\n",
            "isFailure": true,
            "isBug": false
          }
        }
      }
    ],
    "12ac8f55-bd8a-4ff2-b076-d86bc7fe3e4b": [
      {
        "request": {
          "RequestData": {
            "method": "PUT",
            "path": "/api/blog/posts/5879",
            "query": "",
            "body": "{\"id\":[],\"checksum\":\"fuzzstring\",\"body\":\"first blog\"}"
          }
        },
        "response": {
          "ResponseData": {
            "code": 400,
            "codeDescription": "BAD REQUEST",
            "content": "{\n    \"errors\": {\n        \"id\": \"[] is not of type \\'integer\\'\"\n    },\n    \"message\": \"Input payload validation failed\"\n}\n",
            "isFailure": true,
            "isBug": false
          }
        }
      },
      {
        "request": {
          "RequestData": {
            "method": "POST",
            "path": "/api/blog/posts",
            "query": "",
            "body": "{\"id\":[]}"
          }
        },
        "response": {
          "ResponseData": {
            "code": 400,
            "codeDescription": "BAD REQUEST",
            "content": "{\n    \"errors\": {\n        \"body\": \"\\'body\\' is a required property\",\n        \"id\": \"[] is not of type \\'integer\\'\"\n    },\n    \"message\": \"Input payload validation failed\"\n}\n",
            "isFailure": true,
            "isBug": false
          }
        }
      },
      {
        "request": {
          "RequestData": {
            "method": "POST",
            "path": "/api/blog/posts",
            "query": "",
            "body": "{\"id\":[],\"body\":\"fuzzstring\"}"
          }
        },
        "response": {
          "ResponseData": {
            "code": 400,
            "codeDescription": "BAD REQUEST",
            "content": "{\n    \"errors\": {\n        \"id\": \"[] is not of type \\'integer\\'\"\n    },\n    \"message\": \"Input payload validation failed\"\n}\n",
            "isFailure": true,
            "isBug": false
          }
        }
      }
    ],
    "1c4847cd-bb36-4def-8efd-faf2c7dfa7fc": [
      {
        "request": {
          "RequestData": {
            "method": "PUT",
            "path": "/api/blog/posts/5879",
            "query": "",
            "body": "{\"checksum\":0}"
          }
        },
        "response": {
          "ResponseData": {
            "code": 400,
            "codeDescription": "BAD REQUEST",
            "content": "{\n    \"errors\": {\n        \"body\": \"\\'body\\' is a required property\",\n        \"checksum\": \"0 is not of type \\'string\\'\"\n    },\n    \"message\": \"Input payload validation failed\"\n}\n",
            "isFailure": true,
            "isBug": false
          }
        }
      }
    ],
    "22664d02-3a0b-4160-a2e6-1d77382a2b30": [
      {
        "request": {
          "RequestData": {
            "method": "PUT",
            "path": "/api/blog/posts/5879",
            "query": "",
            "body": "{\"body\":0}"
          }
        },
        "response": {
          "ResponseData": {
            "code": 400,
            "codeDescription": "BAD REQUEST",
            "content": "{\n    \"errors\": {\n        \"body\": \"0 is not of type \\'string\\'\"\n    },\n    \"message\": \"Input payload validation failed\"\n}\n",
            "isFailure": true,
            "isBug": false
          }
        }
      },
      {
        "request": {
          "RequestData": {
            "method": "POST",
            "path": "/api/blog/posts",
            "query": "",
            "body": "{\"body\":0}"
          }
        },
        "response": {
          "ResponseData": {
            "code": 400,
            "codeDescription": "BAD REQUEST",
            "content": "{\n    \"errors\": {\n        \"body\": \"0 is not of type \\'string\\'\"\n    },\n    \"message\": \"Input payload validation failed\"\n}\n",
            "isFailure": true,
            "isBug": false
          }
        }
      },
      {
        "request": {
          "RequestData": {
            "method": "POST",
            "path": "/api/blog/posts",
            "query": "",
            "body": "{\"id\":5873,\"body\":0}"
          }
        },
        "response": {
          "ResponseData": {
            "code": 400,
            "codeDescription": "BAD REQUEST",
            "content": "{\n    \"errors\": {\n        \"body\": \"0 is not of type \\'string\\'\"\n    },\n    \"message\": \"Input payload validation failed\"\n}\n",
            "isFailure": true,
            "isBug": false
          }
        }
      }
    ],
    "2a672cb2-df9b-4a7d-a949-727bbf7e0629": [
      {
        "request": {
          "RequestData": {
            "method": "PUT",
            "path": "/api/blog/posts/5879",
            "query": "",
            "body": "{\"checksum\":false}"
          }
        },
        "response": {
          "ResponseData": {
            "code": 400,
            "codeDescription": "BAD REQUEST",
            "content": "{\n    \"errors\": {\n        \"body\": \"\\'body\\' is a required property\",\n        \"checksum\": \"False is not of type \\'string\\'\"\n    },\n    \"message\": \"Input payload validation failed\"\n}\n",
            "isFailure": true,
            "isBug": false
          }
        }
      }
    ],
    "2ea8f379-ed1e-4c42-9311-4f221b40ca10": [
      {
        "request": {
          "RequestData": {
            "method": "PUT",
            "path": "/api/blog/posts/5876",
            "query": "",
            "body": "{\n    \"id\":{},\n    \"checksum\":\"fuzzstring\",\n    \"body\":\"first blog\"}\r\n"
          }
        },
        "response": {
          "ResponseData": {
            "code": 400,
            "codeDescription": "BAD REQUEST",
            "content": "{\n    \"errors\": {\n        \"id\": \"{} is not of type \\'integer\\'\"\n    },\n    \"message\": \"Input payload validation failed\"\n}\n",
            "isFailure": true,
            "isBug": false
          }
        }
      },
      {
        "request": {
          "RequestData": {
            "method": "PUT",
            "path": "/api/blog/posts/5876",
            "query": "",
            "body": "{\n    \"id\":{},\n    \"checksum\":\"fuzzstring\",\n    \"body\":\"{}\"}\r\n"
          }
        },
        "response": {
          "ResponseData": {
            "code": 400,
            "codeDescription": "BAD REQUEST",
            "content": "{\n    \"errors\": {\n        \"id\": \"{} is not of type \\'integer\\'\"\n    },\n    \"message\": \"Input payload validation failed\"\n}\n",
            "isFailure": true,
            "isBug": false
          }
        }
      }
    ],
    "322280af-1450-40a1-a589-4631eb652544": [
      {
        "request": {
          "RequestData": {
            "method": "PUT",
            "path": "/api/blog/posts/5879",
            "query": "",
            "body": "\"fuzzstring\""
          }
        },
        "response": {
          "ResponseData": {
            "code": 400,
            "codeDescription": "BAD REQUEST",
            "content": "{\n    \"errors\": {\n        \"\": \"\\'fuzzstring\\' is not of type \\'object\\'\"\n    },\n    \"message\": \"Input payload validation failed\"\n}\n",
            "isFailure": true,
            "isBug": false
          }
        }
      },
      {
        "request": {
          "RequestData": {
            "method": "PUT",
            "path": "/api/blog/posts/5879",
            "query": "",
            "body": "0"
          }
        },
        "response": {
          "ResponseData": {
            "code": 400,
            "codeDescription": "BAD REQUEST",
            "content": "{\n    \"errors\": {\n        \"\": \"0 is not of type \\'object\\'\"\n    },\n    \"message\": \"Input payload validation failed\"\n}\n",
            "isFailure": true,
            "isBug": false
          }
        }
      },
      {
        "request": {
          "RequestData": {
            "method": "PUT",
            "path": "/api/blog/posts/5879",
            "query": "",
            "body": "[]"
          }
        },
        "response": {
          "ResponseData": {
            "code": 400,
            "codeDescription": "BAD REQUEST",
            "content": "{\n    \"errors\": {\n        \"\": \"[] is not of type \\'object\\'\"\n    },\n    \"message\": \"Input payload validation failed\"\n}\n",
            "isFailure": true,
            "isBug": false
          }
        }
      },
      {
        "request": {
          "RequestData": {
            "method": "PUT",
            "path": "/api/blog/posts/5879",
            "query": "",
            "body": "false"
          }
        },
        "response": {
          "ResponseData": {
            "code": 400,
            "codeDescription": "BAD REQUEST",
            "content": "{\n    \"errors\": {\n        \"\": \"False is not of type \\'object\\'\"\n    },\n    \"message\": \"Input payload validation failed\"\n}\n",
            "isFailure": true,
            "isBug": false
          }
        }
      },
      {
        "request": {
          "RequestData": {
            "method": "POST",
            "path": "/api/blog/posts",
            "query": "",
            "body": "[]"
          }
        },
        "response": {
          "ResponseData": {
            "code": 400,
            "codeDescription": "BAD REQUEST",
            "content": "{\n    \"errors\": {\n        \"\": \"[] is not of type \\'object\\'\"\n    },\n    \"message\": \"Input payload validation failed\"\n}\n",
            "isFailure": true,
            "isBug": false
          }
        }
      },
      {
        "request": {
          "RequestData": {
            "method": "POST",
            "path": "/api/blog/posts",
            "query": "",
            "body": "0"
          }
        },
        "response": {
          "ResponseData": {
            "code": 400,
            "codeDescription": "BAD REQUEST",
            "content": "{\n    \"errors\": {\n        \"\": \"0 is not of type \\'object\\'\"\n    },\n    \"message\": \"Input payload validation failed\"\n}\n",
            "isFailure": true,
            "isBug": false
          }
        }
      },
      {
        "request": {
          "RequestData": {
            "method": "POST",
            "path": "/api/blog/posts",
            "query": "",
            "body": "\"fuzzstring\""
          }
        },
        "response": {
          "ResponseData": {
            "code": 400,
            "codeDescription": "BAD REQUEST",
            "content": "{\n    \"errors\": {\n        \"\": \"\\'fuzzstring\\' is not of type \\'object\\'\"\n    },\n    \"message\": \"Input payload validation failed\"\n}\n",
            "isFailure": true,
            "isBug": false
          }
        }
      },
      {
        "request": {
          "RequestData": {
            "method": "POST",
            "path": "/api/blog/posts",
            "query": "",
            "body": "false"
          }
        },
        "response": {
          "ResponseData": {
            "code": 400,
            "codeDescription": "BAD REQUEST",
            "content": "{\n    \"errors\": {\n        \"\": \"False is not of type \\'object\\'\"\n    },\n    \"message\": \"Input payload validation failed\"\n}\n",
            "isFailure": true,
            "isBug": false
          }
        }
      }
    ],
    "33d64d7e-65b0-4f74-8894-ccb680e018d4": [
      {
        "request": {
          "RequestData": {
            "method": "PUT",
            "path": "/api/blog/posts/5879",
            "query": "",
            "body": "{\"id\":\"fuzzstring\",\"checksum\":\"fuzzstring\",\"body\":\"first blog\"}"
          }
        },
        "response": {
          "ResponseData": {
            "code": 400,
            "codeDescription": "BAD REQUEST",
            "content": "{\n    \"errors\": {\n        \"id\": \"\\'fuzzstring\\' is not of type \\'integer\\'\"\n    },\n    \"message\": \"Input payload validation failed\"\n}\n",
            "isFailure": true,
            "isBug": false
          }
        }
      },
      {
        "request": {
          "RequestData": {
            "method": "POST",
            "path": "/api/blog/posts",
            "query": "",
            "body": "{\"id\":\"fuzzstring\"}"
          }
        },
        "response": {
          "ResponseData": {
            "code": 400,
            "codeDescription": "BAD REQUEST",
            "content": "{\n    \"errors\": {\n        \"body\": \"\\'body\\' is a required property\",\n        \"id\": \"\\'fuzzstring\\' is not of type \\'integer\\'\"\n    },\n    \"message\": \"Input payload validation failed\"\n}\n",
            "isFailure": true,
            "isBug": false
          }
        }
      },
      {
        "request": {
          "RequestData": {
            "method": "POST",
            "path": "/api/blog/posts",
            "query": "",
            "body": "{\"id\":\"fuzzstring\",\"body\":\"fuzzstring\"}"
          }
        },
        "response": {
          "ResponseData": {
            "code": 400,
            "codeDescription": "BAD REQUEST",
            "content": "{\n    \"errors\": {\n        \"id\": \"\\'fuzzstring\\' is not of type \\'integer\\'\"\n    },\n    \"message\": \"Input payload validation failed\"\n}\n",
            "isFailure": true,
            "isBug": false
          }
        }
      }
    ],
    "3c261560-6df2-4001-9e43-34d0441375cf": [
      {
        "request": {
          "RequestData": {
            "method": "PUT",
            "path": "/api/blog/posts/5879",
            "query": "",
            "body": "{\"id\":false,\"checksum\":\"fuzzstring\",\"body\":\"first blog\"}"
          }
        },
        "response": {
          "ResponseData": {
            "code": 400,
            "codeDescription": "BAD REQUEST",
            "content": "{\n    \"errors\": {\n        \"id\": \"False is not of type \\'integer\\'\"\n    },\n    \"message\": \"Input payload validation failed\"\n}\n",
            "isFailure": true,
            "isBug": false
          }
        }
      },
      {
        "request": {
          "RequestData": {
            "method": "POST",
            "path": "/api/blog/posts",
            "query": "",
            "body": "{\"id\":false}"
          }
        },
        "response": {
          "ResponseData": {
            "code": 400,
            "codeDescription": "BAD REQUEST",
            "content": "{\n    \"errors\": {\n        \"body\": \"\\'body\\' is a required property\",\n        \"id\": \"False is not of type \\'integer\\'\"\n    },\n    \"message\": \"Input payload validation failed\"\n}\n",
            "isFailure": true,
            "isBug": false
          }
        }
      },
      {
        "request": {
          "RequestData": {
            "method": "POST",
            "path": "/api/blog/posts",
            "query": "",
            "body": "{\"id\":false,\"body\":\"fuzzstring\"}"
          }
        },
        "response": {
          "ResponseData": {
            "code": 400,
            "codeDescription": "BAD REQUEST",
            "content": "{\n    \"errors\": {\n        \"id\": \"False is not of type \\'integer\\'\"\n    },\n    \"message\": \"Input payload validation failed\"\n}\n",
            "isFailure": true,
            "isBug": false
          }
        }
      }
    ],
    "4362322e-1a2a-4d8b-bcff-53867a97fa24": [
      {
        "request": {
          "RequestData": {
            "method": "PUT",
            "path": "/api/blog/posts/5879",
            "query": "",
            "body": "{\"id\":{ \"fuzz\" : false },\"checksum\":\"fuzzstring\",\"body\":\"first blog\"}"
          }
        },
        "response": {
          "ResponseData": {
            "code": 400,
            "codeDescription": "BAD REQUEST",
            "content": "{\n    \"errors\": {\n        \"id\": \"{\\'fuzz\\': False} is not of type \\'integer\\'\"\n    },\n    \"message\": \"Input payload validation failed\"\n}\n",
            "isFailure": true,
            "isBug": false
          }
        }
      },
      {
        "request": {
          "RequestData": {
            "method": "POST",
            "path": "/api/blog/posts",
            "query": "",
            "body": "{\"id\":{ \"fuzz\" : false }}"
          }
        },
        "response": {
          "ResponseData": {
            "code": 400,
            "codeDescription": "BAD REQUEST",
            "content": "{\n    \"errors\": {\n        \"body\": \"\\'body\\' is a required property\",\n        \"id\": \"{\\'fuzz\\': False} is not of type \\'integer\\'\"\n    },\n    \"message\": \"Input payload validation failed\"\n}\n",
            "isFailure": true,
            "isBug": false
          }
        }
      },
      {
        "request": {
          "RequestData": {
            "method": "POST",
            "path": "/api/blog/posts",
            "query": "",
            "body": "{\"id\":{ \"fuzz\" : false },\"body\":\"fuzzstring\"}"
          }
        },
        "response": {
          "ResponseData": {
            "code": 400,
            "codeDescription": "BAD REQUEST",
            "content": "{\n    \"errors\": {\n        \"id\": \"{\\'fuzz\\': False} is not of type \\'integer\\'\"\n    },\n    \"message\": \"Input payload validation failed\"\n}\n",
            "isFailure": true,
            "isBug": false
          }
        }
      }
    ],
    "44b95ca3-d780-453a-8736-5cbf756d5178": [
      {
        "request": {
          "RequestData": {
            "method": "PUT",
            "path": "/api/blog/posts/5879",
            "query": "",
            "body": "{\"checksum\":[]}"
          }
        },
        "response": {
          "ResponseData": {
            "code": 400,
            "codeDescription": "BAD REQUEST",
            "content": "{\n    \"errors\": {\n        \"body\": \"\\'body\\' is a required property\",\n        \"checksum\": \"[] is not of type \\'string\\'\"\n    },\n    \"message\": \"Input payload validation failed\"\n}\n",
            "isFailure": true,
            "isBug": false
          }
        }
      }
    ],
    "48811812-9c72-43b0-8c70-2de12675cd6b": [
      {
        "request": {
          "RequestData": {
            "method": "PUT",
            "path": "/api/blog/posts/5879",
            "query": "",
            "body": "{\"body\":[]}"
          }
        },
        "response": {
          "ResponseData": {
            "code": 400,
            "codeDescription": "BAD REQUEST",
            "content": "{\n    \"errors\": {\n        \"body\": \"[] is not of type \\'string\\'\"\n    },\n    \"message\": \"Input payload validation failed\"\n}\n",
            "isFailure": true,
            "isBug": false
          }
        }
      },
      {
        "request": {
          "RequestData": {
            "method": "POST",
            "path": "/api/blog/posts",
            "query": "",
            "body": "{\"body\":[]}"
          }
        },
        "response": {
          "ResponseData": {
            "code": 400,
            "codeDescription": "BAD REQUEST",
            "content": "{\n    \"errors\": {\n        \"body\": \"[] is not of type \\'string\\'\"\n    },\n    \"message\": \"Input payload validation failed\"\n}\n",
            "isFailure": true,
            "isBug": false
          }
        }
      },
      {
        "request": {
          "RequestData": {
            "method": "POST",
            "path": "/api/blog/posts",
            "query": "",
            "body": "{\"id\":5873,\"body\":[]}"
          }
        },
        "response": {
          "ResponseData": {
            "code": 400,
            "codeDescription": "BAD REQUEST",
            "content": "{\n    \"errors\": {\n        \"body\": \"[] is not of type \\'string\\'\"\n    },\n    \"message\": \"Input payload validation failed\"\n}\n",
            "isFailure": true,
            "isBug": false
          }
        }
      }
    ],
    "6840d955-1856-4965-b60a-41cacfeee793": [
      {
        "request": {
          "RequestData": {
            "method": "PUT",
            "path": "/api/blog/posts/5879",
            "query": "",
            "body": "{\"body\":{ \"fuzz\" : false }}"
          }
        },
        "response": {
          "ResponseData": {
            "code": 400,
            "codeDescription": "BAD REQUEST",
            "content": "{\n    \"errors\": {\n        \"body\": \"{\\'fuzz\\': False} is not of type \\'string\\'\"\n    },\n    \"message\": \"Input payload validation failed\"\n}\n",
            "isFailure": true,
            "isBug": false
          }
        }
      },
      {
        "request": {
          "RequestData": {
            "method": "POST",
            "path": "/api/blog/posts",
            "query": "",
            "body": "{\"body\":{ \"fuzz\" : false }}"
          }
        },
        "response": {
          "ResponseData": {
            "code": 400,
            "codeDescription": "BAD REQUEST",
            "content": "{\n    \"errors\": {\n        \"body\": \"{\\'fuzz\\': False} is not of type \\'string\\'\"\n    },\n    \"message\": \"Input payload validation failed\"\n}\n",
            "isFailure": true,
            "isBug": false
          }
        }
      },
      {
        "request": {
          "RequestData": {
            "method": "POST",
            "path": "/api/blog/posts",
            "query": "",
            "body": "{\"id\":5873,\"body\":{ \"fuzz\" : false }}"
          }
        },
        "response": {
          "ResponseData": {
            "code": 400,
            "codeDescription": "BAD REQUEST",
            "content": "{\n    \"errors\": {\n        \"body\": \"{\\'fuzz\\': False} is not of type \\'string\\'\"\n    },\n    \"message\": \"Input payload validation failed\"\n}\n",
            "isFailure": true,
            "isBug": false
          }
        }
      }
    ],
    "87723467-ecf4-4aa1-831b-9d6eeb6ef976": [
      {
        "request": {
          "RequestData": {
            "method": "PUT",
            "path": "/api/blog/posts/5879",
            "query": "",
            "body": "{\"checksum\":{ \"fuzz\" : false }}"
          }
        },
        "response": {
          "ResponseData": {
            "code": 400,
            "codeDescription": "BAD REQUEST",
            "content": "{\n    \"errors\": {\n        \"body\": \"\\'body\\' is a required property\",\n        \"checksum\": \"{\\'fuzz\\': False} is not of type \\'string\\'\"\n    },\n    \"message\": \"Input payload validation failed\"\n}\n",
            "isFailure": true,
            "isBug": false
          }
        }
      }
    ],
    "9d8fa6f3-3204-4ea5-91be-22d856d8f10c": [
      {
        "request": {
          "RequestData": {
            "method": "PUT",
            "path": "/api/blog/posts/5879",
            "query": "",
            "body": "{\"body\":false}"
          }
        },
        "response": {
          "ResponseData": {
            "code": 400,
            "codeDescription": "BAD REQUEST",
            "content": "{\n    \"errors\": {\n        \"body\": \"False is not of type \\'string\\'\"\n    },\n    \"message\": \"Input payload validation failed\"\n}\n",
            "isFailure": true,
            "isBug": false
          }
        }
      },
      {
        "request": {
          "RequestData": {
            "method": "POST",
            "path": "/api/blog/posts",
            "query": "",
            "body": "{\"body\":false}"
          }
        },
        "response": {
          "ResponseData": {
            "code": 400,
            "codeDescription": "BAD REQUEST",
            "content": "{\n    \"errors\": {\n        \"body\": \"False is not of type \\'string\\'\"\n    },\n    \"message\": \"Input payload validation failed\"\n}\n",
            "isFailure": true,
            "isBug": false
          }
        }
      },
      {
        "request": {
          "RequestData": {
            "method": "POST",
            "path": "/api/blog/posts",
            "query": "",
            "body": "{\"id\":5873,\"body\":false}"
          }
        },
        "response": {
          "ResponseData": {
            "code": 400,
            "codeDescription": "BAD REQUEST",
            "content": "{\n    \"errors\": {\n        \"body\": \"False is not of type \\'string\\'\"\n    },\n    \"message\": \"Input payload validation failed\"\n}\n",
            "isFailure": true,
            "isBug": false
          }
        }
      }
    ],
    "ac4e2f29-897f-4f1c-9819-cdb6bef276d8": [
      {
        "request": {
          "RequestData": {
            "method": "PUT",
            "path": "/api/blog/posts/5879",
            "query": "",
            "body": "{ \"fuzz\" : false }"
          }
        },
        "response": {
          "ResponseData": {
            "code": 400,
            "codeDescription": "BAD REQUEST",
            "content": "{\n    \"errors\": {\n        \"body\": \"\\'body\\' is a required property\"\n    },\n    \"message\": \"Input payload validation failed\"\n}\n",
            "isFailure": true,
            "isBug": false
          }
        }
      },
      {
        "request": {
          "RequestData": {
            "method": "PUT",
            "path": "/api/blog/posts/5877",
            "query": "",
            "body": "{\"checksum\":\"fuzzstring\"}"
          }
        },
        "response": {
          "ResponseData": {
            "code": 400,
            "codeDescription": "BAD REQUEST",
            "content": "{\n    \"errors\": {\n        \"body\": \"\\'body\\' is a required property\"\n    },\n    \"message\": \"Input payload validation failed\"\n}\n",
            "isFailure": true,
            "isBug": false
          }
        }
      },
      {
        "request": {
          "RequestData": {
            "method": "POST",
            "path": "/api/blog/posts",
            "query": "",
            "body": "{ \"fuzz\" : false }"
          }
        },
        "response": {
          "ResponseData": {
            "code": 400,
            "codeDescription": "BAD REQUEST",
            "content": "{\n    \"errors\": {\n        \"body\": \"\\'body\\' is a required property\"\n    },\n    \"message\": \"Input payload validation failed\"\n}\n",
            "isFailure": true,
            "isBug": false
          }
        }
      },
      {
        "request": {
          "RequestData": {
            "method": "POST",
            "path": "/api/blog/posts",
            "query": "",
            "body": "{\"id\":5873}"
          }
        },
        "response": {
          "ResponseData": {
            "code": 400,
            "codeDescription": "BAD REQUEST",
            "content": "{\n    \"errors\": {\n        \"body\": \"\\'body\\' is a required property\"\n    },\n    \"message\": \"Input payload validation failed\"\n}\n",
            "isFailure": true,
            "isBug": false
          }
        }
      }
    ],
    "dff40e51-000b-4708-8ab3-eab06fbae197": [
      {
        "request": {
          "RequestData": {
            "method": "PUT",
            "path": "/api/blog/posts/5879",
            "query": "",
            "body": "{\"id\":,\"checksum\":[],\"body\":\"first blog\"}"
          }
        },
        "response": {
          "ResponseData": {
            "code": 400,
            "codeDescription": "BAD REQUEST",
            "content": "{\n    \"message\": \"Failed to decode JSON object: Expecting value: line 1 column 7 (char 6)\"\n}\n",
            "isFailure": true,
            "isBug": false
          }
        }
      },
      {
        "request": {
          "RequestData": {
            "method": "PUT",
            "path": "/api/blog/posts/5879",
            "query": "",
            "body": "{\"id\":,\"checksum\":\"fuzzstring\",\"body\":false}"
          }
        },
        "response": {
          "ResponseData": {
            "code": 400,
            "codeDescription": "BAD REQUEST",
            "content": "{\n    \"message\": \"Failed to decode JSON object: Expecting value: line 1 column 7 (char 6)\"\n}\n",
            "isFailure": true,
            "isBug": false
          }
        }
      },
      {
        "request": {
          "RequestData": {
            "method": "PUT",
            "path": "/api/blog/posts/5879",
            "query": "",
            "body": "{\"id\":,\"checksum\":false,\"body\":\"first blog\"}"
          }
        },
        "response": {
          "ResponseData": {
            "code": 400,
            "codeDescription": "BAD REQUEST",
            "content": "{\n    \"message\": \"Failed to decode JSON object: Expecting value: line 1 column 7 (char 6)\"\n}\n",
            "isFailure": true,
            "isBug": false
          }
        }
      },
      {
        "request": {
          "RequestData": {
            "method": "PUT",
            "path": "/api/blog/posts/5879",
            "query": "",
            "body": "{\"id\":,\"checksum\":\"fuzzstring\",\"body\":0}"
          }
        },
        "response": {
          "ResponseData": {
            "code": 400,
            "codeDescription": "BAD REQUEST",
            "content": "{\n    \"message\": \"Failed to decode JSON object: Expecting value: line 1 column 7 (char 6)\"\n}\n",
            "isFailure": true,
            "isBug": false
          }
        }
      },
      {
        "request": {
          "RequestData": {
            "method": "PUT",
            "path": "/api/blog/posts/5879",
            "query": "",
            "body": "{\"id\":,\"checksum\":\"fuzzstring\",\"body\":[]}"
          }
        },
        "response": {
          "ResponseData": {
            "code": 400,
            "codeDescription": "BAD REQUEST",
            "content": "{\n    \"message\": \"Failed to decode JSON object: Expecting value: line 1 column 7 (char 6)\"\n}\n",
            "isFailure": true,
            "isBug": false
          }
        }
      },
      {
        "request": {
          "RequestData": {
            "method": "PUT",
            "path": "/api/blog/posts/5879",
            "query": "",
            "body": "{\"id\":,\"checksum\":0,\"body\":\"first blog\"}"
          }
        },
        "response": {
          "ResponseData": {
            "code": 400,
            "codeDescription": "BAD REQUEST",
            "content": "{\n    \"message\": \"Failed to decode JSON object: Expecting value: line 1 column 7 (char 6)\"\n}\n",
            "isFailure": true,
            "isBug": false
          }
        }
      },
      {
        "request": {
          "RequestData": {
            "method": "PUT",
            "path": "/api/blog/posts/5879",
            "query": "",
            "body": "{\"id\":,\"checksum\":{ \"fuzz\" : false },\"body\":\"first blog\"}"
          }
        },
        "response": {
          "ResponseData": {
            "code": 400,
            "codeDescription": "BAD REQUEST",
            "content": "{\n    \"message\": \"Failed to decode JSON object: Expecting value: line 1 column 7 (char 6)\"\n}\n",
            "isFailure": true,
            "isBug": false
          }
        }
      },
      {
        "request": {
          "RequestData": {
            "method": "PUT",
            "path": "/api/blog/posts/5879",
            "query": "",
            "body": "{\"id\":,\"checksum\":\"fuzzstring\",\"body\":{ \"fuzz\" : false }}"
          }
        },
        "response": {
          "ResponseData": {
            "code": 400,
            "codeDescription": "BAD REQUEST",
            "content": "{\n    \"message\": \"Failed to decode JSON object: Expecting value: line 1 column 7 (char 6)\"\n}\n",
            "isFailure": true,
            "isBug": false
          }
        }
      },
      {
        "request": {
          "RequestData": {
            "method": "PUT",
            "path": "/api/blog/posts/5877",
            "query": "",
            "body": "{\"id\":}"
          }
        },
        "response": {
          "ResponseData": {
            "code": 400,
            "codeDescription": "BAD REQUEST",
            "content": "{\n    \"message\": \"Failed to decode JSON object: Expecting value: line 1 column 7 (char 6)\"\n}\n",
            "isFailure": true,
            "isBug": false
          }
        }
      },
      {
        "request": {
          "RequestData": {
            "method": "PUT",
            "path": "/api/blog/posts/5877",
            "query": "",
            "body": "{\"id\":,\"checksum\":\"fuzzstring\",\"body\":\"first blog\"}"
          }
        },
        "response": {
          "ResponseData": {
            "code": 400,
            "codeDescription": "BAD REQUEST",
            "content": "{\n    \"message\": \"Failed to decode JSON object: Expecting value: line 1 column 7 (char 6)\"\n}\n",
            "isFailure": true,
            "isBug": false
          }
        }
      }
    ],
    "edd2c804-25d9-4a3a-9b5f-39a82b9f9a5a": [
      {
        "request": {
          "RequestData": {
            "method": "PUT",
            "path": "/api/blog/posts/5876",
            "query": "",
            "body": "{\n    \"id\":5876/5876,\n    \"checksum\":\"fuzzstring\",\n    \"body\":\"first blog\"}\r\n"
          }
        },
        "response": {
          "ResponseData": {
            "code": 400,
            "codeDescription": "BAD REQUEST",
            "content": "{\n    \"message\": \"Failed to decode JSON object: Expecting \\',\\' delimiter: line 2 column 14 (char 15)\"\n}\n",
            "isFailure": true,
            "isBug": false
          }
        }
      },
      {
        "request": {
          "RequestData": {
            "method": "PUT",
            "path": "/api/blog/posts/5876",
            "query": "",
            "body": "{\n    \"id\":5876/5876,\n    \"checksum\":\"fuzzstring\",\n    \"body\":\"first blog/first blog\"}\r\n"
          }
        },
        "response": {
          "ResponseData": {
            "code": 400,
            "codeDescription": "BAD REQUEST",
            "content": "{\n    \"message\": \"Failed to decode JSON object: Expecting \\',\\' delimiter: line 2 column 14 (char 15)\"\n}\n",
            "isFailure": true,
            "isBug": false
          }
        }
      },
      {
        "request": {
          "RequestData": {
            "method": "PUT",
            "path": "/api/blog/posts/5876",
            "query": "",
            "body": "{\n    \"id\":5876??,\n    \"checksum\":\"fuzzstring\",\n    \"body\":\"first blog\"}\r\n"
          }
        },
        "response": {
          "ResponseData": {
            "code": 400,
            "codeDescription": "BAD REQUEST",
            "content": "{\n    \"message\": \"Failed to decode JSON object: Expecting \\',\\' delimiter: line 2 column 14 (char 15)\"\n}\n",
            "isFailure": true,
            "isBug": false
          }
        }
      },
      {
        "request": {
          "RequestData": {
            "method": "",
            "path": "",
            "query": "",
            "body": ""
          }
        },
        "response": {
          "ResponseData": {
            "code": 400,
            "codeDescription": "BAD REQUEST",
            "content": "{\n    \"message\": \"Failed to decode JSON object: Expecting \\',\\' delimiter: line 2 column 14 (char 15)\"\n}\n",
            "isFailure": true,
            "isBug": false
          }
        }
      },
      {
        "request": {
          "RequestData": {
            "method": "PUT",
            "path": "/api/blog/posts/5876",
            "query": "",
            "body": "{\n    \"id\":5876??,\n    \"checksum\":\"fuzzstring\",\n    \"body\":\"first blog??\"}\r\n"
          }
        },
        "response": {
          "ResponseData": {
            "code": 400,
            "codeDescription": "BAD REQUEST",
            "content": "{\n    \"message\": \"Failed to decode JSON object: Expecting \\',\\' delimiter: line 2 column 14 (char 15)\"\n}\n",
            "isFailure": true,
            "isBug": false
          }
        }
      },
      {
        "request": {
          "RequestData": {
            "method": "",
            "path": "",
            "query": "",
            "body": ""
          }
        },
        "response": {
          "ResponseData": {
            "code": 400,
            "codeDescription": "BAD REQUEST",
            "content": "{\n    \"message\": \"Failed to decode JSON object: Expecting \\',\\' delimiter: line 2 column 14 (char 15)\"\n}\n",
            "isFailure": true,
            "isBug": false
          }
        }
      },
      {
        "request": {
          "RequestData": {
            "method": "PUT",
            "path": "/api/blog/posts/5876",
            "query": "",
            "body": "{\n    \"id\":5876/?/,\n    \"checksum\":\"fuzzstring\",\n    \"body\":\"first blog\"}\r\n"
          }
        },
        "response": {
          "ResponseData": {
            "code": 400,
            "codeDescription": "BAD REQUEST",
            "content": "{\n    \"message\": \"Failed to decode JSON object: Expecting \\',\\' delimiter: line 2 column 14 (char 15)\"\n}\n",
            "isFailure": true,
            "isBug": false
          }
        }
      },
      {
        "request": {
          "RequestData": {
            "method": "PUT",
            "path": "/api/blog/posts/5876",
            "query": "",
            "body": "{\n    \"id\":5876/?/,\n    \"checksum\":\"fuzzstring\",\n    \"body\":\"first blog/?/\"}\r\n"
          }
        },
        "response": {
          "ResponseData": {
            "code": 400,
            "codeDescription": "BAD REQUEST",
            "content": "{\n    \"message\": \"Failed to decode JSON object: Expecting \\',\\' delimiter: line 2 column 14 (char 15)\"\n}\n",
            "isFailure": true,
            "isBug": false
          }
        }
      },
      {
        "request": {
          "RequestData": {
            "method": "PUT",
            "path": "/api/blog/posts/5876",
            "query": "",
            "body": "{\n    \"id\":5876?injected_query_string=123,\n    \"checksum\":\"fuzzstring\",\n    \"body\":\"first blog\"}\r\n"
          }
        },
        "response": {
          "ResponseData": {
            "code": 400,
            "codeDescription": "BAD REQUEST",
            "content": "{\n    \"message\": \"Failed to decode JSON object: Expecting \\',\\' delimiter: line 2 column 14 (char 15)\"\n}\n",
            "isFailure": true,
            "isBug": false
          }
        }
      },
      {
        "request": {
          "RequestData": {
            "method": "PUT",
            "path": "/api/blog/posts/5876",
            "query": "injected_query_string=123",
            "body": "{\n    \"id\":5876?injected_query_string=123,\n    \"checksum\":\"fuzzstring\",\n    \"body\":\"first blog\"}\r\n"
          }
        },
        "response": {
          "ResponseData": {
            "code": 400,
            "codeDescription": "BAD REQUEST",
            "content": "{\n    \"message\": \"Failed to decode JSON object: Expecting \\',\\' delimiter: line 2 column 14 (char 15)\"\n}\n",
            "isFailure": true,
            "isBug": false
          }
        }
      }
    ]
  },
  "404": {
    "8d090977-779d-4fb6-b15a-3062d4a9c90c": [
      {
        "request": {
          "RequestData": {
            "method": "GET",
            "path": "/api/blog/posts/5874",
            "query": "",
            "body": ""
          }
        },
        "response": {
          "ResponseData": {
            "code": 404,
            "codeDescription": "NOT FOUND",
            "content": "{\n    \"message\": \"The requested URL was not found on the server. If you entered the URL manually please check your spelling and try again.\"\n}\n",
            "isFailure": true,
            "isBug": false
          }
        }
      }
    ],
    "8f557ea9-bdb6-433c-9100-0a336c9ca41a": [
      {
        "request": {
          "RequestData": {
            "method": "GET",
            "path": "/api/blog/posts/{}",
            "query": "",
            "body": ""
          }
        },
        "response": {
          "ResponseData": {
            "code": 404,
            "codeDescription": "NOT FOUND",
            "content": "<!DOCTYPE HTML PUBLIC \"-//W3C//DTD HTML 3.2 Final//EN\">\n<title>404 Not Found</title>\n<h1>Not Found</h1>\n<p>The requested URL was not found on the server. If you entered the URL manually please check your spelling and try again.</p>\n",
            "isFailure": true,
            "isBug": false
          }
        }
      },
      {
        "request": {
          "RequestData": {
            "method": "GET",
            "path": "/api/blog/posts/5881/5881",
            "query": "",
            "body": ""
          }
        },
        "response": {
          "ResponseData": {
            "code": 404,
            "codeDescription": "NOT FOUND",
            "content": "<!DOCTYPE HTML PUBLIC \"-//W3C//DTD HTML 3.2 Final//EN\">\n<title>404 Not Found</title>\n<h1>Not Found</h1>\n<p>The requested URL was not found on the server. If you entered the URL manually please check your spelling and try again.</p>\n",
            "isFailure": true,
            "isBug": false
          }
        }
      },
      {
        "request": {
          "RequestData": {
            "method": "GET",
            "path": "/api/blog/posts/5881",
            "query": "=/",
            "body": ""
          }
        },
        "response": {
          "ResponseData": {
            "code": 404,
            "codeDescription": "NOT FOUND",
            "content": "<!DOCTYPE HTML PUBLIC \"-//W3C//DTD HTML 3.2 Final//EN\">\n<title>404 Not Found</title>\n<h1>Not Found</h1>\n<p>The requested URL was not found on the server. If you entered the URL manually please check your spelling and try again.</p>\n",
            "isFailure": true,
            "isBug": false
          }
        }
      },
      {
        "request": {
          "RequestData": {
            "method": "PUT",
            "path": "/api/blog/posts/{}",
            "query": "",
            "body": "{\n    \"id\":5876,\n    \"checksum\":\"fuzzstring\",\n    \"body\":\"first blog\"}\r\n"
          }
        },
        "response": {
          "ResponseData": {
            "code": 404,
            "codeDescription": "NOT FOUND",
            "content": "<!DOCTYPE HTML PUBLIC \"-//W3C//DTD HTML 3.2 Final//EN\">\n<title>404 Not Found</title>\n<h1>Not Found</h1>\n<p>The requested URL was not found on the server. If you entered the URL manually please check your spelling and try again.</p>\n",
            "isFailure": true,
            "isBug": false
          }
        }
      },
      {
        "request": {
          "RequestData": {
            "method": "PUT",
            "path": "/api/blog/posts/{}",
            "query": "",
            "body": "{\n    \"id\":{},\n    \"checksum\":\"fuzzstring\",\n    \"body\":\"first blog\"}\r\n"
          }
        },
        "response": {
          "ResponseData": {
            "code": 404,
            "codeDescription": "NOT FOUND",
            "content": "<!DOCTYPE HTML PUBLIC \"-//W3C//DTD HTML 3.2 Final//EN\">\n<title>404 Not Found</title>\n<h1>Not Found</h1>\n<p>The requested URL was not found on the server. If you entered the URL manually please check your spelling and try again.</p>\n",
            "isFailure": true,
            "isBug": false
          }
        }
      },
      {
        "request": {
          "RequestData": {
            "method": "PUT",
            "path": "/api/blog/posts/{}",
            "query": "",
            "body": "{\n    \"id\":5876,\n    \"checksum\":\"fuzzstring\",\n    \"body\":\"{}\"}\r\n"
          }
        },
        "response": {
          "ResponseData": {
            "code": 404,
            "codeDescription": "NOT FOUND",
            "content": "<!DOCTYPE HTML PUBLIC \"-//W3C//DTD HTML 3.2 Final//EN\">\n<title>404 Not Found</title>\n<h1>Not Found</h1>\n<p>The requested URL was not found on the server. If you entered the URL manually please check your spelling and try again.</p>\n",
            "isFailure": true,
            "isBug": false
          }
        }
      },
      {
        "request": {
          "RequestData": {
            "method": "PUT",
            "path": "/api/blog/posts/{}",
            "query": "",
            "body": "{\n    \"id\":{},\n    \"checksum\":\"fuzzstring\",\n    \"body\":\"{}\"}\r\n"
          }
        },
        "response": {
          "ResponseData": {
            "code": 404,
            "codeDescription": "NOT FOUND",
            "content": "<!DOCTYPE HTML PUBLIC \"-//W3C//DTD HTML 3.2 Final//EN\">\n<title>404 Not Found</title>\n<h1>Not Found</h1>\n<p>The requested URL was not found on the server. If you entered the URL manually please check your spelling and try again.</p>\n",
            "isFailure": true,
            "isBug": false
          }
        }
      },
      {
        "request": {
          "RequestData": {
            "method": "PUT",
            "path": "/api/blog/posts/5876/5876",
            "query": "",
            "body": "{\n    \"id\":5876,\n    \"checksum\":\"fuzzstring\",\n    \"body\":\"first blog\"}\r\n"
          }
        },
        "response": {
          "ResponseData": {
            "code": 404,
            "codeDescription": "NOT FOUND",
            "content": "<!DOCTYPE HTML PUBLIC \"-//W3C//DTD HTML 3.2 Final//EN\">\n<title>404 Not Found</title>\n<h1>Not Found</h1>\n<p>The requested URL was not found on the server. If you entered the URL manually please check your spelling and try again.</p>\n",
            "isFailure": true,
            "isBug": false
          }
        }
      },
      {
        "request": {
          "RequestData": {
            "method": "PUT",
            "path": "/api/blog/posts/5876/5876",
            "query": "",
            "body": "{\n    \"id\":5876/5876,\n    \"checksum\":\"fuzzstring\",\n    \"body\":\"first blog\"}\r\n"
          }
        },
        "response": {
          "ResponseData": {
            "code": 404,
            "codeDescription": "NOT FOUND",
            "content": "<!DOCTYPE HTML PUBLIC \"-//W3C//DTD HTML 3.2 Final//EN\">\n<title>404 Not Found</title>\n<h1>Not Found</h1>\n<p>The requested URL was not found on the server. If you entered the URL manually please check your spelling and try again.</p>\n",
            "isFailure": true,
            "isBug": false
          }
        }
      },
      {
        "request": {
          "RequestData": {
            "method": "PUT",
            "path": "/api/blog/posts/5876/5876",
            "query": "",
            "body": "{\n    \"id\":5876,\n    \"checksum\":\"fuzzstring\",\n    \"body\":\"first blog/first blog\"}\r\n"
          }
        },
        "response": {
          "ResponseData": {
            "code": 404,
            "codeDescription": "NOT FOUND",
            "content": "<!DOCTYPE HTML PUBLIC \"-//W3C//DTD HTML 3.2 Final//EN\">\n<title>404 Not Found</title>\n<h1>Not Found</h1>\n<p>The requested URL was not found on the server. If you entered the URL manually please check your spelling and try again.</p>\n",
            "isFailure": true,
            "isBug": false
          }
        }
      }
    ]
  },
  "500": {
    "bcb956d8-5ff1-48a3-959b-0c6f1ddfbe13": [
      {
        "request": {
          "RequestData": {
            "method": "",
            "path": "",
            "query": "",
            "body": ""
          }
        },
        "response": {
          "ResponseData": {
            "code": 500,
            "codeDescription": "INTERNAL SERVER ERROR",
            "content": "{\n    \"message\": \"The server encountered an internal error and was unable to complete your request. Either the server is overloaded or there is an error in the application.\"\n}\n",
            "isFailure": true,
            "isBug": true
          }
        }
      },
      {
        "request": {
          "RequestData": {
            "method": "",
            "path": "",
            "query": "",
            "body": ""
          }
        },
        "response": {
          "ResponseData": {
            "code": 500,
            "codeDescription": "INTERNAL SERVER ERROR",
            "content": "{\n    \"message\": \"The server encountered an internal error and was unable to complete your request. Either the server is overloaded or there is an error in the application.\"\n}\n",
            "isFailure": true,
            "isBug": true
          }
        }
      },
      {
        "request": {
          "RequestData": {
            "method": "PUT",
            "path": "/api/blog/posts/5877",
            "query": "",
            "body": "{\"body\":\"first blog\"}"
          }
        },
        "response": {
          "ResponseData": {
            "code": 500,
            "codeDescription": "INTERNAL SERVER ERROR",
            "content": "{\n    \"message\": \"The server encountered an internal error and was unable to complete your request. Either the server is overloaded or there is an error in the application.\"\n}\n",
            "isFailure": true,
            "isBug": true
          }
        }
      },
      {
        "request": {
          "RequestData": {
            "method": "PUT",
            "path": "/api/blog/posts/5877",
            "query": "",
            "body": "{\"body\":\"first blog\"}"
          }
        },
        "response": {
          "ResponseData": {
            "code": 500,
            "codeDescription": "INTERNAL SERVER ERROR",
            "content": "{\n    \"message\": \"The server encountered an internal error and was unable to complete your request. Either the server is overloaded or there is an error in the application.\"\n}\n",
            "isFailure": true,
            "isBug": true
          }
        }
      }
    ]
  }
}