
Target types: {'_blog_posts_post_id'}
Clean dependencies: {'_blog_posts_post_body': 'first blog', '_blog_posts_post_id': '5874', (None, False): '1b1aefdf-d9ce-4d7c-80f9-eb261d5c1d82'}
Found * 1 * consumers.
