2022-03-03 14:05:39.784: Sending: 'DELETE /api/blog/posts/5880 HTTP/1.1\r\nAccept: application/json\r\nHost: localhost:8888\r\nContent-Length: 0\r\nUser-Agent: restler/8.4.0\r\n\r\n'

2022-03-03 14:05:39.796: Received: 'HTTP/1.1 200 OK\r\nContent-Type: application/json\r\nContent-Length: 5\r\nServer: Werkzeug/0.16.0 Python/3.8.12\r\nDate: Thu, 03 Mar 2022 14:05:39 GMT\r\n\r\nnull\n'

2022-03-03 14:05:39.798: Sending: 'DELETE /api/blog/posts/5883 HTTP/1.1\r\nAccept: application/json\r\nHost: localhost:8888\r\nContent-Length: 0\r\nUser-Agent: restler/8.4.0\r\n\r\n'

2022-03-03 14:05:39.809: Received: 'HTTP/1.1 200 OK\r\nContent-Type: application/json\r\nContent-Length: 5\r\nServer: Werkzeug/0.16.0 Python/3.8.12\r\nDate: Thu, 03 Mar 2022 14:05:39 GMT\r\n\r\nnull\n'

2022-03-03 14:05:39.811: Sending: 'DELETE /api/blog/posts/5882 HTTP/1.1\r\nAccept: application/json\r\nHost: localhost:8888\r\nContent-Length: 0\r\nUser-Agent: restler/8.4.0\r\n\r\n'

2022-03-03 14:05:39.823: Received: 'HTTP/1.1 200 OK\r\nContent-Type: application/json\r\nContent-Length: 5\r\nServer: Werkzeug/0.16.0 Python/3.8.12\r\nDate: Thu, 03 Mar 2022 14:05:39 GMT\r\n\r\nnull\n'

2022-03-03 14:05:39.825: Sending: 'DELETE /api/blog/posts/5881 HTTP/1.1\r\nAccept: application/json\r\nHost: localhost:8888\r\nContent-Length: 0\r\nUser-Agent: restler/8.4.0\r\n\r\n'

2022-03-03 14:05:39.836: Received: 'HTTP/1.1 200 OK\r\nContent-Type: application/json\r\nContent-Length: 5\r\nServer: Werkzeug/0.16.0 Python/3.8.12\r\nDate: Thu, 03 Mar 2022 14:05:39 GMT\r\n\r\nnull\n'

2022-03-03 14:05:39.838: Sending: 'DELETE /api/blog/posts/5875 HTTP/1.1\r\nAccept: application/json\r\nHost: localhost:8888\r\nContent-Length: 0\r\nUser-Agent: restler/8.4.0\r\n\r\n'

2022-03-03 14:05:39.849: Received: 'HTTP/1.1 200 OK\r\nContent-Type: application/json\r\nContent-Length: 5\r\nServer: Werkzeug/0.16.0 Python/3.8.12\r\nDate: Thu, 03 Mar 2022 14:05:39 GMT\r\n\r\nnull\n'

2022-03-03 14:05:39.851: Sending: 'DELETE /api/blog/posts/5879 HTTP/1.1\r\nAccept: application/json\r\nHost: localhost:8888\r\nContent-Length: 0\r\nUser-Agent: restler/8.4.0\r\n\r\n'

2022-03-03 14:05:39.863: Received: 'HTTP/1.1 200 OK\r\nContent-Type: application/json\r\nContent-Length: 5\r\nServer: Werkzeug/0.16.0 Python/3.8.12\r\nDate: Thu, 03 Mar 2022 14:05:39 GMT\r\n\r\nnull\n'

2022-03-03 14:05:39.865: Sending: 'DELETE /api/blog/posts/5878 HTTP/1.1\r\nAccept: application/json\r\nHost: localhost:8888\r\nContent-Length: 0\r\nUser-Agent: restler/8.4.0\r\n\r\n'

2022-03-03 14:05:39.877: Received: 'HTTP/1.1 200 OK\r\nContent-Type: application/json\r\nContent-Length: 5\r\nServer: Werkzeug/0.16.0 Python/3.8.12\r\nDate: Thu, 03 Mar 2022 14:05:39 GMT\r\n\r\nnull\n'

2022-03-03 14:05:39.879: Sending: 'DELETE /api/blog/posts/5877 HTTP/1.1\r\nAccept: application/json\r\nHost: localhost:8888\r\nContent-Length: 0\r\nUser-Agent: restler/8.4.0\r\n\r\n'

2022-03-03 14:05:39.890: Received: 'HTTP/1.1 200 OK\r\nContent-Type: application/json\r\nContent-Length: 5\r\nServer: Werkzeug/0.16.0 Python/3.8.12\r\nDate: Thu, 03 Mar 2022 14:05:39 GMT\r\n\r\nnull\n'

2022-03-03 14:05:39.892: Sending: 'DELETE /api/blog/posts/5876 HTTP/1.1\r\nAccept: application/json\r\nHost: localhost:8888\r\nContent-Length: 0\r\nUser-Agent: restler/8.4.0\r\n\r\n'

2022-03-03 14:05:39.904: Received: 'HTTP/1.1 200 OK\r\nContent-Type: application/json\r\nContent-Length: 5\r\nServer: Werkzeug/0.16.0 Python/3.8.12\r\nDate: Thu, 03 Mar 2022 14:05:39 GMT\r\n\r\nnull\n'

2022-03-03 14:05:39.906: Sending: 'DELETE /api/blog/posts/5874 HTTP/1.1\r\nAccept: application/json\r\nHost: localhost:8888\r\nContent-Length: 0\r\nUser-Agent: restler/8.4.0\r\n\r\n'

2022-03-03 14:05:39.917: Received: 'HTTP/1.1 200 OK\r\nContent-Type: application/json\r\nContent-Length: 5\r\nServer: Werkzeug/0.16.0 Python/3.8.12\r\nDate: Thu, 03 Mar 2022 14:05:39 GMT\r\n\r\nnull\n'

2022-03-03 14:05:39.919: Sending: 'DELETE /api/blog/posts/5874 HTTP/1.1\r\nAccept: application/json\r\nHost: localhost:8888\r\nContent-Length: 0\r\nUser-Agent: restler/8.4.0\r\n\r\n'

2022-03-03 14:05:39.927: Received: 'HTTP/1.1 404 NOT FOUND\r\nContent-Type: application/json\r\nContent-Length: 142\r\nServer: Werkzeug/0.16.0 Python/3.8.12\r\nDate: Thu, 03 Mar 2022 14:05:39 GMT\r\n\r\n{\n    "message": "The requested URL was not found on the server. If you entered the URL manually please check your spelling and try again."\n}\n'

2022-03-03 14:05:39.930: Sending: 'DELETE /api/blog/posts/5873 HTTP/1.1\r\nAccept: application/json\r\nHost: localhost:8888\r\nContent-Length: 0\r\nUser-Agent: restler/8.4.0\r\n\r\n'

2022-03-03 14:05:39.940: Received: 'HTTP/1.1 200 OK\r\nContent-Type: application/json\r\nContent-Length: 5\r\nServer: Werkzeug/0.16.0 Python/3.8.12\r\nDate: Thu, 03 Mar 2022 14:05:39 GMT\r\n\r\nnull\n'

2022-03-03 14:05:39.943: Sending: 'DELETE /api/blog/posts/5872 HTTP/1.1\r\nAccept: application/json\r\nHost: localhost:8888\r\nContent-Length: 0\r\nUser-Agent: restler/8.4.0\r\n\r\n'

2022-03-03 14:05:39.953: Received: 'HTTP/1.1 200 OK\r\nContent-Type: application/json\r\nContent-Length: 5\r\nServer: Werkzeug/0.16.0 Python/3.8.12\r\nDate: Thu, 03 Mar 2022 14:05:39 GMT\r\n\r\nnull\n'

2022-03-03 14:05:39.956: Sending: 'DELETE /api/blog/posts/5871 HTTP/1.1\r\nAccept: application/json\r\nHost: localhost:8888\r\nContent-Length: 0\r\nUser-Agent: restler/8.4.0\r\n\r\n'

2022-03-03 14:05:39.966: Received: 'HTTP/1.1 200 OK\r\nContent-Type: application/json\r\nContent-Length: 5\r\nServer: Werkzeug/0.16.0 Python/3.8.12\r\nDate: Thu, 03 Mar 2022 14:05:39 GMT\r\n\r\nnull\n'

2022-03-03 14:05:39.968: Sending: 'DELETE /api/blog/posts/5870 HTTP/1.1\r\nAccept: application/json\r\nHost: localhost:8888\r\nContent-Length: 0\r\nUser-Agent: restler/8.4.0\r\n\r\n'

2022-03-03 14:05:39.980: Received: 'HTTP/1.1 200 OK\r\nContent-Type: application/json\r\nContent-Length: 5\r\nServer: Werkzeug/0.16.0 Python/3.8.12\r\nDate: Thu, 03 Mar 2022 14:05:39 GMT\r\n\r\nnull\n'

2022-03-03 14:05:39.982: Sending: 'DELETE /api/blog/posts/5869 HTTP/1.1\r\nAccept: application/json\r\nHost: localhost:8888\r\nContent-Length: 0\r\nUser-Agent: restler/8.4.0\r\n\r\n'

2022-03-03 14:05:39.993: Received: 'HTTP/1.1 200 OK\r\nContent-Type: application/json\r\nContent-Length: 5\r\nServer: Werkzeug/0.16.0 Python/3.8.12\r\nDate: Thu, 03 Mar 2022 14:05:39 GMT\r\n\r\nnull\n'

2022-03-03 14:05:39.995: Sending: 'DELETE /api/blog/posts/5868 HTTP/1.1\r\nAccept: application/json\r\nHost: localhost:8888\r\nContent-Length: 0\r\nUser-Agent: restler/8.4.0\r\n\r\n'

2022-03-03 14:05:40.008: Received: 'HTTP/1.1 200 OK\r\nContent-Type: application/json\r\nContent-Length: 5\r\nServer: Werkzeug/0.16.0 Python/3.8.12\r\nDate: Thu, 03 Mar 2022 14:05:40 GMT\r\n\r\nnull\n'

