<svg width="40" height="40" viewBox="0 0 40 40" fill="none" xmlns="http://www.w3.org/2000/svg">
  <rect width="40" height="40" rx="20" fill="white" fill-opacity="0.7"/>
  <path opacity="0.8" d="M18 14L24 20.5L18 27" stroke="#222222" stroke-width="2" fill="none" />
</svg>
