(2023-01-30 03:14:50) Arturo ataca con su espada a Frodo
(2023-01-30 03:14:50) Frodo quedo con 80 Hp tras el ataque
(2023-01-30 03:14:50) Frodo Cambiar su BronzeArmor por GoldArmor 
(2023-01-30 03:14:50) Arturo ataca con su espada a Frodo
(2023-01-30 03:14:50) Frodo quedo con 70 Hp tras el ataque
(2023-01-30 03:14:50) <p style="display:inline;"> Frodo lanza una </p> <h4 style="color:red; display:inline;">bola de fuego</h4> a Arturo
(2023-01-30 03:14:50) Arturo quedo con 50 Hp tras el ataque
