<?xml version="1.0" encoding="utf-8"?>
<!-- Generator: Adobe Illustrator 22.1.0, SVG Export Plug-In . SVG Version: 6.00 Build 0)  -->
<svg version="1.1"
	 id="svg2" xmlns:cc="http://creativecommons.org/ns#" xmlns:dc="http://purl.org/dc/elements/1.1/" xmlns:rdf="http://www.w3.org/1999/02/22-rdf-syntax-ns#" xmlns:svg="http://www.w3.org/2000/svg"
	 xmlns="http://www.w3.org/2000/svg" xmlns:xlink="http://www.w3.org/1999/xlink" x="0px" y="0px" viewBox="0 0 50 50"
	 style="enable-background:new 0 0 50 50;" xml:space="preserve">
<style type="text/css">
	.st0{fill:none;stroke:#000000;stroke-width:1.3451;stroke-linecap:round;stroke-linejoin:round;}
	.st1{fill:#FFFFFF;stroke:#000000;stroke-width:1.3504;stroke-linecap:round;stroke-linejoin:round;}
	.st2{fill:none;}
</style>
<g id="surface1">
	<path id="path5" class="st0" d="M0.7,25h8.5"/>
	<path id="path7" class="st0" d="M43.6,25l5.7,0"/>
	<path id="path9" class="st1" d="M43.9,25.4c0.1-6.6-3.4-12.7-9.2-16c-5.7-3.3-12.8-3.3-18.6,0c-5.7,3.3-9.3,9.4-9.2,16
		c-0.1,6.6,3.4,12.7,9.2,16c5.7,3.3,12.8,3.3,18.6,0C40.4,38.1,43.9,32,43.9,25.4"/>
	<path id="path11" class="st1" d="M24.7,43.5l18.2-17.8"/>
	<path id="path13" class="st1" d="M24.7,7.1l18.2,17.4"/>
</g>
<rect class="st2" width="50" height="50"/>
</svg>
