<?xml version="1.0" encoding="UTF-8" standalone="no"?>
<!--
/*******************************************************************************
* Copyright (c) 2010-2017 ITER Organization.
* All rights reserved. This program and the accompanying materials
* are made available under the terms of the Eclipse Public License v1.0
* which accompanies this distribution, and is available at
* http://www.eclipse.org/legal/epl-v10.html
******************************************************************************/
-->

<svg
   xmlns:dc="http://purl.org/dc/elements/1.1/"
   xmlns:cc="http://creativecommons.org/ns#"
   xmlns:rdf="http://www.w3.org/1999/02/22-rdf-syntax-ns#"
   xmlns:svg="http://www.w3.org/2000/svg"
   xmlns="http://www.w3.org/2000/svg"
   xmlns:sodipodi="http://sodipodi.sourceforge.net/DTD/sodipodi-0.dtd"
   xmlns:inkscape="http://www.inkscape.org/namespaces/inkscape"
   width="29pt"
   height="29pt"
   viewBox="0 0 29 29"
   version="1.1"
   id="svg2"
   inkscape:version="0.91 r13725"
   sodipodi:docname="VC On-Off 2-way Powered Valve 3.svg">
  <metadata
     id="metadata23">
    <rdf:RDF>
      <cc:Work
         rdf:about="">
        <dc:format>image/svg+xml</dc:format>
        <dc:type
           rdf:resource="http://purl.org/dc/dcmitype/StillImage" />
        <dc:title></dc:title>
      </cc:Work>
    </rdf:RDF>
  </metadata>
  <defs
     id="defs21" />
  <sodipodi:namedview
     pagecolor="#ffffff"
     bordercolor="#666666"
     borderopacity="1"
     objecttolerance="10"
     gridtolerance="10"
     guidetolerance="10"
     inkscape:pageopacity="0"
     inkscape:pageshadow="2"
     inkscape:window-width="1920"
     inkscape:window-height="1117"
     id="namedview19"
     showgrid="false"
     inkscape:zoom="26.041379"
     inkscape:cx="23.183351"
     inkscape:cy="21.919603"
     inkscape:window-x="0"
     inkscape:window-y="0"
     inkscape:window-maximized="1"
     inkscape:current-layer="surface0" />
  <g
     id="surface0">
    <path
       style="fill-rule:nonzero;fill:#a6a6a6;fill-opacity:1;stroke-width:1.60656304;stroke-linecap:round;stroke-linejoin:round;stroke:rgb(0%, 0%, 0%);stroke-opacity:1;stroke-miterlimit:3;stroke-dasharray:none"
       d="M 25.496464 16.45241 L 31.971108 16.45241 L 31.971108 3.503123 L 19.028636 3.503123 L 19.028636 16.45241 L 25.50328 16.45241 "
       transform="matrix(0.573149,0,0,0.573149,0,0)"
       id="path5" />
    <path
       style=" stroke:none;fill-rule:evenodd;fill:rgb(65.098039%,65.098039%,65.098039%);fill-opacity:1;"
       d="M 0.777344 0.777344 L 0.792969 0.777344 L 0.792969 0.792969 L 0.777344 0.792969 Z M 0.777344 0.777344 "
       id="path7" />
    <path
       style=" stroke:none;fill-rule:evenodd;fill:rgb(65.098039%,65.098039%,65.098039%);fill-opacity:1;"
       d="M 28.175781 28.175781 L 28.191406 28.175781 L 28.191406 28.191406 L 28.175781 28.191406 Z M 28.175781 28.175781 "
       id="path9" />
    <path
       style="fill:none;stroke-width:1.606274;stroke-linecap:round;stroke-linejoin:round;stroke:rgb(0%,0%,0%);stroke-opacity:1;stroke-miterlimit:3;"
       d="M 25.496464 17.324783 L 25.496464 25.326079 "
       transform="matrix(0.573149,0,0,0.573149,0,0)"
       id="path11" />
    <path
       style="fill-rule:evenodd;fill:#ffffff;fill-opacity:1;stroke-width:1.606274;stroke-linecap:round;stroke-linejoin:round;stroke:rgb(0%, 0%, 0%);stroke-opacity:1;stroke-miterlimit:3"
       d="M 9.555211 33.565914 L 9.555211 17.624661 L 41.444533 33.565914 L 41.444533 17.624661 Z M 9.555211 33.565914 "
       transform="matrix(0.573149,0,0,0.573149,0,0)"
       id="path13" />
    <path
       style="fill:none;stroke-width:1.6;stroke-linecap:round;stroke-linejoin:round;stroke:rgb(0%,0%,0%);stroke-opacity:1;stroke-miterlimit:3;"
       d="M 0.665302 25.003125 L 9.192026 25.003125 "
       transform="matrix(0.575397,0,0,0.575397,0,0)"
       id="path15" />
    <path
       style="fill:none;stroke-width:1.6;stroke-linecap:round;stroke-linejoin:round;stroke:rgb(0%,0%,0%);stroke-opacity:1;stroke-miterlimit:3;"
       d="M 41.608513 25.003125 L 50.108082 25.003125 "
       transform="matrix(0.575397,0,0,0.575397,0,0)"
       id="path17" />
  </g>
</svg>
