<?xml version="1.0" encoding="utf-8"?>
<!-- Generator: Adobe Illustrator 22.1.0, SVG Export Plug-In . SVG Version: 6.00 Build 0)  -->
<svg version="1.1" id="Layer_1" xmlns="http://www.w3.org/2000/svg" xmlns:xlink="http://www.w3.org/1999/xlink" x="0px" y="0px"
	 viewBox="0 0 50 50" style="enable-background:new 0 0 50 50;" xml:space="preserve">
<style type="text/css">
	.st0{fill:none;stroke:#000000;stroke-width:1.3451;stroke-linecap:round;stroke-linejoin:round;}
	.st1{fill:#3DD83D;stroke:#000000;stroke-width:1.3504;stroke-linecap:round;stroke-linejoin:round;}
	.st2{fill:none;stroke:#000000;stroke-width:1.3504;stroke-linecap:round;stroke-linejoin:round;}
	.st3{fill:none;}
</style>
<g id="surface1">
	<path id="path9" class="st0" d="M0.8,25h8.5"/>
	<path id="path12" class="st0" d="M41.5,25h7.8"/>
	<path class="st1" d="M43.9,25.4c0.1-6.6-3.4-12.7-9.2-16c-5.7-3.3-12.8-3.3-18.6,0c-5.7,3.3-9.3,9.4-9.2,16
		c-0.1,6.6,3.4,12.7,9.2,16c5.7,3.3,12.8,3.3,18.6,0C40.4,38.1,43.9,32,43.9,25.4"/>
	<path class="st2" d="M15.8,9.7l25.3,6.4"/>
	<path class="st2" d="M15.8,41.2l25.3-6.8"/>
</g>
<rect class="st3" width="50" height="50"/>
</svg>
