<?xml version="1.0" encoding="utf-8"?>
<!-- Generator: Adobe Illustrator 22.1.0, SVG Export Plug-In . SVG Version: 6.00 Build 0)  -->
<svg version="1.1"
	 id="svg2" xmlns:cc="http://creativecommons.org/ns#" xmlns:dc="http://purl.org/dc/elements/1.1/" xmlns:rdf="http://www.w3.org/1999/02/22-rdf-syntax-ns#" xmlns:svg="http://www.w3.org/2000/svg"
	 xmlns="http://www.w3.org/2000/svg" xmlns:xlink="http://www.w3.org/1999/xlink" x="0px" y="0px" viewBox="0 0 50 50"
	 style="enable-background:new 0 0 50 50;" xml:space="preserve">
<style type="text/css">
	.st0{fill:#FC0D11;stroke:#000000;stroke-width:1.5;stroke-linecap:square;stroke-linejoin:round;stroke-miterlimit:3;}
	.st1{fill:none;stroke:#000000;stroke-width:1.5;stroke-linejoin:round;stroke-miterlimit:3;}
	.st2{fill:none;stroke:#000000;stroke-width:1.5;stroke-linecap:round;stroke-linejoin:round;}
	.st3{stroke:#000000;stroke-width:0.625;stroke-linejoin:round;}
	.st4{fill:none;}
</style>
<g id="surface1">
	<path id="path5" class="st0" d="M8.7,8.2h17.7v33.6H8.7V8.2z"/>
	<path id="path10-3" class="st1" d="M0,25h8"/>
	<path id="path10-3-3" class="st1" d="M42,25h8"/>
	<path id="path15" class="st2" d="M27,20.5h13.3c1.7,2.8,1.7,6.8,0,9H27"/>
	<polyline class="st2" points="15,35.7 19.3,25 14.2,25 19.4,12.4 	"/>
	<path id="path4230" class="st3" d="M17.5,34.5l-3.7,3.8l0.4-5.2C14.9,34.1,16.2,34.7,17.5,34.5z"/>
</g>
<rect class="st4" width="50" height="50"/>
</svg>
