<?xml version="1.0" encoding="utf-8"?>
<!-- Generator: Adobe Illustrator 21.0.0, SVG Export Plug-In . SVG Version: 6.00 Build 0)  -->
<svg version="1.1" id="Layer_1" xmlns="http://www.w3.org/2000/svg" xmlns:xlink="http://www.w3.org/1999/xlink" x="0px" y="0px"
	 viewBox="0 0 100 100" style="enable-background:new 0 0 100 100;" xml:space="preserve">
<style type="text/css">
	.st0{clip-path:url(#circle);}
	.st1{fill:#3DD83D;}
	.st2{stroke:#288C28;stroke-width:2;}
	.st3{fill:#000000;}
	.st4{stroke:#000000;stroke-width:3;}
</style>
<g>
	<circle class="st1 st2" cx="50" cy="50" r="49"/>
	<circle class="st1 st2 st4" cx="50" cy="50" r="19"/>
	<circle class="st1 st2 st4" cx="50" cy="50" r="9"/>

	<clipPath id="circle">
		<circle cx="50" cy="50" r="48"/>
	</clipPath>

	<g class="st0">
		<rect class="st3" x="-18.981" y="40.092" transform="matrix(0.2439 -0.9698 0.9698 0.2439 -27.9645 47.0149)" width="70.3" height="2.7"/>
		<rect class="st3" x="82.509" y="6.406" transform="matrix(0.9699 -0.2436 0.2436 0.9699 -7.5976 21.6795)" width="2.7" height="70.3"/>
	</g>
</g>
</svg>
