<?xml version="1.0" encoding="utf-8"?>
<!-- Generator: Adobe Illustrator 23.0.0, SVG Export Plug-In . SVG Version: 6.00 Build 0)  -->
<svg version="1.1" id="Layer_1" xmlns="http://www.w3.org/2000/svg" xmlns:xlink="http://www.w3.org/1999/xlink" x="0px" y="0px"
	 viewBox="0 0 14 14" style="enable-background:new 0 0 14 14;" xml:space="preserve">
<style type="text/css">
	.st0{fill:#FC0D1B;}
	.st1{fill:#960810;}
	.st2{fill:#FFFFFF;}
	.st3{fill:none;}
</style>
<g>
	<circle class="st0" cx="7" cy="7" r="5.5"/>
	<path class="st1" d="M7,2c2.8,0,5,2.2,5,5s-2.2,5-5,5S2,9.8,2,7S4.2,2,7,2 M7,1C3.7,1,1,3.7,1,7s2.7,6,6,6s6-2.7,6-6S10.3,1,7,1
		L7,1z"/>
</g>
<g>
	<g>
		<path class="st2" d="M6.1,4.6c0-0.2-0.1-0.7-0.1-0.8C6.1,3.3,6.6,3,7,3c0.4,0,0.9,0.3,0.9,0.8c0,0.1,0,0.6-0.1,0.8L7.4,8.5
			C7.3,9,7.3,9.1,7,9.1C6.7,9.1,6.7,9,6.6,8.5L6.1,4.6z"/>
	</g>
	<circle class="st2" cx="7" cy="10.3" r="0.7"/>
</g>
<rect x="1" y="1" class="st3" width="12" height="12"/>
<rect class="st3" width="14" height="14"/>
</svg>
