<?xml version="1.0" encoding="UTF-8" standalone="no"?>
<!-- Generator: Adobe Illustrator 23.0.3, SVG Export Plug-In . SVG Version: 6.00 Build 0)  -->

<svg
   xmlns:dc="http://purl.org/dc/elements/1.1/"
   xmlns:cc="http://creativecommons.org/ns#"
   xmlns:rdf="http://www.w3.org/1999/02/22-rdf-syntax-ns#"
   xmlns:svg="http://www.w3.org/2000/svg"
   xmlns="http://www.w3.org/2000/svg"
   xmlns:sodipodi="http://sodipodi.sourceforge.net/DTD/sodipodi-0.dtd"
   xmlns:inkscape="http://www.inkscape.org/namespaces/inkscape"
   version="1.1"
   x="0px"
   y="0px"
   viewBox="0 0 2500 1380"
   style="enable-background:new 0 0 2500 1380;"
   xml:space="preserve"
   id="svg368"
   sodipodi:docname="module_bg_v13.svg"
   inkscape:version="0.92.3 (2405546, 2018-03-11)"
   inkscape:export-filename="C:\Users\wawrzyniecgaj\faceplates\TS2\images\module_bg_v13.png"
   inkscape:export-xdpi="96"
   inkscape:export-ydpi="96"><metadata
   id="metadata374"><rdf:RDF><cc:Work
       rdf:about=""><dc:format>image/svg+xml</dc:format><dc:type
         rdf:resource="http://purl.org/dc/dcmitype/StillImage" /><dc:title /></cc:Work></rdf:RDF></metadata><defs
   id="defs372">
	
	
	
	
	
	
	
	
	
	
	
	
	
	
	
	
	
	
	
	
	
	
	
	
	
	
	
	
	
	
	
	
	
	
	
	
	
	
	
	
	

	
	
	
	
	
	
	
	
	
	
	
	
	
	
	
	
	
	
	
	
	
	
	
	
	

	
	
	
	
	
	
	
	
	
	
	
	
	
	
	
	
	
	
	
	
	
	
	
	
	
	
	
	
	
	
	
	
	
	

	
	
	
	
	
	
	
</defs><sodipodi:namedview
   pagecolor="#ffffff"
   bordercolor="#666666"
   borderopacity="1"
   objecttolerance="10"
   gridtolerance="10"
   guidetolerance="10"
   inkscape:pageopacity="0"
   inkscape:pageshadow="2"
   inkscape:window-width="2560"
   inkscape:window-height="1377"
   id="namedview370"
   showgrid="false"
   inkscape:zoom="0.5488"
   inkscape:cx="971.62003"
   inkscape:cy="584.83557"
   inkscape:window-x="1912"
   inkscape:window-y="-8"
   inkscape:window-maximized="1"
   inkscape:current-layer="svg368" />
<style
   type="text/css"
   id="style2">
	.st0{display:none;}
	.st1{display:inline;}
	.st2{fill:#DCE1DD;}
	.st3{fill:none;stroke:#999999;stroke-width:0.2577;}
	.st4{display:inline;fill:#97BCCA;}
	.st5{font-family:'SourceSansPro-BoldItalic';}
	.st6{font-size:32.8491px;}
	.st7{opacity:0.57;fill:#EFEFEF;}
	.st8{fill:#A0A0A0;}
	.st9{fill:#FFFFFF;}
	.st10{fill:none;stroke:#8E0D63;stroke-width:3;}
	.st11{fill:none;stroke:#00599B;stroke-width:3;stroke-linejoin:round;}
	.st12{fill:none;stroke:#00599B;stroke-width:3;stroke-linecap:square;}
	.st13{fill:none;stroke:#00599B;stroke-width:3;}
	.st14{fill:none;stroke:#37ABC8;stroke-width:3;}
	.st15{fill:none;stroke:#78D302;stroke-width:3;}
	.st16{fill:none;stroke:#2F8794;stroke-width:3;}
	.st17{fill:none;stroke:#089900;stroke-width:3;}
	.st18{fill:none;stroke:#FF7F2A;stroke-width:3;}
	.st19{fill:none;stroke:#089900;stroke-width:3;stroke-linecap:square;}
	.st20{fill:none;stroke:#4B19CA;stroke-width:3;}
	.st21{fill:#FFFFFF;stroke:#00599B;stroke-width:3;stroke-linejoin:round;}
	.st22{fill:none;stroke:#78D302;stroke-width:3;stroke-linecap:square;}
	.st23{fill:#78D302;}
	.st24{fill:#00599B;}
	.st25{fill:#4B19CA;}
	.st26{fill:#089900;}
	.st27{fill:#37ABC8;}
	.st28{fill:#2F8794;}
	.st29{fill:#FF7F2A;}
	.st30{fill:#8E0D63;}
	.st31{font-family:'SourceSansPro-Regular';}
	.st32{font-size:18px;}
	.st33{display:inline;enable-background:new    ;}
	.st34{letter-spacing:-1;}
	.st35{letter-spacing:-2;}
</style>
<g
   id="background"
   class="st0">
	<g
   id="XMLID_1_"
   class="st1">
		<g
   id="g6">
			<rect
   x="0.1"
   y="0.6"
   class="st2"
   width="2499.8"
   height="1378.9"
   id="rect4" />
		</g>
		<g
   id="g10">
			<rect
   x="0.1"
   y="0.6"
   class="st3"
   width="2499.8"
   height="1378.9"
   id="rect8" />
		</g>
	</g>
	<rect
   y="0.5"
   class="st4"
   width="2500"
   height="62.5"
   id="rect13" />
	<text
   transform="matrix(1 0 0 1 20.432 44.3638)"
   class="st1 st5 st6"
   id="text15">Placeholder</text>


</g>
<g
   id="Layer_9"
   transform="translate(0,-154)">
	<g
   id="g24">
		<path
   class="st7"
   d="M 55,195.5 54.9,328 H 224 v 433 h -57 l 0.1,570 H 2446 l 0.9,-570 -1368.9,0.3 0.3,-433.3 H 1317 V 196 Z"
   id="path18"
   inkscape:connector-curvature="0"
   style="opacity:0.56999966;fill:#efefef"
   sodipodi:nodetypes="ccccccccccccc" />
		<path
   class="st7"
   d="m 2446,734 h 14 v 625 h -14 z"
   id="path20"
   inkscape:connector-curvature="0"
   style="opacity:0.56999966;fill:#efefef"
   sodipodi:nodetypes="ccccc" />
		<path
   class="st7"
   d="m 155,742 h 12 v 609 h -12 z"
   id="path22"
   inkscape:connector-curvature="0"
   style="opacity:0.56999966;fill:#efefef"
   sodipodi:nodetypes="ccccc" />
	</g>
	<path
   class="st8"
   d="m 224,593 h 854 v 17 H 224 Z"
   id="path26"
   inkscape:connector-curvature="0"
   style="fill:#a0a0a0" />
</g>
<path
   style="fill:#a0a0a0;stroke-width:1.01746643"
   inkscape:connector-curvature="0"
   id="path29"
   d="m 2295.738,725 v 18 H 717 v -18 z"
   class="st8" /><g
   id="g49"
   transform="translate(0,-154)">
		<path
   style="fill:#a0a0a0"
   inkscape:connector-curvature="0"
   id="path31"
   d="M 797.8,938 H 625.3 c -6.2,0 -11.3,5.1 -11.3,11.3 v 86.4 c 0,6.2 5.1,11.3 11.3,11.3 h 172.4 c 6.2,0 11.3,-5.1 11.3,-11.3 v -86.4 c 0.1,-6.2 -5,-11.3 -11.2,-11.3 z"
   class="st8" />
		<path
   style="fill:#a0a0a0"
   inkscape:connector-curvature="0"
   id="path33"
   d="m 759,888 h 16 v 103 h -16 z"
   class="st8" />
		<g
   id="g45">
			<ellipse
   style="fill:#ffffff"
   id="ellipse35"
   ry="44.400002"
   rx="13.6"
   cy="992.5"
   cx="658.90002"
   class="st9" />
			<ellipse
   style="fill:#ffffff"
   id="ellipse37"
   ry="44.400002"
   rx="13.6"
   cy="992.5"
   cx="690.59998"
   class="st9" />
			<ellipse
   style="fill:#ffffff"
   id="ellipse39"
   ry="44.400002"
   rx="13.6"
   cy="992.5"
   cx="722.29999"
   class="st9" />
			<ellipse
   style="fill:#ffffff"
   id="ellipse41"
   ry="44.400002"
   rx="13.6"
   cy="992.5"
   cx="754"
   class="st9" />
			<ellipse
   style="fill:#ffffff"
   id="ellipse43"
   ry="44.400002"
   rx="13.6"
   cy="992.5"
   cx="785.59998"
   class="st9" />
		</g>
		<path
   sodipodi:nodetypes="ccccc"
   style="fill:#ffffff"
   inkscape:connector-curvature="0"
   id="path47"
   d="m 625,991 h 10 v 342 h -10 z"
   class="st9" />
	</g><g
   id="g69"
   transform="translate(-30,-154)">
		<path
   style="fill:#a0a0a0"
   inkscape:connector-curvature="0"
   id="path51"
   d="m 1246.7,938 h -172.4 c -6.2,0 -11.3,5.1 -11.3,11.3 v 86.4 c 0,6.2 5.1,11.3 11.3,11.3 h 172.4 c 6.2,0 11.3,-5.1 11.3,-11.3 v -86.4 c 0,-6.2 -5,-11.3 -11.3,-11.3 z"
   class="st8" />
		<path
   style="fill:#a0a0a0"
   inkscape:connector-curvature="0"
   id="path53"
   d="m 1209,888 h 16 v 103 h -16 z"
   class="st8" />
		<g
   id="g65">
			<ellipse
   style="fill:#ffffff"
   id="ellipse55"
   ry="44.400002"
   rx="13.6"
   cy="992.5"
   cx="1108"
   class="st9" />
			<ellipse
   style="fill:#ffffff"
   id="ellipse57"
   ry="44.400002"
   rx="13.6"
   cy="992.5"
   cx="1139.7"
   class="st9" />
			<ellipse
   style="fill:#ffffff"
   id="ellipse59"
   ry="44.400002"
   rx="13.6"
   cy="992.5"
   cx="1171.4"
   class="st9" />
			<ellipse
   style="fill:#ffffff"
   id="ellipse61"
   ry="44.400002"
   rx="13.6"
   cy="992.5"
   cx="1203.1"
   class="st9" />
			<ellipse
   style="fill:#ffffff"
   id="ellipse63"
   ry="44.400002"
   rx="13.6"
   cy="992.5"
   cx="1234.8"
   class="st9" />
		</g>
		<path
   sodipodi:nodetypes="ccccc"
   style="fill:#ffffff"
   inkscape:connector-curvature="0"
   id="path67"
   d="m 1074,991 h 10 v 342 h -10 z"
   class="st9" />
	</g><g
   id="g89"
   transform="translate(-62,-154)">
		<path
   style="fill:#a0a0a0"
   inkscape:connector-curvature="0"
   id="path71"
   d="m 1696.7,938 h -172.4 c -6.2,0 -11.3,5.1 -11.3,11.3 v 86.4 c 0,6.2 5.1,11.3 11.3,11.3 h 172.4 c 6.2,0 11.3,-5.1 11.3,-11.3 v -86.4 c 0,-6.2 -5.1,-11.3 -11.3,-11.3 z"
   class="st8" />
		<path
   style="fill:#a0a0a0"
   inkscape:connector-curvature="0"
   id="path73"
   d="m 1658,888 h 16 v 103 h -16 z"
   class="st8" />
		<g
   id="g85">
			<ellipse
   style="fill:#ffffff"
   id="ellipse75"
   ry="44.400002"
   rx="13.6"
   cy="992.5"
   cx="1557.1"
   class="st9" />
			<ellipse
   style="fill:#ffffff"
   id="ellipse77"
   ry="44.400002"
   rx="13.6"
   cy="992.5"
   cx="1588.8"
   class="st9" />
			<ellipse
   style="fill:#ffffff"
   id="ellipse79"
   ry="44.400002"
   rx="13.6"
   cy="992.5"
   cx="1620.5"
   class="st9" />
			<ellipse
   style="fill:#ffffff"
   id="ellipse81"
   ry="44.400002"
   rx="13.6"
   cy="992.5"
   cx="1652.2"
   class="st9" />
			<ellipse
   style="fill:#ffffff"
   id="ellipse83"
   ry="44.400002"
   rx="13.6"
   cy="992.5"
   cx="1683.9"
   class="st9" />
		</g>
		<path
   sodipodi:nodetypes="ccccc"
   style="fill:#ffffff"
   inkscape:connector-curvature="0"
   id="path87"
   d="m 1523,991 h 10 v 340 h -10 z"
   class="st9" />
	</g><g
   id="g109"
   transform="translate(-94,-154)">
		<path
   style="fill:#a0a0a0"
   inkscape:connector-curvature="0"
   id="path91"
   d="m 2144.7,938 h -172.4 c -6.2,0 -11.3,5.1 -11.3,11.3 v 86.4 c 0,6.2 5.1,11.3 11.3,11.3 h 172.4 c 6.2,0 11.3,-5.1 11.3,-11.3 v -86.4 c 0,-6.2 -5.1,-11.3 -11.3,-11.3 z"
   class="st8" />
		<path
   style="fill:#a0a0a0"
   inkscape:connector-curvature="0"
   id="path93"
   d="m 2106,888 h 16 v 103 h -16 z"
   class="st8" />
		<g
   id="g105">
			<ellipse
   style="fill:#ffffff"
   id="ellipse95"
   ry="44.400002"
   rx="13.6"
   cy="992.5"
   cx="2005.6"
   class="st9" />
			<ellipse
   style="fill:#ffffff"
   id="ellipse97"
   ry="44.400002"
   rx="13.6"
   cy="992.5"
   cx="2037.3"
   class="st9" />
			<ellipse
   style="fill:#ffffff"
   id="ellipse99"
   ry="44.400002"
   rx="13.6"
   cy="992.5"
   cx="2069"
   class="st9" />
			<ellipse
   style="fill:#ffffff"
   id="ellipse101"
   ry="44.400002"
   rx="13.6"
   cy="992.5"
   cx="2100.7"
   class="st9" />
			<ellipse
   style="fill:#ffffff"
   id="ellipse103"
   ry="44.400002"
   rx="13.6"
   cy="992.5"
   cx="2132.3"
   class="st9" />
		</g>
		<path
   sodipodi:nodetypes="ccccc"
   style="fill:#ffffff"
   inkscape:connector-curvature="0"
   id="path107"
   d="m 1972,991 h 10 v 340 h -10 z"
   class="st9" />
	</g><path
   style="fill:#ffffff"
   inkscape:connector-curvature="0"
   id="path111"
   d="m 155,822 h 2304 v 29 H 155 Z"
   class="st9" /><path
   style="fill:#a0a0a0"
   inkscape:connector-curvature="0"
   id="path113"
   d="m 2280,726 h 16 v 202 h -16 z"
   class="st8" />
<path
   style="fill:none;stroke:#000000;stroke-width:3;stroke-opacity:1"
   inkscape:connector-curvature="0"
   id="path116"
   d="m 375,262.5 h 988.5 v -143 h 401 l -0.1,1 H 2361"
   class="st10"
   sodipodi:nodetypes="cccccc" /><path
   style="fill:none;stroke:#00599b;stroke-width:3;stroke-linejoin:round"
   inkscape:connector-curvature="0"
   id="path120"
   d="m 585.5,970 v 21.9 l 4.4,0.8 c 0,0 1.9,0.4 4.4,0.4 4.2,0.6 13,-0.7 13,4.7 0,5.5 -14,1 -13.8,7.4 0.1,6.4 13.8,1.4 14,7.6 0.1,6.8 -14.1,1 -14.1,7.4 0,6.9 14.2,1.4 14.4,7.7 0.2,5.4 -9.3,4.8 -13,5 -2.4,0.3 -4.8,0.8 -4.8,0.8 l -3.5,0.8 v 11.9 274.9845"
   class="st11"
   sodipodi:nodetypes="ccccsccscccccc" /><path
   style="fill:none;stroke:#00599b;stroke-width:3;stroke-linejoin:round"
   inkscape:connector-curvature="0"
   id="path122"
   d="m 1007.5,970 -0.2,21.9 3.7,0.8 c 0,0 1.9,0.4 4.4,0.4 4.2,0.6 13,-0.7 13,4.7 0,5.5 -14,1 -13.8,7.4 0.1,6.4 13.8,1.4 14,7.6 0.1,6.8 -14.1,1 -14.1,7.4 0,6.9 14.2,1.4 14.4,7.7 0.2,5.4 -9.3,4.8 -13,5 -2.4,0.3 -4.8,0.8 -4.8,0.8 l -3.6,0.8 v 11.9 275.6287"
   class="st11"
   sodipodi:nodetypes="ccccsccscccccc" /><path
   style="fill:none;stroke:#00599b;stroke-width:3;stroke-linejoin:round"
   inkscape:connector-curvature="0"
   id="path124"
   d="m 1423.5,970 v 21.8 l 3.6,0.8 c 0,0 1.9,0.4 4.4,0.4 4.2,0.6 13,-0.7 13,4.7 0,5.5 -14,1 -13.8,7.4 0.2,6.4 13.8,1.4 14,7.6 0.1,6.8 -14.1,1 -14.1,7.4 0,6.9 14.2,1.4 14.4,7.7 0.2,5.4 -9.3,4.8 -13,5 -2.4,0.3 -4.8,0.8 -4.8,0.8 l -2.7,0.6 v 12.1 275.0845"
   class="st11"
   sodipodi:nodetypes="ccccsscscccccc" /><path
   style="fill:none;stroke:#00599b;stroke-width:3;stroke-linejoin:round"
   inkscape:connector-curvature="0"
   id="path126"
   d="m 1841.5,970 v 21.8 l 3.5,0.8 c 0,0 1.9,0.4 4.4,0.4 4.2,0.6 13,-0.7 13,4.7 0,5.5 -14,1 -13.8,7.4 0.2,6.4 13.8,1.4 14,7.6 0.1,6.8 -14.1,1 -14.1,7.4 0,6.9 14.2,1.4 14.4,7.7 0.2,5.4 -9.3,4.8 -13,5 -2.4,0.3 -4.8,0.8 -4.8,0.8 l -3.6,0.8 v 11.6"
   class="st11" /><path
   style="fill:none;stroke:#00599b;stroke-width:3;stroke-linecap:square"
   inkscape:connector-curvature="0"
   id="path128"
   d="m 591.5,666.5 h -150 v 303 h 1397.9424"
   class="st12"
   sodipodi:nodetypes="cccc" /><path
   style="fill:none;stroke:#00599b;stroke-width:3"
   inkscape:connector-curvature="0"
   id="path130"
   d="M 722.5,939 V 893"
   class="st13" /><path
   style="fill:none;stroke:#00599b;stroke-width:3"
   inkscape:connector-curvature="0"
   id="path132"
   d="M 1171.5,939 V 893"
   class="st13" /><path
   style="fill:none;stroke:#00599b;stroke-width:3"
   inkscape:connector-curvature="0"
   id="path134"
   d="M 1620.5,939 V 893"
   class="st13" /><path
   style="fill:none;stroke:#00599b;stroke-width:3"
   inkscape:connector-curvature="0"
   id="path136"
   d="M 2005.5,939 V 893"
   class="st13" /><path
   style="fill:none;stroke:#00599b;stroke-width:3"
   inkscape:connector-curvature="0"
   id="path138"
   d="M 43.5,26.36047 V 1322.5 H 1841.642 V 1036"
   class="st13"
   sodipodi:nodetypes="cccc" /><path
   style="fill:none;stroke:#37abc8;stroke-width:3"
   inkscape:connector-curvature="0"
   id="path140"
   d="M 25,27.5 H 2462"
   class="st14" /><path
   style="fill:none;stroke:#00599b;stroke-width:3"
   inkscape:connector-curvature="0"
   id="path142"
   d="M 1413.5,1322"
   class="st13" /><path
   style="fill:none;stroke:#78d302;stroke-width:3"
   inkscape:connector-curvature="0"
   id="path144"
   d="M 72,64.5 H 1125.8762"
   class="st15"
   sodipodi:nodetypes="cc" /><path
   style="fill:none;stroke:#000000;stroke-width:3;stroke-opacity:1"
   inkscape:connector-curvature="0"
   id="path146"
   d="m 1526.0959,585.5 h -215.0572 l 0,-223.81176"
   class="st16"
   sodipodi:nodetypes="ccc" /><path
   style="fill:none;stroke:#00599b;stroke-width:3"
   inkscape:connector-curvature="0"
   id="path148"
   d="M 1011,325.5 H 44"
   class="st13" /><path
   style="fill:none;stroke:#00599b;stroke-width:3"
   inkscape:connector-curvature="0"
   id="path150"
   d="m 255.5,325 v 63.5 H 801"
   class="st13" /><path
   style="fill:none;stroke:#782167;stroke-width:3;stroke-opacity:1"
   inkscape:connector-curvature="0"
   id="path152"
   d="m 2116,585.5 h -1.5 V 389.21166"
   class="st14"
   sodipodi:nodetypes="ccc" /><path
   style="fill:none;stroke:#37abc8;stroke-width:3"
   inkscape:connector-curvature="0"
   id="path154"
   d="M 2048.4,585.5"
   class="st14" /><path
   style="fill:none;stroke:#37abc8;stroke-width:3"
   inkscape:connector-curvature="0"
   id="path162"
   d="M 2405.5,26.68258 V 362.5 h 0.1919 V 586"
   class="st14"
   sodipodi:nodetypes="cccc" /><path
   style="fill:none;stroke:#089900;stroke-width:3"
   inkscape:connector-curvature="0"
   id="path164"
   d="M 955.6,48.1"
   class="st17" /><path
   style="fill:none;stroke:#170210;stroke-width:3;stroke-opacity:1"
   inkscape:connector-curvature="0"
   id="path166"
   d="M 1395.5,120 V 83.17302 h 76.0674 v 15.5"
   class="st10"
   sodipodi:nodetypes="cccc" /><path
   style="fill:none;stroke:#170210;stroke-width:3;stroke-opacity:1"
   inkscape:connector-curvature="0"
   id="path168"
   d="m 1459.0674,98.67306 h 25"
   class="st10" /><path
   style="fill:none;stroke:#000000;stroke-width:3;stroke-opacity:1"
   inkscape:connector-curvature="0"
   id="path172"
   d="m 1458.4232,263.52879 h 25"
   class="st10" /><path
   style="fill:none;stroke:#000000;stroke-width:3;stroke-opacity:1"
   inkscape:connector-curvature="0"
   id="path174"
   d="m 1009,360.5 h 677.4425 v -190 H 2362"
   class="st18"
   sodipodi:nodetypes="cccc" /><path
   style="fill:none;stroke:#4b19ca;stroke-width:3"
   inkscape:connector-curvature="0"
   id="path178"
   d="M 800.5,154 V 725"
   class="st20" /><path
   style="fill:#ffffff;stroke:#00599b;stroke-width:3;stroke-linejoin:round"
   inkscape:connector-curvature="0"
   id="path180"
   d="m 769.5,585.5 h 60 v 68 h -60 z"
   class="st21" /><path
   style="fill:none;stroke:#00599b;stroke-width:3"
   inkscape:connector-curvature="0"
   id="path182"
   d="m 591,595.5 h 205.2 l 22.7,7.8 -36.6,5.1 36.4,7.8 -36.6,7.1 36.6,7.8 -37.1,6.6 17.2,5.8 h 64.7 v 30 h 1550 v 91 l -106.9904,0 v -56 l -154.0096,0 V 725"
   class="st13"
   sodipodi:nodetypes="ccccccccccccccccc" /><path
   style="fill:none;stroke:#4b19ca;stroke-width:3"
   inkscape:connector-curvature="0"
   id="path184"
   d="M 72,153.5 H 1285.5 V 125.05766"
   class="st20"
   sodipodi:nodetypes="ccc" /><path
   style="fill:none;stroke:#00599b;stroke-width:3"
   inkscape:connector-curvature="0"
   id="path186"
   d="M 73,125.5 H 1287"
   class="st13" /><path
   style="fill:none;stroke:#78d302;stroke-width:3;stroke-linecap:square"
   inkscape:connector-curvature="0"
   id="path188"
   d="M 374.5,64.65375 V 1152.5 h 2070"
   class="st22"
   sodipodi:nodetypes="ccc" /><path
   style="fill:none;stroke:#000000;stroke-width:3;stroke-opacity:1"
   inkscape:connector-curvature="0"
   id="path166-0"
   d="m 1394.7337,283.97242 v -36.82698 h 76.0674 v 15.5"
   class="st10"
   sodipodi:nodetypes="cccc" /><path
   style="fill:none;stroke:#00599b;stroke-width:3"
   inkscape:connector-curvature="0"
   id="path190"
   d="M 590.5,124.59913 V 939.5 l 1697.2981,-0.3 V 928"
   class="st13"
   sodipodi:nodetypes="cccc" /><path
   style="fill:none;stroke:#000000;stroke-width:3;stroke-opacity:1"
   inkscape:connector-curvature="0"
   id="path192"
   d="m 800,705.5 h 727.3536 l 0,-316.15388"
   class="st16"
   sodipodi:nodetypes="ccc" /><path
   style="fill:none;stroke:#089900;stroke-width:3"
   inkscape:connector-curvature="0"
   id="path194"
   d="m 72,95.5 h 1053.4425 l 0.3221,-31.27503"
   class="st17"
   sodipodi:nodetypes="ccc" /><path
   style="fill:none;stroke:#000000;stroke-width:3;stroke-opacity:1"
   inkscape:connector-curvature="0"
   id="path196"
   d="M 2114.5,725 V 585.5 H 2013.1345 V 372.73102"
   class="st14"
   sodipodi:nodetypes="cccc" />
<path
   style="fill:#78d302;stroke-width:1.5053314"
   inkscape:connector-curvature="0"
   id="path199"
   d="m 374.65445,438.92201 -11.49876,-34.25018 h 22.85197 z"
   class="st23"
   inkscape:export-filename="C:\Users\wawrzyniecgaj\faceplates\TS2\images\path207.png"
   inkscape:export-xdpi="96"
   inkscape:export-ydpi="96" /><path
   style="fill:#00599b;stroke-width:1.50430357"
   inkscape:connector-curvature="0"
   id="path201"
   d="m 590.5466,438.43477 -11.49091,-34.2268 h 22.83636 z"
   class="st24"
   inkscape:export-filename="C:\Users\wawrzyniecgaj\faceplates\TS2\images\path207.png"
   inkscape:export-xdpi="96"
   inkscape:export-ydpi="96" /><path
   style="fill:#00599b"
   inkscape:connector-curvature="0"
   id="path203"
   d="m 2413.8,747 -7.9,-22 h 15.7 z"
   class="st24" /><path
   style="fill:#4b19ca;stroke-width:1.50430357"
   inkscape:connector-curvature="0"
   id="path205"
   d="m 800.95667,398.37279 11.49091,34.2268 h -22.83636 z"
   class="st25"
   inkscape:export-filename="C:\Users\wawrzyniecgaj\faceplates\TS2\images\path207.png"
   inkscape:export-xdpi="96"
   inkscape:export-ydpi="96" /><path
   style="fill:#089900;stroke-width:1.50430357"
   inkscape:connector-curvature="0"
   id="path207"
   d="m 1011.4123,396.91108 11.4909,34.22679 h -22.8364 z"
   class="st26"
   inkscape:export-filename="C:\Users\wawrzyniecgaj\faceplates\TS2\images\path207.png"
   inkscape:export-xdpi="96"
   inkscape:export-ydpi="96" /><path
   style="fill:#4b19ca"
   inkscape:connector-curvature="0"
   id="path209"
   d="m 323,154.1 22,-7.9 v 15.7 z"
   class="st25" /><path
   style="fill:#78d302"
   inkscape:connector-curvature="0"
   id="path211"
   d="m 352,64 -22,7.9 V 56.2 Z"
   class="st23" /><path
   style="fill:#00599b"
   inkscape:connector-curvature="0"
   id="path213"
   d="m 348,125.4 -22,7.9 v -15.7 z"
   class="st24" /><path
   style="fill:#00599b"
   inkscape:connector-curvature="0"
   id="path215"
   d="m 43.6,385 7.9,22 H 35.8 Z"
   class="st24" /><path
   style="fill:#00599b"
   inkscape:connector-curvature="0"
   id="path217"
   d="m 541,969.4 -22,7.9 v -15.7 z"
   class="st24" /><path
   style="fill:#00599b"
   inkscape:connector-curvature="0"
   id="path219"
   d="m 2306.4,722 7.9,22 h -15.7 z"
   class="st24" /><path
   style="fill:#37abc8"
   inkscape:connector-curvature="0"
   id="path221"
   d="m 426,27.5 -22,7.9 V 19.6 Z"
   class="st27" /><path
   style="fill:#37abc8"
   inkscape:connector-curvature="0"
   id="path223"
   d="m 1971,27.5 -22,7.9 V 19.6 Z"
   class="st27" /><path
   style="fill:#000000"
   inkscape:connector-curvature="0"
   id="path227"
   d="m 1972,170.27259 -22,7.9 v -15.7 z"
   class="st29"
   sodipodi:nodetypes="cccc" /><path
   style="fill:#000000;fill-opacity:1"
   inkscape:connector-curvature="0"
   id="path229"
   d="m 1944,119.89504 22,-7.9 v 15.7 z"
   class="st30" /><path
   style="fill:#089900"
   inkscape:connector-curvature="0"
   id="path231"
   d="m 323,95.2 22,-7.9 V 103 Z"
   class="st26" /><path
   style="fill:#00599b"
   inkscape:connector-curvature="0"
   id="path233"
   d="m 989,939.4 -22,7.9 v -15.7 z"
   class="st24" /><path
   style="fill:#089900"
   inkscape:connector-curvature="0"
   id="path235"
   d="m 1873,627 22,-7.9 v 15.7 z"
   class="st26" /><path
   style="fill:#00599b"
   inkscape:connector-curvature="0"
   id="path237"
   d="m 1460,673.4 -22,7.9 v -15.7 z"
   class="st24" /><path
   style="fill:#78d302"
   inkscape:connector-curvature="0"
   id="path239"
   d="m 1460,1152.4 -22,7.9 v -15.7 z"
   class="st23" /><path
   style="fill:#000000;fill-opacity:1"
   inkscape:connector-curvature="0"
   id="path243"
   d="m 1101,262.5 22,-7.9 v 15.7 z"
   class="st30" /><path
   style="fill:#000000;fill-opacity:1"
   inkscape:connector-curvature="0"
   id="path245"
   d="m 1176,283.5 22,-7.9 v 15.7 z"
   class="st30" />
<circle
   style="fill:#00599b"
   id="circle250"
   r="5.5999999"
   cy="325.70001"
   cx="255.5"
   class="st24" /><circle
   style="fill:#00599b"
   id="circle252"
   r="5.5999999"
   cy="595"
   cx="590.5"
   class="st24" /><circle
   style="fill:#00599b"
   id="circle254"
   r="5.5999999"
   cy="939.20001"
   cx="722.5"
   class="st24" /><circle
   style="fill:#00599b"
   id="circle256"
   r="5.5999999"
   cy="125.39999"
   cx="590.59998"
   class="st24" /><circle
   style="fill:#00599b"
   id="circle258"
   r="5.5999999"
   cy="283.5"
   cx="590.59998"
   class="st24" /><circle
   style="fill:#00599b"
   id="circle260"
   r="5.5999999"
   cy="666.40002"
   cx="590.5"
   class="st24" /><circle
   style="fill:#00599b"
   id="circle262"
   r="5.5999999"
   cy="939"
   cx="1171.5"
   class="st24" /><circle
   style="fill:#00599b"
   id="circle264"
   r="5.5999999"
   cy="939.20001"
   cx="1620.5"
   class="st24" /><circle
   style="fill:#00599b"
   id="circle266"
   r="5.5999999"
   cy="939.20001"
   cx="2005.6"
   class="st24" /><circle
   style="fill:#00599b"
   id="circle268"
   r="5.5999999"
   cy="1322.5"
   cx="586.29999"
   class="st24" /><circle
   style="fill:#00599b"
   id="circle270"
   r="5.5999999"
   cy="1322"
   cx="1007.1"
   class="st24" /><circle
   style="fill:#00599b"
   id="circle272"
   r="5.5999999"
   cy="1322.5"
   cx="1424.3"
   class="st24" /><circle
   style="fill:#782167;fill-opacity:1"
   id="circle278"
   r="5.5999999"
   cy="585.5"
   cx="2114.5"
   class="st27" /><circle
   style="fill:#37abc8"
   id="circle282"
   r="5.5999999"
   cy="27.5"
   cx="2405.8999"
   class="st27" /><circle
   style="fill:#37abc8"
   id="circle284"
   r="5.5999999"
   cy="27.5"
   cx="43.5"
   class="st27" /><circle
   style="fill:#78d302"
   id="circle288"
   r="5.5999999"
   cy="64.300003"
   cx="374.60001"
   class="st23" /><circle
   style="fill:#78d302"
   id="circle290"
   r="5.5999999"
   cy="262.60001"
   cx="374.60001"
   class="st23" /><circle
   style="fill:#4b19ca"
   id="circle292"
   r="5.5999999"
   cy="388.79999"
   cx="800.40002"
   class="st25" /><circle
   style="fill:#4b19ca"
   id="circle294"
   r="5.5999999"
   cy="705.5"
   cx="800.59998"
   class="st25" /><circle
   style="fill:#089900"
   id="circle296"
   r="5.5999999"
   cy="360.09998"
   cx="1010.6"
   class="st26" /><circle
   style="fill:#089900"
   id="circle298"
   r="5.5999999"
   cy="325.70001"
   cx="1010.6"
   class="st26" /><path
   style="fill:#089900"
   inkscape:connector-curvature="0"
   id="path300"
   d="m 1010.7,100 h -0.3 c -2.1,0 -4,-1.2 -4.9,-3.1 -2.1,-4.7 2.1,-9.3 6.8,-7.8 1.7,0.5 3,1.8 3.5,3.5 1.4,3.8 -1.4,7.4 -5.1,7.4 z"
   class="st26" /><circle
   style="fill:#000000"
   id="circle302"
   r="5.5999999"
   cy="360.6694"
   cx="1312.525"
   class="st29" /><circle
   style="fill:#000000;fill-opacity:1"
   id="circle304"
   r="5.5999999"
   cy="118.79999"
   cx="1395.5"
   class="st30" /><circle
   style="fill:#000000;fill-opacity:1"
   id="circle306"
   r="5.5999999"
   cy="283.5"
   cx="1395"
   class="st30" /><circle
   style="fill:#000000;fill-opacity:1"
   id="circle308"
   r="5.5999999"
   cy="119.60001"
   cx="1764.6"
   class="st30" /><circle
   style="fill:#00599b"
   id="circle310"
   r="5.5999999"
   cy="325.5"
   cx="43.5"
   class="st24" /><circle
   style="fill:#00599b"
   id="circle312"
   r="5.5999999"
   cy="970"
   cx="585.5"
   class="st24" /><circle
   style="fill:#00599b"
   id="circle314"
   r="5.5999999"
   cy="970"
   cx="1035.3"
   class="st24" /><circle
   style="fill:#00599b"
   id="circle316"
   r="5.5999999"
   cy="970"
   cx="1487.5"
   class="st24" />
<g
   id="text"
   class="st0">
	<text
   transform="matrix(1 0 0 1 80.0675 298.0431)"
   class="st1 st31 st32"
   id="text319">He Return                VLP</text>


	<text
   transform="matrix(1 9.100000e-04 -9.100000e-04 1 79.9933 244.2143)"
   class="st33"
   id="text331"><tspan
     x="0"
     y="0"
     class="st31 st32"
     id="tspan321">He Supply     </tspan><tspan
     x="94.6"
     y="0"
     class="st31 st32 st34"
     id="tspan323"> </tspan><tspan
     x="96.8"
     y="0"
     class="st31 st32"
     id="tspan325">4.5 K       </tspan><tspan
     x="158.4"
     y="0"
     class="st31 st32 st35"
     id="tspan327"> </tspan><tspan
     x="159.5"
     y="0"
     class="st31 st32"
     id="tspan329">3.0 bar</tspan></text>


	<text
   transform="matrix(1 0 0 1 80.0676 191.9852)"
   class="st1 st31 st32"
   id="text333">TS Return    50.0 K     12.3 bar</text>


	<text
   transform="matrix(1 0 0 1 80.0678 136.4275)"
   class="st1 st31 st32"
   id="text335">TS Supply   40.0 K     12.8 bar</text>


	<g
   class="st1"
   id="g341">
		<text
   transform="matrix(1 0 0 1 2063.05 87.4764)"
   class="st31 st32"
   id="text337">He Recovery Line</text>


		<text
   transform="matrix(1 0 0 1 2292.1848 87.4764)"
   class="st31 st32"
   id="text339">&lt;1.1 bar</text>


	</g>
	<g
   class="st1"
   id="g349">
		<text
   transform="matrix(1 0 0 1 2063.5005 170.051)"
   class="st31 st32"
   id="text343">SV Relief Line</text>


		<text
   transform="matrix(1 0 0 1 2200.167 170.0509)"
   class="st31 st32"
   id="text345">4-300 K</text>


		<text
   transform="matrix(1 0 0 1 2284.6006 170.051)"
   class="st31 st32"
   id="text347">  &lt;1.1 bar</text>


	</g>
	<g
   class="st1"
   id="g357">
		<text
   transform="matrix(1 0 0 1 2063.0005 209.9534)"
   class="st31 st32"
   id="text351">Purge Return</text>


		<text
   transform="matrix(1 0 0 1 2301.001 209.9535)"
   class="st31 st32"
   id="text353">1.1 bar</text>


		<text
   transform="matrix(1 0 0 1 2214.2007 209.7534)"
   class="st31 st32"
   id="text355">300 K</text>


	</g>
	<g
   class="st1"
   id="g365">
		<text
   transform="matrix(1 0 0 1 2214.1006 128.5533)"
   class="st31 st32"
   id="text359">300 K</text>


		<text
   transform="matrix(1 0 0 1 2063.001 128.3533)"
   class="st31 st32"
   id="text361">HP Line                          </text>


		<text
   transform="matrix(1 0 0 1 2301.6016 128.5531)"
   class="st31 st32"
   id="text363">3.0 bar</text>


	</g>
</g>
<path
   style="fill:none;stroke:#089900;stroke-width:2.9000001;stroke-linecap:butt;stroke-linejoin:miter;stroke-miterlimit:4;stroke-dasharray:none;stroke-opacity:1"
   d="M 1010.5,94.528836 V 626.50005 h 1434 V 1152.5"
   id="path1315"
   inkscape:connector-curvature="0"
   sodipodi:nodetypes="cccc" /><path
   style="fill:none;stroke:#782167;stroke-width:3"
   inkscape:connector-curvature="0"
   id="path174-5"
   d="m 1780.9425,388.19241 -253.8266,0.69206 829.4133,0"
   class="st18"
   sodipodi:nodetypes="ccc" /><path
   style="fill:none;stroke:#000000;stroke-width:3"
   inkscape:connector-curvature="0"
   id="path174-5-4"
   d="m 591,283.5 h 1000.7992 l 0,-164.2308"
   class="st18"
   sodipodi:nodetypes="ccc" /><path
   style="fill:none;stroke:#000000;stroke-width:3;stroke-opacity:1"
   inkscape:connector-curvature="0"
   id="path196-3"
   d="M 2013.1345,585.5 H 1911.769 V 435.86556"
   class="st14"
   sodipodi:nodetypes="ccc" /><path
   style="fill:none;stroke:#782167;stroke-width:3;stroke-linecap:butt;stroke-linejoin:miter;stroke-miterlimit:4;stroke-dasharray:none;stroke-opacity:1"
   d="m 1911.769,435.86556 h 101.3655 l 0,-210.32562 h 347.324"
   id="path1407"
   inkscape:connector-curvature="0"
   sodipodi:nodetypes="cccc" /><circle
   style="fill:#782167;fill-opacity:1"
   id="circle278-3"
   r="5.5999999"
   cy="389.75125"
   cx="2114.647"
   class="st27" /></svg>