<?xml version="1.0" encoding="UTF-8" standalone="no"?>
<!-- Created with Inkscape (http://www.inkscape.org/) -->

<svg
   xmlns:dc="http://purl.org/dc/elements/1.1/"
   xmlns:cc="http://creativecommons.org/ns#"
   xmlns:rdf="http://www.w3.org/1999/02/22-rdf-syntax-ns#"
   xmlns:svg="http://www.w3.org/2000/svg"
   xmlns="http://www.w3.org/2000/svg"
   xmlns:sodipodi="http://sodipodi.sourceforge.net/DTD/sodipodi-0.dtd"
   xmlns:inkscape="http://www.inkscape.org/namespaces/inkscape"
   width="376.64163"
   height="67.35714"
   viewBox="0 0 99.653095 17.821577"
   version="1.1"
   id="svg5224"
   inkscape:version="0.92.1 r15371"
   sodipodi:docname="BigTank.svg">
  <defs
     id="defs5218" />
  <sodipodi:namedview
     id="base"
     pagecolor="#ffffff"
     bordercolor="#666666"
     borderopacity="1.0"
     inkscape:pageopacity="0.0"
     inkscape:pageshadow="2"
     inkscape:zoom="2.8"
     inkscape:cx="159.25924"
     inkscape:cy="13.659443"
     inkscape:document-units="px"
     inkscape:current-layer="layer1"
     showgrid="false"
     units="px"
     inkscape:window-width="1920"
     inkscape:window-height="1001"
     inkscape:window-x="2091"
     inkscape:window-y="-9"
     inkscape:window-maximized="1"
     fit-margin-top="0"
     fit-margin-left="0"
     fit-margin-right="0"
     fit-margin-bottom="0"
     inkscape:pagecheckerboard="true"
     scale-x="1e-005" />
  <metadata
     id="metadata5221">
    <rdf:RDF>
      <cc:Work
         rdf:about="">
        <dc:format>image/svg+xml</dc:format>
        <dc:type
           rdf:resource="http://purl.org/dc/dcmitype/StillImage" />
        <dc:title></dc:title>
      </cc:Work>
    </rdf:RDF>
  </metadata>
  <g
     inkscape:label="Layer 1"
     inkscape:groupmode="layer"
     id="layer1"
     transform="translate(-3.0279,-273.96174)">
    <path
       style="opacity:1;fill:none;fill-opacity:1;stroke:#000000;stroke-width:0.52916664;stroke-miterlimit:3;stroke-dasharray:none;stroke-opacity:1"
       id="path4489"
       sodipodi:type="arc"
       sodipodi:cx="11.938528"
       sodipodi:cy="282.87253"
       sodipodi:rx="8.6462049"
       sodipodi:ry="8.6462049"
       sodipodi:start="1.5707963"
       sodipodi:end="4.712389"
       sodipodi:open="true"
       d="m 11.938528,291.51873 a 8.6462049,8.6462049 0 0 1 -7.487833,-4.3231 8.6462049,8.6462049 0 0 1 -10e-8,-8.6462 8.6462049,8.6462049 0 0 1 7.4878331,-4.32311" />
    <circle
       style="opacity:1;fill:none;fill-opacity:1;stroke:#000000;stroke-width:0.52916664;stroke-miterlimit:3;stroke-dasharray:none;stroke-opacity:1"
       id="path4489-0"
       cx="34.050137"
       cy="283.81747"
       r="0" />
    <path
       style="opacity:1;fill:none;fill-opacity:1;stroke:#000000;stroke-width:0.52916664;stroke-linecap:square;stroke-miterlimit:3;stroke-dasharray:none;stroke-opacity:1"
       id="path4489-7"
       sodipodi:type="arc"
       sodipodi:cx="-93.77037"
       sodipodi:cy="282.87253"
       sodipodi:rx="8.6462049"
       sodipodi:ry="8.6462049"
       sodipodi:start="1.5707963"
       sodipodi:end="4.712389"
       sodipodi:open="true"
       d="m -93.77037,291.51873 a 8.6462049,8.6462049 0 0 1 -7.48783,-4.3231 8.6462049,8.6462049 0 0 1 0,-8.6462 8.6462049,8.6462049 0 0 1 7.48783,-4.32311"
       transform="scale(-1,1)" />
    <path
       style="fill:none;stroke:#000000;stroke-width:0.52916664;stroke-linecap:butt;stroke-linejoin:miter;stroke-miterlimit:4;stroke-dasharray:none;stroke-opacity:1"
       d="M 11.796791,274.22633 H 93.628636"
       id="path4547"
       inkscape:connector-curvature="0" />
    <path
       style="fill:none;stroke:#000000;stroke-width:0.52916664;stroke-linecap:butt;stroke-linejoin:miter;stroke-miterlimit:4;stroke-dasharray:none;stroke-opacity:1"
       d="M 11.938527,291.51873 H 93.77037"
       id="path4547-8"
       inkscape:connector-curvature="0" />
  </g>
</svg>
