<?xml version="1.0" encoding="UTF-8" standalone="no"?>
<!--
/*******************************************************************************
* Copyright (c) 2010-2017 ITER Organization.
* All rights reserved. This program and the accompanying materials
* are made available under the terms of the Eclipse Public License v1.0
* which accompanies this distribution, and is available at
* http://www.eclipse.org/legal/epl-v10.html
******************************************************************************/
-->

<svg
   xmlns:dc="http://purl.org/dc/elements/1.1/"
   xmlns:cc="http://creativecommons.org/ns#"
   xmlns:rdf="http://www.w3.org/1999/02/22-rdf-syntax-ns#"
   xmlns:svg="http://www.w3.org/2000/svg"
   xmlns="http://www.w3.org/2000/svg"
   xmlns:sodipodi="http://sodipodi.sourceforge.net/DTD/sodipodi-0.dtd"
   xmlns:inkscape="http://www.inkscape.org/namespaces/inkscape"
   width="40"
   height="40"
   viewBox="0 0 29.999999 29.999999"
   version="1.1"
   id="svg29"
   sodipodi:docname="Heater H 0.svg"
   inkscape:version="0.91 r13725">
  <metadata
     id="metadata35">
    <rdf:RDF>
      <cc:Work
         rdf:about="">
        <dc:format>image/svg+xml</dc:format>
        <dc:type
           rdf:resource="http://purl.org/dc/dcmitype/StillImage" />
        <dc:title />
      </cc:Work>
    </rdf:RDF>
  </metadata>
  <defs
     id="defs33" />
  <sodipodi:namedview
     pagecolor="#ffffff"
     bordercolor="#666666"
     borderopacity="1"
     objecttolerance="10"
     gridtolerance="10"
     guidetolerance="10"
     inkscape:pageopacity="0"
     inkscape:pageshadow="2"
     inkscape:window-width="1920"
     inkscape:window-height="1037"
     id="namedview31"
     showgrid="false"
     inkscape:zoom="16"
     inkscape:cx="3.728522"
     inkscape:cy="16.47946"
     inkscape:window-x="0"
     inkscape:window-y="28"
     inkscape:window-maximized="1"
     inkscape:current-layer="svg29"
     units="px" />
  <path
     inkscape:connector-curvature="0"
     id="path6"
     d="M 0.528118,15.001281 C 0.464248,9.8534124 3.210166,5.0671697 7.717491,2.4772808 c 4.502009,-2.58988789 10.063002,-2.58988789 14.565013,0 4.502009,2.5898889 7.253236,7.3761316 7.189378,12.5240002 0.06386,5.153186 -2.687369,9.939427 -7.189378,12.529315 -4.502011,2.589889 -10.063004,2.589889 -14.565013,0 C 3.210166,24.940708 0.464256,20.154467 0.528118,15.001281"
     style="fill:#ffffff;fill-opacity:1;fill-rule:nonzero;stroke:#000000;stroke-width:0.75;stroke-linecap:round;stroke-linejoin:round;stroke-miterlimit:4;stroke-dasharray:none;stroke-opacity:1" />
  <path
     inkscape:connector-curvature="0"
     id="path8"
     d="M 17.287404,3.9223019 7.126401,16.667694"
     style="fill:none;stroke:#000000;stroke-width:0.74999998;stroke-linecap:round;stroke-linejoin:round;stroke-miterlimit:4;stroke-dasharray:none;stroke-opacity:1" />
  <path
     inkscape:connector-curvature="0"
     id="path12"
     d="m 29.222654,1.7773421 -0.01563,0 0,0.015625 0.01563,0 z m 0,0"
     style="fill:#ffffff;fill-opacity:1;fill-rule:evenodd;stroke:none" />
  <path
     inkscape:connector-curvature="0"
     id="path14"
     d="m 1.824217,29.175779 -0.01563,0 0,0.01563 0.01563,0 z m 0,0"
     style="fill:#ffffff;fill-opacity:1;fill-rule:evenodd;stroke:none" />
  <path
     inkscape:connector-curvature="0"
     id="path24"
     d="m 1.527342,29.710936 -0.01953,0 0,0.01953 0.01953,0 z m 0,0"
     style="fill:#ffffff;fill-opacity:1;fill-rule:evenodd;stroke:none" />
  <path
     inkscape:connector-curvature="0"
     id="path26"
     d="m 1.523436,29.703123 -0.03125,0 0,0.02734 0.03125,0 z m 0,0"
     style="fill:#ffffff;fill-opacity:1;fill-rule:evenodd;stroke:none" />
  <path
     inkscape:connector-curvature="0"
     id="path8-4"
     d="M 22.175829,12.268835 7.1462451,16.866918"
     style="fill:none;stroke:#000000;stroke-width:0.74999998;stroke-linecap:round;stroke-linejoin:round;stroke-miterlimit:4;stroke-dasharray:none;stroke-opacity:1" />
  <path
     inkscape:connector-curvature="0"
     id="path8-8"
     d="M 22.096126,12.424178 11.935123,25.16957"
     style="fill:none;stroke:#000000;stroke-width:0.74999998;stroke-linecap:round;stroke-linejoin:round;stroke-miterlimit:4;stroke-dasharray:none;stroke-opacity:1" />
  <path
     inkscape:connector-curvature="0"
     id="path8-8-2"
     d="m 13.058168,18.7421 -1.366337,6.531424"
     style="fill:none;stroke:#000000;stroke-width:0.74999998;stroke-linecap:round;stroke-linejoin:round;stroke-miterlimit:4;stroke-dasharray:none;stroke-opacity:1" />
  <path
     inkscape:connector-curvature="0"
     id="path8-8-2-8"
     d="m 17.849004,22.460222 -5.979259,2.798304"
     style="fill:none;stroke:#000000;stroke-width:0.74999998;stroke-linecap:round;stroke-linejoin:round;stroke-miterlimit:4;stroke-dasharray:none;stroke-opacity:1" />
</svg>
