<?xml version="1.0" encoding="utf-8"?>
<!-- Generator: Adobe Illustrator 21.0.0, SVG Export Plug-In . SVG Version: 6.00 Build 0)  -->
<svg version="1.1" id="Layer_1" xmlns="http://www.w3.org/2000/svg" xmlns:xlink="http://www.w3.org/1999/xlink" x="0px" y="0px"
	 viewBox="0 0 100 100" style="enable-background:new 0 0 100 100;" xml:space="preserve">
<style type="text/css">
	.st0{clip-path:url(#circle);}
	.st1{fill:#FFFFFF;}
	.st2{stroke:#000000;stroke-width:2;}
	.st3{fill:#000000;}
	.st4{font-family:'Helvetica';font-size:20px;}
	.st5{stroke:#000000;stroke-width:2.7;}
</style>
<g>
	<circle class="st1 st2" cx="50" cy="50" r="49"/>

	<clipPath id="circle">
		<circle cx="50" cy="50" r="48"/>
	</clipPath>

	<g class="st0">
		<text class="st3 st4" transform="matrix(1 0 0 1 44 22)">P</text>
		<line class="st5" x1="50" y1="87.14" x2="24.9" y2="26.4"/>
		<polygon class="st3" points="30.159,25.859 21.645,19.925 20.741,30.374"/>
	</g>
</g>
</svg>
