<svg width="150" height="150" xmlns="http://www.w3.org/2000/svg">
<style type="text/css">
	.st0{fill:#3DD83D;}
</style>
 <g>
  <rect class="st0" height="150" width="100" y="0" x="25" stroke-width="1.5" stroke="#000"/>
  <path d="M25,0l25,25v100L25,150" stroke-width="1.5" stroke="#000" fill="none"/>
  <path d="M125,0l-25,25v100L125,150" stroke-width="1.5" stroke="#000" fill="none"/>
 </g>
</svg>
