<svg width="12" height="12" viewBox="0 0 12 12" fill="none" xmlns="http://www.w3.org/2000/svg">
<path d="M8.02216 6.00197L11.0543 2.96984C11.233 2.79106 11.3334 2.54861 11.3334 2.29581C11.3334 2.04302 11.233 1.80057 11.0543 1.62178L10.3809 0.948427C10.2021 0.769701 9.95969 0.669301 9.7069 0.669301C9.4541 0.669301 9.21165 0.769701 9.03287 0.948427L6.00075 3.98055L2.96862 0.947094C2.78984 0.768368 2.54739 0.667969 2.2946 0.667969C2.0418 0.667969 1.79935 0.768368 1.62057 0.947094L0.947209 1.62045C0.768484 1.79923 0.668081 2.04168 0.668081 2.29448C0.668081 2.54728 0.768484 2.78973 0.947209 2.96851L3.97933 6.00197L0.945876 9.03409C0.76715 9.21288 0.666748 9.45533 0.666748 9.70812C0.666748 9.96092 0.76715 10.2034 0.945876 10.3822L1.61924 11.0555C1.79802 11.2342 2.04047 11.3346 2.29326 11.3346C2.54606 11.3346 2.78851 11.2342 2.96729 11.0555L6.00075 8.02338L9.03287 11.0555C9.21165 11.2342 9.4541 11.3346 9.7069 11.3346C9.95969 11.3346 10.2021 11.2342 10.3809 11.0555L11.0543 10.3822C11.233 10.2034 11.3334 9.96092 11.3334 9.70812C11.3334 9.45533 11.233 9.21288 11.0543 9.03409L8.02216 6.00197Z" fill="#000910"/>
</svg>
