<svg width="7" height="10" viewBox="0 0 7 10" fill="none" xmlns="http://www.w3.org/2000/svg">
<path d="M0.185718 4.64164L5.61399 0.153584C5.86167 -0.0511946 6.25383 -0.0511946 6.48087 0.153584C6.72855 0.358362 6.72855 0.682594 6.48087 0.870307L1.48603 5L6.48087 9.12969C6.72854 9.33447 6.72854 9.6587 6.48087 9.84642C6.35703 9.9488 6.19191 10 6.04743 10C5.90295 10 5.73783 9.9488 5.61399 9.84642L0.185718 5.35836C-0.0619602 5.15358 -0.0619602 4.84642 0.185718 4.64164Z" fill="#000910"/>
</svg>
