﻿GENE PRODUCT DB	GENE PRODUCT ID	SYMBOL	QUALIFIER	GO TERM	GO NAME	ECO ID	GO EVIDENCE CODE	REFERENCE	WITH/FROM	TAXON ID	ASSIGNED BY	ANNOTATION EXTENSION	GO ASPECT
UniProtKB	O14455	RPL36B	part_of	GO:0022625	cytosolic large ribosomal subunit	ECO:0000318	IBA	PMID:21873635	PANTHER:PTN000012121|RGD:62085|SGD:S000004807|SGD:S000006438|UniProtKB:Q8I713|UniProtKB:Q9Y3U8	559292	GO_Central		C
UniProtKB	O14455	RPL36B	part_of	GO:0022625	cytosolic large ribosomal subunit	ECO:0000314	IDA	PMID:18782943		559292	SGD		C
UniProtKB	P02400	RPP2B	part_of	GO:0022625	cytosolic large ribosomal subunit	ECO:0000256	IEA	GO_REF:0000002	InterPro:IPR044076	559292	InterPro		C
UniProtKB	P02400	RPP2B	part_of	GO:0022625	cytosolic large ribosomal subunit	ECO:0000314	IDA	PMID:22096102		559292	SGD		C
UniProtKB	P02406	RPL28	part_of	GO:0022625	cytosolic large ribosomal subunit	ECO:0000318	IBA	PMID:21873635	PANTHER:PTN000197373|RGD:1309771|SGD:S000003071	559292	GO_Central		C
UniProtKB	P02406	RPL28	part_of	GO:0022625	cytosolic large ribosomal subunit	ECO:0000314	IDA	PMID:22096102		559292	SGD		C
UniProtKB	P02406	RPL28	located_in	GO:0022625	cytosolic large ribosomal subunit	ECO:0000353	IPI	PMID:10404161		559292	ComplexPortal		C
UniProtKB	P04449	RPL24A	part_of	GO:0022625	cytosolic large ribosomal subunit	ECO:0000318	IBA	PMID:21873635	PANTHER:PTN000082479|RGD:621191|SGD:S000002999|SGD:S000003380|UniProtKB:P83731	559292	GO_Central		C
UniProtKB	P04449	RPL24A	part_of	GO:0022625	cytosolic large ribosomal subunit	ECO:0000314	IDA	PMID:11983894		559292	SGD		C
UniProtKB	P04456	RPL25	part_of	GO:0022625	cytosolic large ribosomal subunit	ECO:0000318	IBA	PMID:21873635	PANTHER:PTN000178698|RGD:1304897|SGD:S000005487|UniProtKB:P0ADZ0|UniProtKB:Q8IE82	559292	GO_Central		C
UniProtKB	P04456	RPL25	part_of	GO:0022625	cytosolic large ribosomal subunit	ECO:0000314	IDA	PMID:11983894		559292	SGD		C
UniProtKB	P04650	RPL39	part_of	GO:0022625	cytosolic large ribosomal subunit	ECO:0000318	IBA	PMID:21873635	PANTHER:PTN000463054|RGD:3593|SGD:S000003725|UniProtKB:C0H4H3|UniProtKB:P62891	559292	GO_Central		C
UniProtKB	P04650	RPL39	part_of	GO:0022625	cytosolic large ribosomal subunit	ECO:0000314	IDA	PMID:11983894		559292	SGD		C
UniProtKB	P04650	RPL39	located_in	GO:0022625	cytosolic large ribosomal subunit	ECO:0000353	IPI	PMID:10404161		559292	ComplexPortal		C
UniProtKB	P05317	RPP0	part_of	GO:0022625	cytosolic large ribosomal subunit	ECO:0000318	IBA	PMID:21873635	PANTHER:PTN000474664|SGD:S000004332|UniProtKB:O24573|UniProtKB:P05388	559292	GO_Central		C
UniProtKB	P05317	RPP0	part_of	GO:0022625	cytosolic large ribosomal subunit	ECO:0000314	IDA	PMID:22096102		559292	SGD		C
UniProtKB	P05317	RPP0	located_in	GO:0022625	cytosolic large ribosomal subunit	ECO:0000353	IPI	PMID:10404161		559292	ComplexPortal		C
UniProtKB	P05318	RPP1A	part_of	GO:0022625	cytosolic large ribosomal subunit	ECO:0000318	IBA	PMID:21873635	PANTHER:PTN000474938|RGD:621774|SGD:S000002239|SGD:S000002288|UniProtKB:P05386|UniProtKB:P52855	559292	GO_Central		C
UniProtKB	P05318	RPP1A	part_of	GO:0022625	cytosolic large ribosomal subunit	ECO:0000314	IDA	PMID:22096102		559292	SGD		C
UniProtKB	P05319	RPP2A	part_of	GO:0022625	cytosolic large ribosomal subunit	ECO:0000256	IEA	GO_REF:0000002	InterPro:IPR044076	559292	InterPro		C
UniProtKB	P05319	RPP2A	part_of	GO:0022625	cytosolic large ribosomal subunit	ECO:0000314	IDA	PMID:22096102		559292	SGD		C
UniProtKB	P05737	RPL7A	part_of	GO:0022625	cytosolic large ribosomal subunit	ECO:0000318	IBA	PMID:21873635	MGI:MGI:98073|PANTHER:PTN000897517|RGD:735169|SGD:S000003044|SGD:S000006119	559292	GO_Central		C
UniProtKB	P05737	RPL7A	part_of	GO:0022625	cytosolic large ribosomal subunit	ECO:0000256	IEA	GO_REF:0000002	InterPro:IPR005998	559292	InterPro		C
UniProtKB	P05737	RPL7A	part_of	GO:0022625	cytosolic large ribosomal subunit	ECO:0000314	IDA	PMID:18782943		559292	SGD		C
UniProtKB	P05738	RPL9A	part_of	GO:0022625	cytosolic large ribosomal subunit	ECO:0000318	IBA	PMID:21873635	MGI:MGI:1298373|PANTHER:PTN000183647|RGD:62049|SGD:S000003115|SGD:S000005011	559292	GO_Central		C
UniProtKB	P05738	RPL9A	part_of	GO:0022625	cytosolic large ribosomal subunit	ECO:0000314	IDA	PMID:18782943		559292	SGD		C
UniProtKB	P05739	RPL6B	part_of	GO:0022625	cytosolic large ribosomal subunit	ECO:0000318	IBA	PMID:21873635	PANTHER:PTN000076315|RGD:619826|SGD:S000004440|SGD:S000004538|UniProtKB:Q02878	559292	GO_Central		C
UniProtKB	P05739	RPL6B	part_of	GO:0022625	cytosolic large ribosomal subunit	ECO:0000314	IDA	PMID:18782943		559292	SGD		C
UniProtKB	P05740	RPL17A	part_of	GO:0022625	cytosolic large ribosomal subunit	ECO:0000318	IBA	PMID:21873635	PANTHER:PTN000174131|RGD:1303019|SGD:S000001663|SGD:S000003713	559292	GO_Central		C
UniProtKB	P05740	RPL17A	part_of	GO:0022625	cytosolic large ribosomal subunit	ECO:0000314	IDA	PMID:18782943		559292	SGD		C
UniProtKB	P05743	RPL26A	part_of	GO:0022625	cytosolic large ribosomal subunit	ECO:0000318	IBA	PMID:21873635	PANTHER:PTN000124940|RGD:1310607|SGD:S000003266|SGD:S000004336	559292	GO_Central		C
UniProtKB	P05743	RPL26A	part_of	GO:0022625	cytosolic large ribosomal subunit	ECO:0000314	IDA	PMID:9672752		559292	SGD		C
UniProtKB	P05743	RPL26A	part_of	GO:0022625	cytosolic large ribosomal subunit	ECO:0000314	IDA	PMID:18782943		559292	SGD		C
UniProtKB	P05744	RPL33A	part_of	GO:0022625	cytosolic large ribosomal subunit	ECO:0000318	IBA	PMID:21873635	PANTHER:PTN000096770|RGD:628793|SGD:S000005760|SGD:S000006064	559292	GO_Central		C
UniProtKB	P05744	RPL33A	part_of	GO:0022625	cytosolic large ribosomal subunit	ECO:0000314	IDA	PMID:18782943		559292	SGD		C
UniProtKB	P05745	RPL36A	part_of	GO:0022625	cytosolic large ribosomal subunit	ECO:0000318	IBA	PMID:21873635	PANTHER:PTN000012121|RGD:62085|SGD:S000004807|SGD:S000006438|UniProtKB:Q8I713|UniProtKB:Q9Y3U8	559292	GO_Central		C
UniProtKB	P05745	RPL36A	part_of	GO:0022625	cytosolic large ribosomal subunit	ECO:0000314	IDA	PMID:18782943		559292	SGD		C
UniProtKB	P05747	RPL29	part_of	GO:0022625	cytosolic large ribosomal subunit	ECO:0000318	IBA	PMID:21873635	PANTHER:PTN000306390|RGD:62069|SGD:S000006437	559292	GO_Central		C
UniProtKB	P05747	RPL29	part_of	GO:0022625	cytosolic large ribosomal subunit	ECO:0000314	IDA	PMID:18782943		559292	SGD		C
UniProtKB	P05747	RPL29	located_in	GO:0022625	cytosolic large ribosomal subunit	ECO:0000353	IPI	PMID:10404161		559292	ComplexPortal		C
UniProtKB	P05748	RPL15A	part_of	GO:0022625	cytosolic large ribosomal subunit	ECO:0000318	IBA	PMID:21873635	PANTHER:PTN000217960|RGD:621181|SGD:S000004019|SGD:S000004728	559292	GO_Central		C
UniProtKB	P05748	RPL15A	part_of	GO:0022625	cytosolic large ribosomal subunit	ECO:0000314	IDA	PMID:6814480		559292	SGD		C
UniProtKB	P05749	RPL22A	part_of	GO:0022625	cytosolic large ribosomal subunit	ECO:0000314	IDA	PMID:6814480		559292	SGD		C
UniProtKB	P0C0W9	RPL11A	part_of	GO:0022625	cytosolic large ribosomal subunit	ECO:0000318	IBA	PMID:21873635	PANTHER:PTN000242048|RGD:1308681|SGD:S000003317|SGD:S000006306|UniProtKB:P62399|UniProtKB:P62913	559292	GO_Central		C
UniProtKB	P0C0W9	RPL11A	part_of	GO:0022625	cytosolic large ribosomal subunit	ECO:0000314	IDA	PMID:11983894		559292	SGD		C
UniProtKB	P0C2H6	RPL27A	part_of	GO:0022625	cytosolic large ribosomal subunit	ECO:0000318	IBA	PMID:21873635	PANTHER:PTN000052145|RGD:621192|SGD:S000001052|UniProtKB:Q8IKM5	559292	GO_Central		C
UniProtKB	P0C2H6	RPL27A	part_of	GO:0022625	cytosolic large ribosomal subunit	ECO:0000314	IDA	PMID:11983894		559292	SGD		C
UniProtKB	P0C2H7	RPL27B	part_of	GO:0022625	cytosolic large ribosomal subunit	ECO:0000318	IBA	PMID:21873635	PANTHER:PTN000052145|RGD:621192|SGD:S000001052|UniProtKB:Q8IKM5	559292	GO_Central		C
UniProtKB	P0C2H7	RPL27B	part_of	GO:0022625	cytosolic large ribosomal subunit	ECO:0000303	NAS	PMID:9559554		559292	SGD		C
UniProtKB	P0C2H8	RPL31A	part_of	GO:0022625	cytosolic large ribosomal subunit	ECO:0000318	IBA	PMID:21873635	PANTHER:PTN000102776|RGD:621202|SGD:S000002233|SGD:S000004398|UniProtKB:P62899|UniProtKB:Q8I463	559292	GO_Central		C
UniProtKB	P0C2H8	RPL31A	part_of	GO:0022625	cytosolic large ribosomal subunit	ECO:0000314	IDA	PMID:18782943		559292	SGD		C
UniProtKB	P0C2H9	RPL31B	part_of	GO:0022625	cytosolic large ribosomal subunit	ECO:0000318	IBA	PMID:21873635	PANTHER:PTN000102776|RGD:621202|SGD:S000002233|SGD:S000004398|UniProtKB:P62899|UniProtKB:Q8I463	559292	GO_Central		C
UniProtKB	P0C2H9	RPL31B	part_of	GO:0022625	cytosolic large ribosomal subunit	ECO:0000314	IDA	PMID:18782943		559292	SGD		C
UniProtKB	P0CH08	RPL40A	part_of	GO:0022625	cytosolic large ribosomal subunit	ECO:0000314	IDA	PMID:22096102		559292	SGD		C
UniProtKB	P0CH09	RPL40B	part_of	GO:0022625	cytosolic large ribosomal subunit	ECO:0000314	IDA	PMID:22096102		559292	SGD		C
UniProtKB	P0CX23	RPL20A	part_of	GO:0022625	cytosolic large ribosomal subunit	ECO:0000318	IBA	PMID:21873635	PANTHER:PTN000006274|RGD:1302976|SGD:S000004855|SGD:S000005839|UniProtKB:Q02543	559292	GO_Central		C
UniProtKB	P0CX23	RPL20A	part_of	GO:0022625	cytosolic large ribosomal subunit	ECO:0000314	IDA	PMID:23874617		559292	SGD		C
UniProtKB	P0CX24	RPL20B	part_of	GO:0022625	cytosolic large ribosomal subunit	ECO:0000318	IBA	PMID:21873635	PANTHER:PTN000006274|RGD:1302976|SGD:S000004855|SGD:S000005839|UniProtKB:Q02543	559292	GO_Central		C
UniProtKB	P0CX24	RPL20B	part_of	GO:0022625	cytosolic large ribosomal subunit	ECO:0000314	IDA	PMID:23874617		559292	SGD		C
UniProtKB	P0CX25	RPL43A	part_of	GO:0022625	cytosolic large ribosomal subunit	ECO:0000314	IDA	PMID:11983894		559292	SGD		C
UniProtKB	P0CX26	RPL43B	part_of	GO:0022625	cytosolic large ribosomal subunit	ECO:0000314	IDA	PMID:11983894		559292	SGD		C
UniProtKB	P0CX27	RPL42A	part_of	GO:0022625	cytosolic large ribosomal subunit	ECO:0000318	IBA	PMID:21873635	PANTHER:PTN000042522|RGD:621156|SGD:S000001183|SGD:S000005106|UniProtKB:P83881	559292	GO_Central		C
UniProtKB	P0CX27	RPL42A	part_of	GO:0022625	cytosolic large ribosomal subunit	ECO:0000314	IDA	PMID:11983894		559292	SGD		C
UniProtKB	P0CX28	RPL42B	part_of	GO:0022625	cytosolic large ribosomal subunit	ECO:0000318	IBA	PMID:21873635	PANTHER:PTN000042522|RGD:621156|SGD:S000001183|SGD:S000005106|UniProtKB:P83881	559292	GO_Central		C
UniProtKB	P0CX28	RPL42B	part_of	GO:0022625	cytosolic large ribosomal subunit	ECO:0000314	IDA	PMID:11983894		559292	SGD		C
UniProtKB	P0CX41	RPL23A	part_of	GO:0022625	cytosolic large ribosomal subunit	ECO:0000318	IBA	PMID:21873635	PANTHER:PTN000205184|RGD:62067|SGD:S000000183|SGD:S000000919|UniProtKB:P0ADY3	559292	GO_Central		C
UniProtKB	P0CX41	RPL23A	part_of	GO:0022625	cytosolic large ribosomal subunit	ECO:0000314	IDA	PMID:11983894		559292	SGD		C
UniProtKB	P0CX42	RPL23B	part_of	GO:0022625	cytosolic large ribosomal subunit	ECO:0000318	IBA	PMID:21873635	PANTHER:PTN000205184|RGD:62067|SGD:S000000183|SGD:S000000919|UniProtKB:P0ADY3	559292	GO_Central		C
UniProtKB	P0CX42	RPL23B	part_of	GO:0022625	cytosolic large ribosomal subunit	ECO:0000314	IDA	PMID:11983894		559292	SGD		C
UniProtKB	P0CX43	RPL1A	part_of	GO:0022625	cytosolic large ribosomal subunit	ECO:0000318	IBA	PMID:21873635	PANTHER:PTN000559990|RGD:1307586|RGD:620497|SGD:S000001025|SGD:S000003103|SGD:S000003968|SGD:S000006141|UniProtKB:P0A7L0|UniProtKB:P62906	559292	GO_Central		C
UniProtKB	P0CX43	RPL1A	part_of	GO:0022625	cytosolic large ribosomal subunit	ECO:0000314	IDA	PMID:11983894		559292	SGD		C
UniProtKB	P0CX44	RPL1B	part_of	GO:0022625	cytosolic large ribosomal subunit	ECO:0000318	IBA	PMID:21873635	PANTHER:PTN000559990|RGD:1307586|RGD:620497|SGD:S000001025|SGD:S000003103|SGD:S000003968|SGD:S000006141|UniProtKB:P0A7L0|UniProtKB:P62906	559292	GO_Central		C
UniProtKB	P0CX44	RPL1B	part_of	GO:0022625	cytosolic large ribosomal subunit	ECO:0000314	IDA	PMID:11983894		559292	SGD		C
UniProtKB	P0CX45	RPL2A	part_of	GO:0022625	cytosolic large ribosomal subunit	ECO:0000318	IBA	PMID:21873635	PANTHER:PTN000343558|RGD:619827|SGD:S000001280|SGD:S000002104|UniProtKB:P62917|UniProtKB:Q8I3T9	559292	GO_Central		C
UniProtKB	P0CX45	RPL2A	part_of	GO:0022625	cytosolic large ribosomal subunit	ECO:0000314	IDA	PMID:18782943		559292	SGD		C
UniProtKB	P0CX46	RPL2B	part_of	GO:0022625	cytosolic large ribosomal subunit	ECO:0000318	IBA	PMID:21873635	PANTHER:PTN000343558|RGD:619827|SGD:S000001280|SGD:S000002104|UniProtKB:P62917|UniProtKB:Q8I3T9	559292	GO_Central		C
UniProtKB	P0CX46	RPL2B	part_of	GO:0022625	cytosolic large ribosomal subunit	ECO:0000314	IDA	PMID:18782943		559292	SGD		C
UniProtKB	P0CX49	RPL18A	part_of	GO:0022625	cytosolic large ribosomal subunit	ECO:0000318	IBA	PMID:21873635	PANTHER:PTN000859219|RGD:621182|SGD:S000005245|SGD:S000005480|UniProtKB:Q07020	559292	GO_Central		C
UniProtKB	P0CX49	RPL18A	part_of	GO:0022625	cytosolic large ribosomal subunit	ECO:0000314	IDA	PMID:11983894		559292	SGD		C
UniProtKB	P0CX50	RPL18B	part_of	GO:0022625	cytosolic large ribosomal subunit	ECO:0000318	IBA	PMID:21873635	PANTHER:PTN000859219|RGD:621182|SGD:S000005245|SGD:S000005480|UniProtKB:Q07020	559292	GO_Central		C
UniProtKB	P0CX50	RPL18B	part_of	GO:0022625	cytosolic large ribosomal subunit	ECO:0000314	IDA	PMID:11983894		559292	SGD		C
UniProtKB	P0CX53	RPL12A	part_of	GO:0022625	cytosolic large ribosomal subunit	ECO:0000318	IBA	PMID:21873635	PANTHER:PTN000184010|RGD:1565106|SGD:S000000780|SGD:S000002826	559292	GO_Central		C
UniProtKB	P0CX53	RPL12A	part_of	GO:0022625	cytosolic large ribosomal subunit	ECO:0000314	IDA	PMID:11983894		559292	SGD		C
UniProtKB	P0CX54	RPL12B	part_of	GO:0022625	cytosolic large ribosomal subunit	ECO:0000318	IBA	PMID:21873635	PANTHER:PTN000184010|RGD:1565106|SGD:S000000780|SGD:S000002826	559292	GO_Central		C
UniProtKB	P0CX54	RPL12B	part_of	GO:0022625	cytosolic large ribosomal subunit	ECO:0000314	IDA	PMID:11983894		559292	SGD		C
UniProtKB	P0CX82	RPL19A	part_of	GO:0022625	cytosolic large ribosomal subunit	ECO:0000318	IBA	PMID:21873635	MGI:MGI:98020|PANTHER:PTN000076564|RGD:621183|SGD:S000000123|SGD:S000002156|UniProtKB:C6KSY6|UniProtKB:P84098	559292	GO_Central		C
UniProtKB	P0CX82	RPL19A	part_of	GO:0022625	cytosolic large ribosomal subunit	ECO:0000256	IEA	GO_REF:0000002	InterPro:IPR033935|InterPro:IPR039547	559292	InterPro		C
UniProtKB	P0CX82	RPL19A	part_of	GO:0022625	cytosolic large ribosomal subunit	ECO:0000314	IDA	PMID:11983894		559292	SGD		C
UniProtKB	P0CX83	RPL19B	part_of	GO:0022625	cytosolic large ribosomal subunit	ECO:0000318	IBA	PMID:21873635	MGI:MGI:98020|PANTHER:PTN000076564|RGD:621183|SGD:S000000123|SGD:S000002156|UniProtKB:C6KSY6|UniProtKB:P84098	559292	GO_Central		C
UniProtKB	P0CX83	RPL19B	part_of	GO:0022625	cytosolic large ribosomal subunit	ECO:0000256	IEA	GO_REF:0000002	InterPro:IPR033935|InterPro:IPR039547	559292	InterPro		C
UniProtKB	P0CX83	RPL19B	part_of	GO:0022625	cytosolic large ribosomal subunit	ECO:0000314	IDA	PMID:11983894		559292	SGD		C
UniProtKB	P0CX84	RPL35A	part_of	GO:0022625	cytosolic large ribosomal subunit	ECO:0000318	IBA	PMID:21873635	PANTHER:PTN000356124|RGD:1303007|SGD:S000002295|SGD:S000002350	559292	GO_Central		C
UniProtKB	P0CX84	RPL35A	part_of	GO:0022625	cytosolic large ribosomal subunit	ECO:0000256	IEA	GO_REF:0000002	InterPro:IPR045059	559292	InterPro		C
UniProtKB	P0CX84	RPL35A	part_of	GO:0022625	cytosolic large ribosomal subunit	ECO:0000314	IDA	PMID:11983894		559292	SGD		C
UniProtKB	P0CX85	RPL35B	part_of	GO:0022625	cytosolic large ribosomal subunit	ECO:0000318	IBA	PMID:21873635	PANTHER:PTN000356124|RGD:1303007|SGD:S000002295|SGD:S000002350	559292	GO_Central		C
UniProtKB	P0CX85	RPL35B	part_of	GO:0022625	cytosolic large ribosomal subunit	ECO:0000256	IEA	GO_REF:0000002	InterPro:IPR045059	559292	InterPro		C
UniProtKB	P0CX85	RPL35B	part_of	GO:0022625	cytosolic large ribosomal subunit	ECO:0000314	IDA	PMID:11983894		559292	SGD		C
UniProtKB	P0CX86	RPL41A	part_of	GO:0022625	cytosolic large ribosomal subunit	ECO:0000314	IDA	PMID:18782943		559292	SGD		C
UniProtKB	P0CX87	RPL41B	part_of	GO:0022625	cytosolic large ribosomal subunit	ECO:0000314	IDA	PMID:18782943		559292	SGD		C
UniProtKB	P10622	RPP1B	part_of	GO:0022625	cytosolic large ribosomal subunit	ECO:0000318	IBA	PMID:21873635	PANTHER:PTN000474938|RGD:621774|SGD:S000002239|SGD:S000002288|UniProtKB:P05386|UniProtKB:P52855	559292	GO_Central		C
UniProtKB	P10622	RPP1B	part_of	GO:0022625	cytosolic large ribosomal subunit	ECO:0000314	IDA	PMID:22096102		559292	SGD		C
UniProtKB	P10664	RPL4A	part_of	GO:0022625	cytosolic large ribosomal subunit	ECO:0000318	IBA	PMID:21873635	PANTHER:PTN000454620|RGD:619824|SGD:S000000235|SGD:S000002419|UniProtKB:Q8I431	559292	GO_Central		C
UniProtKB	P10664	RPL4A	part_of	GO:0022625	cytosolic large ribosomal subunit	ECO:0000314	IDA	PMID:11983894		559292	SGD		C
UniProtKB	P14120	RPL30	part_of	GO:0022625	cytosolic large ribosomal subunit	ECO:0000318	IBA	PMID:21873635	PANTHER:PTN000154874|RGD:621201|SGD:S000002998|UniProtKB:P62888	559292	GO_Central		C
UniProtKB	P14120	RPL30	part_of	GO:0022625	cytosolic large ribosomal subunit	ECO:0000314	IDA	PMID:22096102		559292	SGD		C
UniProtKB	P14120	RPL30	located_in	GO:0022625	cytosolic large ribosomal subunit	ECO:0000353	IPI	PMID:10404161		559292	ComplexPortal		C
UniProtKB	P14126	RPL3	part_of	GO:0022625	cytosolic large ribosomal subunit	ECO:0000318	IBA	PMID:21873635	PANTHER:PTN000146039|RGD:735105|SGD:S000005589|UniProtKB:Q8IJC6	559292	GO_Central		C
UniProtKB	P14126	RPL3	part_of	GO:0022625	cytosolic large ribosomal subunit	ECO:0000314	IDA	PMID:11983894		559292	SGD		C
UniProtKB	P14126	RPL3	located_in	GO:0022625	cytosolic large ribosomal subunit	ECO:0000353	IPI	PMID:10404161		559292	ComplexPortal		C
UniProtKB	P17076	RPL8A	part_of	GO:0022625	cytosolic large ribosomal subunit	ECO:0000318	IBA	PMID:21873635	PANTHER:PTN000559990|RGD:1307586|RGD:620497|SGD:S000001025|SGD:S000003103|SGD:S000003968|SGD:S000006141|UniProtKB:P0A7L0|UniProtKB:P62906	559292	GO_Central		C
UniProtKB	P17076	RPL8A	part_of	GO:0022625	cytosolic large ribosomal subunit	ECO:0000314	IDA	PMID:11983894		559292	SGD		C
UniProtKB	P24000	RPL24B	part_of	GO:0022625	cytosolic large ribosomal subunit	ECO:0000318	IBA	PMID:21873635	PANTHER:PTN000082479|RGD:621191|SGD:S000002999|SGD:S000003380|UniProtKB:P83731	559292	GO_Central		C
UniProtKB	P24000	RPL24B	part_of	GO:0022625	cytosolic large ribosomal subunit	ECO:0000314	IDA	PMID:11983894		559292	SGD		C
UniProtKB	P26321	RPL5	part_of	GO:0022625	cytosolic large ribosomal subunit	ECO:0000318	IBA	PMID:21873635	PANTHER:PTN000601661|RGD:619825|SGD:S000006052	559292	GO_Central		C
UniProtKB	P26321	RPL5	part_of	GO:0022625	cytosolic large ribosomal subunit	ECO:0000314	IDA	PMID:11983894		559292	SGD		C
UniProtKB	P26321	RPL5	located_in	GO:0022625	cytosolic large ribosomal subunit	ECO:0000353	IPI	PMID:10404161		559292	ComplexPortal		C
UniProtKB	P26784	RPL16A	part_of	GO:0022625	cytosolic large ribosomal subunit	ECO:0000318	IBA	PMID:21873635	PANTHER:PTN000166703|RGD:628697|SGD:S000001395|SGD:S000005013	559292	GO_Central		C
UniProtKB	P26784	RPL16A	part_of	GO:0022625	cytosolic large ribosomal subunit	ECO:0000314	IDA	PMID:11983894		559292	SGD		C
UniProtKB	P26785	RPL16B	part_of	GO:0022625	cytosolic large ribosomal subunit	ECO:0000318	IBA	PMID:21873635	PANTHER:PTN000166703|RGD:628697|SGD:S000001395|SGD:S000005013	559292	GO_Central		C
UniProtKB	P26785	RPL16B	part_of	GO:0022625	cytosolic large ribosomal subunit	ECO:0000314	IDA	PMID:11983894		559292	SGD		C
UniProtKB	P29453	RPL8B	part_of	GO:0022625	cytosolic large ribosomal subunit	ECO:0000318	IBA	PMID:21873635	PANTHER:PTN000559990|RGD:1307586|RGD:620497|SGD:S000001025|SGD:S000003103|SGD:S000003968|SGD:S000006141|UniProtKB:P0A7L0|UniProtKB:P62906	559292	GO_Central		C
UniProtKB	P29453	RPL8B	part_of	GO:0022625	cytosolic large ribosomal subunit	ECO:0000314	IDA	PMID:11983894		559292	SGD		C
UniProtKB	P36105	RPL14A	part_of	GO:0022625	cytosolic large ribosomal subunit	ECO:0000318	IBA	PMID:21873635	PANTHER:PTN000874665|RGD:621180|SGD:S000000993|SGD:S000001489	559292	GO_Central		C
UniProtKB	P36105	RPL14A	part_of	GO:0022625	cytosolic large ribosomal subunit	ECO:0000314	IDA	PMID:11983894		559292	SGD		C
UniProtKB	P36519	MRPL7	part_of	GO:0022625	cytosolic large ribosomal subunit	ECO:0000318	IBA	PMID:21873635	PANTHER:PTN000242048|RGD:1308681|SGD:S000003317|SGD:S000006306|UniProtKB:P62399|UniProtKB:P62913	559292	GO_Central		C
UniProtKB	P38061	RPL32	part_of	GO:0022625	cytosolic large ribosomal subunit	ECO:0000318	IBA	PMID:21873635	MGI:MGI:98038|PANTHER:PTN000601894|RGD:621203|SGD:S000000188|UniProtKB:A0A1D8PPN6|UniProtKB:P62910|UniProtKB:Q8I3B0	559292	GO_Central		C
UniProtKB	P38061	RPL32	part_of	GO:0022625	cytosolic large ribosomal subunit	ECO:0000314	IDA	PMID:11983894		559292	SGD		C
UniProtKB	P38061	RPL32	located_in	GO:0022625	cytosolic large ribosomal subunit	ECO:0000353	IPI	PMID:10404161		559292	ComplexPortal		C
UniProtKB	P38754	RPL14B	part_of	GO:0022625	cytosolic large ribosomal subunit	ECO:0000318	IBA	PMID:21873635	PANTHER:PTN000874665|RGD:621180|SGD:S000000993|SGD:S000001489	559292	GO_Central		C
UniProtKB	P38754	RPL14B	part_of	GO:0022625	cytosolic large ribosomal subunit	ECO:0000314	IDA	PMID:11983894		559292	SGD		C
UniProtKB	P40212	RPL13B	part_of	GO:0022625	cytosolic large ribosomal subunit	ECO:0000318	IBA	PMID:21873635	PANTHER:PTN000197497|RGD:621179|SGD:S000002240|SGD:S000004750	559292	GO_Central		C
UniProtKB	P40212	RPL13B	part_of	GO:0022625	cytosolic large ribosomal subunit	ECO:0000314	IDA	PMID:11983894		559292	SGD		C
UniProtKB	P40525	RPL34B	part_of	GO:0022625	cytosolic large ribosomal subunit	ECO:0000318	IBA	PMID:21873635	PANTHER:PTN000079601|SGD:S000001314|UniProtKB:Q8IBY4	559292	GO_Central		C
UniProtKB	P40525	RPL34B	part_of	GO:0022625	cytosolic large ribosomal subunit	ECO:0000314	IDA	PMID:11983894		559292	SGD		C
UniProtKB	P40693	RLP7	part_of	GO:0022625	cytosolic large ribosomal subunit	ECO:0000318	IBA	PMID:21873635	MGI:MGI:98073|PANTHER:PTN000897517|RGD:735169|SGD:S000003044|SGD:S000006119	559292	GO_Central		C
UniProtKB	P41056	RPL33B	part_of	GO:0022625	cytosolic large ribosomal subunit	ECO:0000318	IBA	PMID:21873635	PANTHER:PTN000096770|RGD:628793|SGD:S000005760|SGD:S000006064	559292	GO_Central		C
UniProtKB	P41056	RPL33B	part_of	GO:0022625	cytosolic large ribosomal subunit	ECO:0000314	IDA	PMID:18782943		559292	SGD		C
UniProtKB	P41805	RPL10	part_of	GO:0022625	cytosolic large ribosomal subunit	ECO:0000318	IBA	PMID:21873635	MGI:MGI:3647985|PANTHER:PTN000197715|RGD:621178|SGD:S000004065|UniProtKB:P27635	559292	GO_Central		C
UniProtKB	P41805	RPL10	part_of	GO:0022625	cytosolic large ribosomal subunit	ECO:0000314	IDA	PMID:11983894		559292	SGD		C
UniProtKB	P41805	RPL10	located_in	GO:0022625	cytosolic large ribosomal subunit	ECO:0000353	IPI	PMID:10404161		559292	ComplexPortal		C
UniProtKB	P46990	RPL17B	part_of	GO:0022625	cytosolic large ribosomal subunit	ECO:0000318	IBA	PMID:21873635	PANTHER:PTN000174131|RGD:1303019|SGD:S000001663|SGD:S000003713	559292	GO_Central		C
UniProtKB	P46990	RPL17B	part_of	GO:0022625	cytosolic large ribosomal subunit	ECO:0000314	IDA	PMID:18782943		559292	SGD		C
UniProtKB	P49166	RPL37A	part_of	GO:0022625	cytosolic large ribosomal subunit	ECO:0000318	IBA	PMID:21873635	PANTHER:PTN000080456|RGD:621204|SGD:S000002908|SGD:S000004175|UniProtKB:C0H4L5	559292	GO_Central		C
UniProtKB	P49166	RPL37A	part_of	GO:0022625	cytosolic large ribosomal subunit	ECO:0000314	IDA	PMID:11983894		559292	SGD		C
UniProtKB	P49167	RPL38	part_of	GO:0022625	cytosolic large ribosomal subunit	ECO:0000318	IBA	PMID:21873635	PANTHER:PTN000103359|RGD:1305573|SGD:S000004317|UniProtKB:P63173|UniProtKB:Q8II62	559292	GO_Central		C
UniProtKB	P49167	RPL38	part_of	GO:0022625	cytosolic large ribosomal subunit	ECO:0000314	IDA	PMID:11983894		559292	SGD		C
UniProtKB	P49167	RPL38	located_in	GO:0022625	cytosolic large ribosomal subunit	ECO:0000353	IPI	PMID:10404161		559292	ComplexPortal		C
UniProtKB	P49626	RPL4B	part_of	GO:0022625	cytosolic large ribosomal subunit	ECO:0000318	IBA	PMID:21873635	PANTHER:PTN000454620|RGD:619824|SGD:S000000235|SGD:S000002419|UniProtKB:Q8I431	559292	GO_Central		C
UniProtKB	P49626	RPL4B	part_of	GO:0022625	cytosolic large ribosomal subunit	ECO:0000314	IDA	PMID:22096102		559292	SGD		C
UniProtKB	P51401	RPL9B	part_of	GO:0022625	cytosolic large ribosomal subunit	ECO:0000318	IBA	PMID:21873635	MGI:MGI:1298373|PANTHER:PTN000183647|RGD:62049|SGD:S000003115|SGD:S000005011	559292	GO_Central		C
UniProtKB	P51401	RPL9B	part_of	GO:0022625	cytosolic large ribosomal subunit	ECO:0000314	IDA	PMID:18782943		559292	SGD		C
UniProtKB	P51402	RPL37B	part_of	GO:0022625	cytosolic large ribosomal subunit	ECO:0000318	IBA	PMID:21873635	PANTHER:PTN000080456|RGD:621204|SGD:S000002908|SGD:S000004175|UniProtKB:C0H4L5	559292	GO_Central		C
UniProtKB	P51402	RPL37B	part_of	GO:0022625	cytosolic large ribosomal subunit	ECO:0000314	IDA	PMID:11983894		559292	SGD		C
UniProtKB	P53145	LSG1	part_of	GO:0022625	cytosolic large ribosomal subunit	ECO:0000314	IDA	PMID:12773575		559292	SGD		C
UniProtKB	P53221	RPL26B	part_of	GO:0022625	cytosolic large ribosomal subunit	ECO:0000318	IBA	PMID:21873635	PANTHER:PTN000124940|RGD:1310607|SGD:S000003266|SGD:S000004336	559292	GO_Central		C
UniProtKB	P53221	RPL26B	part_of	GO:0022625	cytosolic large ribosomal subunit	ECO:0000314	IDA	PMID:18782943		559292	SGD		C
UniProtKB	P54780	RPL15B	part_of	GO:0022625	cytosolic large ribosomal subunit	ECO:0000318	IBA	PMID:21873635	PANTHER:PTN000217960|RGD:621181|SGD:S000004019|SGD:S000004728	559292	GO_Central		C
UniProtKB	P54780	RPL15B	part_of	GO:0022625	cytosolic large ribosomal subunit	ECO:0000314	IDA	PMID:6814480		559292	SGD		C
UniProtKB	P56628	RPL22B	part_of	GO:0022625	cytosolic large ribosomal subunit	ECO:0000314	IDA	PMID:6814480		559292	SGD		C
UniProtKB	P87262	RPL34A	part_of	GO:0022625	cytosolic large ribosomal subunit	ECO:0000318	IBA	PMID:21873635	PANTHER:PTN000079601|SGD:S000001314|UniProtKB:Q8IBY4	559292	GO_Central		C
UniProtKB	Q02326	RPL6A	part_of	GO:0022625	cytosolic large ribosomal subunit	ECO:0000318	IBA	PMID:21873635	PANTHER:PTN000076315|RGD:619826|SGD:S000004440|SGD:S000004538|UniProtKB:Q02878	559292	GO_Central		C
UniProtKB	Q02326	RPL6A	part_of	GO:0022625	cytosolic large ribosomal subunit	ECO:0000314	IDA	PMID:18782943		559292	SGD		C
UniProtKB	Q02753	RPL21A	part_of	GO:0022625	cytosolic large ribosomal subunit	ECO:0000318	IBA	PMID:21873635	PANTHER:PTN001463935|RGD:68390|SGD:S000000395|SGD:S000006000|UniProtKB:Q8ILK3	559292	GO_Central		C
UniProtKB	Q02753	RPL21A	part_of	GO:0022625	cytosolic large ribosomal subunit	ECO:0000314	IDA	PMID:11983894		559292	SGD		C
UniProtKB	Q12213	RPL7B	part_of	GO:0022625	cytosolic large ribosomal subunit	ECO:0000318	IBA	PMID:21873635	MGI:MGI:98073|PANTHER:PTN000897517|RGD:735169|SGD:S000003044|SGD:S000006119	559292	GO_Central		C
UniProtKB	Q12213	RPL7B	part_of	GO:0022625	cytosolic large ribosomal subunit	ECO:0000256	IEA	GO_REF:0000002	InterPro:IPR005998	559292	InterPro		C
UniProtKB	Q12213	RPL7B	part_of	GO:0022625	cytosolic large ribosomal subunit	ECO:0000314	IDA	PMID:23874617		559292	SGD		C
UniProtKB	Q12672	RPL21B	part_of	GO:0022625	cytosolic large ribosomal subunit	ECO:0000318	IBA	PMID:21873635	PANTHER:PTN001463935|RGD:68390|SGD:S000000395|SGD:S000006000|UniProtKB:Q8ILK3	559292	GO_Central		C
UniProtKB	Q12672	RPL21B	part_of	GO:0022625	cytosolic large ribosomal subunit	ECO:0000314	IDA	PMID:11983894		559292	SGD		C
UniProtKB	Q12690	RPL13A	part_of	GO:0022625	cytosolic large ribosomal subunit	ECO:0000318	IBA	PMID:21873635	PANTHER:PTN000197497|RGD:621179|SGD:S000002240|SGD:S000004750	559292	GO_Central		C
UniProtKB	Q12690	RPL13A	part_of	GO:0022625	cytosolic large ribosomal subunit	ECO:0000314	IDA	PMID:11983894		559292	SGD		C
UniProtKB	Q3E757	RPL11B	part_of	GO:0022625	cytosolic large ribosomal subunit	ECO:0000318	IBA	PMID:21873635	PANTHER:PTN000242048|RGD:1308681|SGD:S000003317|SGD:S000006306|UniProtKB:P62399|UniProtKB:P62913	559292	GO_Central		C
UniProtKB	Q3E757	RPL11B	part_of	GO:0022625	cytosolic large ribosomal subunit	ECO:0000314	IDA	PMID:11983894		559292	SGD		C
RNAcentral	URS00001BF64E_559292	Saccharomyces cerevisiae S288C 5.8S ribosomal RNA	part_of	GO:0022625	cytosolic large ribosomal subunit	ECO:0000304	TAS	PMID:10690410		559292	SGD		C
RNAcentral	URS000055688D_559292	Saccharomyces cerevisiae S288C 5S ribosomal RNA	part_of	GO:0022625	cytosolic large ribosomal subunit	ECO:0000314	IDA	PMID:16047201		559292	SGD		C
RNAcentral	URS000057ABFB_559292	Saccharomyces cerevisiae S288C 5S ribosomal RNA	part_of	GO:0022625	cytosolic large ribosomal subunit	ECO:0000314	IDA	PMID:16047201		559292	SGD		C
RNAcentral	URS000061F377_559292	Saccharomyces cerevisiae S288C 25S ribosomal RNA	part_of	GO:0022625	cytosolic large ribosomal subunit	ECO:0000304	TAS	PMID:10690410		559292	SGD		C
