,gene,protein,type,nucleotide change,protein change,impact,sample
1813,YGR119C,NUP57,missense,c.987T>A,p.His329Gln,MODERATE,D5
1814,YGR119C,NUP57,conservative inframe insertion,c.771_772insCAG,p.Leu257_Gln258insGln,MODERATE,D5
1815,YGR119C,NUP57,conservative inframe insertion,c.786_787insCAT,p.Gln262_Gln263insHis,MODERATE,D5
1816,YGR119C,NUP57,missense,c.490A>G,p.Ser164Gly,MODERATE,D5
1817,YGR119C,NUP57,missense,c.298A>G,p.Thr100Ala,MODERATE,D5
1818,YGR119C,NUP57,missense,c.987T>A,p.His329Gln,MODERATE,D6
1819,YGR119C,NUP57,conservative inframe insertion,c.771_772insCAG,p.Leu257_Gln258insGln,MODERATE,D6
1820,YGR119C,NUP57,conservative inframe insertion,c.788_789insGCT,p.Gln263_Gln264insLeu,MODERATE,D6
1821,YGR119C,NUP57,missense,c.490A>G,p.Ser164Gly,MODERATE,D6
1822,YGR119C,NUP57,missense,c.298A>G,p.Thr100Ala,MODERATE,D6
1823,YGR119C,NUP57,missense,c.987T>A,p.His329Gln,MODERATE,D7
1824,YGR119C,NUP57,conservative inframe insertion,c.789_790insCAA,p.Gln263dup,MODERATE,D7
1825,YGR119C,NUP57,conservative inframe insertion,c.771_772insCAG,p.Leu257_Gln258insGln,MODERATE,D7
1826,YGR119C,NUP57,missense,c.490A>G,p.Ser164Gly,MODERATE,D7
1827,YGR119C,NUP57,missense,c.298A>G,p.Thr100Ala,MODERATE,D7
1828,YGR119C,NUP57,missense,c.987T>A,p.His329Gln,MODERATE,D8
1829,YGR119C,NUP57,conservative inframe insertion,c.771_772insCAG,p.Leu257_Gln258insGln,MODERATE,D8
1830,YGR119C,NUP57,conservative inframe insertion,c.775_776insAGA,p.Gln259_Gln260insLys,MODERATE,D8
1831,YGR119C,NUP57,missense,c.490A>G,p.Ser164Gly,MODERATE,D8
1832,YGR119C,NUP57,missense,c.298A>G,p.Thr100Ala,MODERATE,D8
1875,YGR159C,NSR1,missense,c.1109G>A,p.Arg370His,MODERATE,D5
1876,YGR159C,NSR1,missense,c.241A>G,p.Lys81Glu,MODERATE,D5
1877,YGR159C,NSR1,conservative inframe insertion,c.161_162insATCTTC,p.Glu54_Ser55insSerSer,MODERATE,D5
1878,YGR159C,NSR1,missense,c.161A>C,p.Glu54Ala,MODERATE,D5
1879,YGR159C,NSR1,stop gained,c.160G>T,p.Glu54*,HIGH,D5
1880,YGR159C,NSR1,missense,c.1109G>A,p.Arg370His,MODERATE,D6
1881,YGR159C,NSR1,missense,c.241A>G,p.Lys81Glu,MODERATE,D6
1882,YGR159C,NSR1,conservative inframe insertion,c.161_162insATCTTC,p.Glu54_Ser55insSerSer,MODERATE,D6
1883,YGR159C,NSR1,conservative inframe insertion,c.174_175insTCTTCT,p.Ser57_Ser58dup,MODERATE,D6
1884,YGR159C,NSR1,missense,c.161A>C,p.Glu54Ala,MODERATE,D6
1885,YGR159C,NSR1,stop gained,c.160G>T,p.Glu54*,HIGH,D6
1886,YGR159C,NSR1,conservative inframe insertion,c.84_85insTCTTCCTCTTCCTCCGAATCTTCATCCTCATCTTCA,p.Val28_Ser29insSerSerSerSerSerGluSerSerSerSerSerSer,MODERATE,D6
1887,YGR159C,NSR1,missense,c.1109G>A,p.Arg370His,MODERATE,D7
1888,YGR159C,NSR1,missense,c.241A>G,p.Lys81Glu,MODERATE,D7
1889,YGR159C,NSR1,conservative inframe insertion,c.183_184insTCATCA,p.Ser60_Ser61dup,MODERATE,D7
1890,YGR159C,NSR1,conservative inframe insertion,c.161_162insATCTTC,p.Glu54_Ser55insSerSer,MODERATE,D7
1891,YGR159C,NSR1,missense,c.161A>C,p.Glu54Ala,MODERATE,D7
1892,YGR159C,NSR1,stop gained,c.160G>T,p.Glu54*,HIGH,D7
1893,YGR159C,NSR1,conservative inframe insertion,c.84_85insTCTTCCTCTTCCTCCGAATCTTCATCCTCATCTTCA,p.Val28_Ser29insSerSerSerSerSerGluSerSerSerSerSerSer,MODERATE,D7
1894,YGR159C,NSR1,missense,c.1109G>A,p.Arg370His,MODERATE,D8
1895,YGR159C,NSR1,missense,c.241A>G,p.Lys81Glu,MODERATE,D8
1896,YGR159C,NSR1,conservative inframe insertion,c.183_184insTCATCG,p.Ser60_Ser61dup,MODERATE,D8
1897,YGR159C,NSR1,conservative inframe insertion,c.161_162insATCTTC,p.Glu54_Ser55insSerSer,MODERATE,D8
1898,YGR159C,NSR1,missense,c.161A>C,p.Glu54Ala,MODERATE,D8
1899,YGR159C,NSR1,stop gained,c.160G>T,p.Glu54*,HIGH,D8
1900,YGR159C,NSR1,conservative inframe insertion,c.84_85insTCTTCCTCTTCCTCCGAATCTTCATCCTCATCTTCA,p.Val28_Ser29insSerSerSerSerSerGluSerSerSerSerSerSer,MODERATE,D8
3244,YKL014C,URB1,missense,c.5158A>G,p.Thr1720Ala,MODERATE,D5
3245,YKL014C,URB1,missense,c.4676C>T,p.Thr1559Ile,MODERATE,D5
3246,YKL014C,URB1,missense,c.4420G>T,p.Ala1474Ser,MODERATE,D5
3247,YKL014C,URB1,missense,c.4312G>A,p.Val1438Ile,MODERATE,D5
3248,YKL014C,URB1,missense,c.3680T>A,p.Ile1227Asn,MODERATE,D5
3249,YKL014C,URB1,missense,c.3475C>A,p.His1159Asn,MODERATE,D5
3250,YKL014C,URB1,missense,c.3245C>T,p.Ser1082Phe,MODERATE,D5
3251,YKL014C,URB1,missense,c.2735A>G,p.Gln912Arg,MODERATE,D5
3252,YKL014C,URB1,missense,c.2578G>A,p.Ala860Thr,MODERATE,D5
3253,YKL014C,URB1,missense,c.1507G>A,p.Ala503Thr,MODERATE,D5
3254,YKL014C,URB1,missense,c.1397C>T,p.Thr466Ile,MODERATE,D5
3255,YKL014C,URB1,missense,c.1114A>G,p.Ile372Val,MODERATE,D5
3256,YKL014C,URB1,missense,c.937G>A,p.Val313Ile,MODERATE,D5
3257,YKL014C,URB1,missense,c.565T>A,p.Leu189Ile,MODERATE,D5
3258,YKL014C,URB1,missense,c.443A>T,p.His148Leu,MODERATE,D5
3259,YKL014C,URB1,missense,c.61G>A,p.Gly21Arg,MODERATE,D5
3260,YKL014C,URB1,missense,c.5158A>G,p.Thr1720Ala,MODERATE,D6
3261,YKL014C,URB1,missense,c.4676C>T,p.Thr1559Ile,MODERATE,D6
3262,YKL014C,URB1,missense,c.4420G>T,p.Ala1474Ser,MODERATE,D6
3263,YKL014C,URB1,missense,c.4312G>A,p.Val1438Ile,MODERATE,D6
3264,YKL014C,URB1,missense,c.3680T>A,p.Ile1227Asn,MODERATE,D6
3265,YKL014C,URB1,missense,c.3475C>A,p.His1159Asn,MODERATE,D6
3266,YKL014C,URB1,missense,c.3245C>T,p.Ser1082Phe,MODERATE,D6
3267,YKL014C,URB1,missense,c.2735A>G,p.Gln912Arg,MODERATE,D6
3268,YKL014C,URB1,missense,c.2578G>A,p.Ala860Thr,MODERATE,D6
3269,YKL014C,URB1,missense,c.1507G>A,p.Ala503Thr,MODERATE,D6
3270,YKL014C,URB1,missense,c.1397C>T,p.Thr466Ile,MODERATE,D6
3271,YKL014C,URB1,missense,c.1114A>G,p.Ile372Val,MODERATE,D6
3272,YKL014C,URB1,missense,c.937G>A,p.Val313Ile,MODERATE,D6
3273,YKL014C,URB1,missense,c.565T>A,p.Leu189Ile,MODERATE,D6
3274,YKL014C,URB1,missense,c.443A>T,p.His148Leu,MODERATE,D6
3275,YKL014C,URB1,missense,c.61G>A,p.Gly21Arg,MODERATE,D6
3276,YKL014C,URB1,missense,c.5158A>G,p.Thr1720Ala,MODERATE,D7
3277,YKL014C,URB1,missense,c.4676C>T,p.Thr1559Ile,MODERATE,D7
3278,YKL014C,URB1,missense,c.4420G>T,p.Ala1474Ser,MODERATE,D7
3279,YKL014C,URB1,missense,c.4312G>A,p.Val1438Ile,MODERATE,D7
3280,YKL014C,URB1,missense,c.3680T>A,p.Ile1227Asn,MODERATE,D7
3281,YKL014C,URB1,missense,c.3475C>A,p.His1159Asn,MODERATE,D7
3282,YKL014C,URB1,missense,c.3245C>T,p.Ser1082Phe,MODERATE,D7
3283,YKL014C,URB1,missense,c.2735A>G,p.Gln912Arg,MODERATE,D7
3284,YKL014C,URB1,missense,c.2578G>A,p.Ala860Thr,MODERATE,D7
3285,YKL014C,URB1,missense,c.1507G>A,p.Ala503Thr,MODERATE,D7
3286,YKL014C,URB1,missense,c.1397C>T,p.Thr466Ile,MODERATE,D7
3287,YKL014C,URB1,missense,c.1114A>G,p.Ile372Val,MODERATE,D7
3288,YKL014C,URB1,missense,c.937G>A,p.Val313Ile,MODERATE,D7
3289,YKL014C,URB1,missense,c.565T>A,p.Leu189Ile,MODERATE,D7
3290,YKL014C,URB1,missense,c.443A>T,p.His148Leu,MODERATE,D7
3291,YKL014C,URB1,missense,c.61G>A,p.Gly21Arg,MODERATE,D7
3292,YKL014C,URB1,missense,c.5158A>G,p.Thr1720Ala,MODERATE,D8
3293,YKL014C,URB1,missense,c.4676C>T,p.Thr1559Ile,MODERATE,D8
3294,YKL014C,URB1,missense,c.4420G>T,p.Ala1474Ser,MODERATE,D8
3295,YKL014C,URB1,missense,c.4312G>A,p.Val1438Ile,MODERATE,D8
3296,YKL014C,URB1,missense,c.3680T>A,p.Ile1227Asn,MODERATE,D8
3297,YKL014C,URB1,missense,c.3475C>A,p.His1159Asn,MODERATE,D8
3298,YKL014C,URB1,missense,c.3245C>T,p.Ser1082Phe,MODERATE,D8
3299,YKL014C,URB1,missense,c.2735A>G,p.Gln912Arg,MODERATE,D8
3300,YKL014C,URB1,missense,c.2578G>A,p.Ala860Thr,MODERATE,D8
3301,YKL014C,URB1,missense,c.1507G>A,p.Ala503Thr,MODERATE,D8
3302,YKL014C,URB1,missense,c.1397C>T,p.Thr466Ile,MODERATE,D8
3303,YKL014C,URB1,missense,c.1114A>G,p.Ile372Val,MODERATE,D8
3304,YKL014C,URB1,missense,c.937G>A,p.Val313Ile,MODERATE,D8
3305,YKL014C,URB1,missense,c.565T>A,p.Leu189Ile,MODERATE,D8
3306,YKL014C,URB1,missense,c.443A>T,p.His148Leu,MODERATE,D8
3307,YKL014C,URB1,missense,c.61G>A,p.Gly21Arg,MODERATE,D8
3856,YKR063C,LAS1,missense,c.1078A>C,p.Ile360Leu,MODERATE,D5
3857,YKR063C,LAS1,conservative inframe insertion,c.519_520insGAT,p.Asp173dup,MODERATE,D5
3858,YKR063C,LAS1,conservative inframe insertion,c.515_516insTGC,p.Asp172_Asp173insAla,MODERATE,D5
3859,YKR063C,LAS1,missense,c.217G>A,p.Ala73Thr,MODERATE,D5
3860,YKR063C,LAS1,missense,c.97A>C,p.Lys33Gln,MODERATE,D5
3861,YKR063C,LAS1,missense,c.1078A>C,p.Ile360Leu,MODERATE,D6
3862,YKR063C,LAS1,conservative inframe insertion,c.519_520insGAT,p.Asp173dup,MODERATE,D6
3863,YKR063C,LAS1,conservative inframe insertion,c.522_523insGAC,p.Asp174dup,MODERATE,D6
3864,YKR063C,LAS1,conservative inframe insertion,c.520_521insATA,p.Asp174_Asp175insAsn,MODERATE,D6
3865,YKR063C,LAS1,conservative inframe insertion,c.507_508insAAT,p.Arg169_Asp170insAsn,MODERATE,D6
3866,YKR063C,LAS1,missense,c.217G>A,p.Ala73Thr,MODERATE,D6
3867,YKR063C,LAS1,missense,c.97A>C,p.Lys33Gln,MODERATE,D6
3868,YKR063C,LAS1,missense,c.1078A>C,p.Ile360Leu,MODERATE,D7
3869,YKR063C,LAS1,conservative inframe insertion,c.519_520insGAT,p.Asp173dup,MODERATE,D7
3870,YKR063C,LAS1,conservative inframe insertion,c.523_524insATC,p.Asp175_Asp176insHis,MODERATE,D7
3871,YKR063C,LAS1,missense,c.217G>A,p.Ala73Thr,MODERATE,D7
3872,YKR063C,LAS1,missense,c.97A>C,p.Lys33Gln,MODERATE,D7
3873,YKR063C,LAS1,missense,c.1078A>C,p.Ile360Leu,MODERATE,D8
3874,YKR063C,LAS1,conservative inframe insertion,c.519_520insGAT,p.Asp173dup,MODERATE,D8
3875,YKR063C,LAS1,missense,c.217G>A,p.Ala73Thr,MODERATE,D8
3876,YKR063C,LAS1,missense,c.97A>C,p.Lys33Gln,MODERATE,D8
4020,YKR082W,NUP133,missense,c.1362T>G,p.Asp454Glu,MODERATE,D5
4021,YKR082W,NUP133,missense,c.1894A>G,p.Lys632Glu,MODERATE,D5
4022,YKR082W,NUP133,missense,c.2011A>G,p.Asn671Asp,MODERATE,D5
4023,YKR082W,NUP133,missense,c.2119C>T,p.Pro707Ser,MODERATE,D5
4024,YKR082W,NUP133,missense,c.2693A>G,p.Asp898Gly,MODERATE,D5
4025,YKR082W,NUP133,missense,c.3149C>A,p.Ala1050Asp,MODERATE,D5
4026,YKR082W,NUP133,missense,c.3176A>G,p.Gln1059Arg,MODERATE,D5
4027,YKR082W,NUP133,missense,c.3377A>G,p.Asp1126Gly,MODERATE,D5
4028,YKR082W,NUP133,missense,c.1362T>G,p.Asp454Glu,MODERATE,D6
4029,YKR082W,NUP133,missense,c.1894A>G,p.Lys632Glu,MODERATE,D6
4030,YKR082W,NUP133,missense,c.2011A>G,p.Asn671Asp,MODERATE,D6
4031,YKR082W,NUP133,missense,c.2119C>T,p.Pro707Ser,MODERATE,D6
4032,YKR082W,NUP133,missense,c.2693A>G,p.Asp898Gly,MODERATE,D6
4033,YKR082W,NUP133,missense,c.3149C>A,p.Ala1050Asp,MODERATE,D6
4034,YKR082W,NUP133,missense,c.3176A>G,p.Gln1059Arg,MODERATE,D6
4035,YKR082W,NUP133,missense,c.3377A>G,p.Asp1126Gly,MODERATE,D6
4036,YKR082W,NUP133,missense,c.1362T>G,p.Asp454Glu,MODERATE,D7
4037,YKR082W,NUP133,missense,c.1894A>G,p.Lys632Glu,MODERATE,D7
4038,YKR082W,NUP133,missense,c.2011A>G,p.Asn671Asp,MODERATE,D7
4039,YKR082W,NUP133,missense,c.2119C>T,p.Pro707Ser,MODERATE,D7
4040,YKR082W,NUP133,missense,c.2693A>G,p.Asp898Gly,MODERATE,D7
4041,YKR082W,NUP133,missense,c.3149C>A,p.Ala1050Asp,MODERATE,D7
4042,YKR082W,NUP133,missense,c.3176A>G,p.Gln1059Arg,MODERATE,D7
4043,YKR082W,NUP133,missense,c.3377A>G,p.Asp1126Gly,MODERATE,D7
4044,YKR082W,NUP133,missense,c.1362T>G,p.Asp454Glu,MODERATE,D8
4045,YKR082W,NUP133,missense,c.1894A>G,p.Lys632Glu,MODERATE,D8
4046,YKR082W,NUP133,missense,c.2011A>G,p.Asn671Asp,MODERATE,D8
4047,YKR082W,NUP133,missense,c.2119C>T,p.Pro707Ser,MODERATE,D8
4048,YKR082W,NUP133,missense,c.2693A>G,p.Asp898Gly,MODERATE,D8
4049,YKR082W,NUP133,missense,c.3149C>A,p.Ala1050Asp,MODERATE,D8
4050,YKR082W,NUP133,missense,c.3176A>G,p.Gln1059Arg,MODERATE,D8
4051,YKR082W,NUP133,missense,c.3377A>G,p.Asp1126Gly,MODERATE,D8
4692,YLR221C,RSA3,missense,c.229G>A,p.Asp77Asn,MODERATE,D5
4693,YLR221C,RSA3,missense,c.151G>A,p.Ala51Thr,MODERATE,D5
4694,YLR221C,RSA3,missense,c.112C>T,p.Pro38Ser,MODERATE,D5
4695,YLR221C,RSA3,missense,c.229G>A,p.Asp77Asn,MODERATE,D6
4696,YLR221C,RSA3,missense,c.151G>A,p.Ala51Thr,MODERATE,D6
4697,YLR221C,RSA3,missense,c.112C>T,p.Pro38Ser,MODERATE,D6
4698,YLR221C,RSA3,missense,c.229G>A,p.Asp77Asn,MODERATE,D7
4699,YLR221C,RSA3,missense,c.151G>A,p.Ala51Thr,MODERATE,D7
4700,YLR221C,RSA3,missense,c.112C>T,p.Pro38Ser,MODERATE,D7
4701,YLR221C,RSA3,missense,c.229G>A,p.Asp77Asn,MODERATE,D8
4702,YLR221C,RSA3,missense,c.151G>A,p.Ala51Thr,MODERATE,D8
4703,YLR221C,RSA3,missense,c.112C>T,p.Pro38Ser,MODERATE,D8
5213,YML103C,NUP188,missense,c.4192G>T,p.Val1398Leu,MODERATE,D5
5214,YML103C,NUP188,missense,c.3083C>A,p.Thr1028Lys,MODERATE,D5
5215,YML103C,NUP188,missense,c.2578G>T,p.Ala860Ser,MODERATE,D5
5216,YML103C,NUP188,missense,c.2318T>C,p.Leu773Ser,MODERATE,D5
5217,YML103C,NUP188,missense,c.2200A>G,p.Ser734Gly,MODERATE,D5
5218,YML103C,NUP188,conservative inframe deletion,c.1595_1603delAACAACAAC,p.Gln533_Gln535del,MODERATE,D5
5219,YML103C,NUP188,missense,c.4192G>T,p.Val1398Leu,MODERATE,D6
5220,YML103C,NUP188,missense,c.3083C>A,p.Thr1028Lys,MODERATE,D6
5221,YML103C,NUP188,missense,c.2578G>T,p.Ala860Ser,MODERATE,D6
5222,YML103C,NUP188,missense,c.2318T>C,p.Leu773Ser,MODERATE,D6
5223,YML103C,NUP188,missense,c.2200A>G,p.Ser734Gly,MODERATE,D6
5224,YML103C,NUP188,conservative inframe deletion,c.1615_1623delCAACAACAG,p.Gln539_Gln541del,MODERATE,D6
5225,YML103C,NUP188,conservative inframe deletion,c.1595_1603delAACAACAAC,p.Gln533_Gln535del,MODERATE,D6
5226,YML103C,NUP188,missense,c.4192G>T,p.Val1398Leu,MODERATE,D7
5227,YML103C,NUP188,missense,c.3083C>A,p.Thr1028Lys,MODERATE,D7
5228,YML103C,NUP188,missense,c.2578G>T,p.Ala860Ser,MODERATE,D7
5229,YML103C,NUP188,missense,c.2318T>C,p.Leu773Ser,MODERATE,D7
5230,YML103C,NUP188,missense,c.2200A>G,p.Ser734Gly,MODERATE,D7
5231,YML103C,NUP188,conservative inframe deletion,c.1595_1603delAACAACAAC,p.Gln533_Gln535del,MODERATE,D7
5232,YML103C,NUP188,missense,c.4192G>T,p.Val1398Leu,MODERATE,D8
5233,YML103C,NUP188,missense,c.3083C>A,p.Thr1028Lys,MODERATE,D8
5234,YML103C,NUP188,missense,c.2578G>T,p.Ala860Ser,MODERATE,D8
5235,YML103C,NUP188,missense,c.2318T>C,p.Leu773Ser,MODERATE,D8
5236,YML103C,NUP188,missense,c.2200A>G,p.Ser734Gly,MODERATE,D8
5237,YML103C,NUP188,conservative inframe deletion,c.1595_1603delAACAACAAC,p.Gln533_Gln535del,MODERATE,D8
