Gene,Protein,Description,Position,Identified By,Total Mutations,Impact
YGR159C,NSR1,Nuclear localization sequence-binding protein (PTHR48024:SF11),806548 (VII),2 4 5,26,***** / ***
YML103C,NUP188,Nucleoporin nup188 homolog (PTHR31431:SF1),63358 (XIII),2 4,25,***
YGR119C,NUP57,Nucleoporin p54 (PTHR13000:SF0),728685 (VII),2 4   ,20,***
YKR082W,NUP133,Nuclear pore complex protein nup133 (PTHR13405:SF11),594186 (XI),2 4,32,***
YKL014C,URB1,Nucleolar pre-ribosomal-associated protein 1 (PTHR13500:SF0),411756 (XI),2 4,64,***
YLR221C,RSA3,Ribosome assembly protein 3 (PTHR28127:SF1),578796 (XII),2,12,***
YKR063C,LAS1,Ribosomal biogenesis protein las1l (PTHR15002:SF0),561220 (XI),2 4,21,***
YKR092C,SRP40,Nucleolar and coiled-body phosphoprotein 1 (PTHR23216:SF1),613087 (XI),2 4,22,***
YHL033C,RPL8A,60s ribosomal protein l7a (PTHR23105:SF1),35271 (VIII),3,8,***