[0] Config.pm:302> INFO - This is Biber 2.11
[1] Config.pm:305> INFO - Logfile is '/Volumes/Blue/GIT/bioinf_practical_hs21/Project 1 - SNPs/Report/.texpadtmp/source.blg'
[57] biber-darwin:313> INFO - === Mon Dec 13, 2021, 10:04:52
[97] Biber.pm:371> INFO - Reading '/Volumes/Blue/GIT/bioinf_practical_hs21/Project 1 - SNPs/Report/.texpadtmp/source.bcf'
[200] Biber.pm:857> INFO - Found 19 citekeys in bib section 0
[214] Biber.pm:3976> INFO - Processing section 0
[228] Biber.pm:4136> INFO - Looking for bibtex format file '/Volumes/Blue/GIT/bioinf_practical_hs21/Project 1 - SNPs/Report/Bibliography.bib' for section 0
[231] bibtex.pm:1500> INFO - LaTeX decoding ...
[280] bibtex.pm:1316> INFO - Found BibTeX data source '/Volumes/Blue/GIT/bioinf_practical_hs21/Project 1 - SNPs/Report/Bibliography.bib'
[487] Utils.pm:209> ERROR - BibTeX subsystem: /var/folders/1p/6pdz83894w5fnwm59tb6_3bh0000gp/T/Uo3lBs82O6/Bibliography.bib_18437.utf8, line 39, syntax error: found "URL", expected end of entry ("}" or ")") (skipping to next "@")
[488] Biber.pm:114> INFO - ERRORS: 1
