<svg xmlns="http://www.w3.org/2000/svg" width="62" height="62" viewBox="0 0 62 62">
    <g fill="#08A531" fill-rule="nonzero">
        <path d="M31 0C13.88 0 0 13.88 0 31c0 17.12 13.88 31 31 31 17.12 0 31-13.88 31-31C61.98 13.887 48.113.02 31 0zm0 60.063C14.95 60.063 1.937 47.05 1.937 31 1.938 14.95 14.95 1.937 31 1.937 47.05 1.938 60.063 14.95 60.063 31 60.042 47.043 47.043 60.043 31 60.063z"/>
        <path d="M31 3.875C16.02 3.875 3.875 16.019 3.875 31c0 14.98 12.144 27.125 27.125 27.125 14.98 0 27.125-12.144 27.125-27.125C58.109 16.026 45.974 3.891 31 3.875zm16.178 16.193l-23.623 23.25a.993.993 0 0 1-.683.276h-.014a.97.97 0 0 1-.688-.3l-7.372-7.75a.97.97 0 0 1 1.404-1.337l6.694 7.038 22.926-22.563a.97.97 0 1 1 1.356 1.386z"/>
    </g>
</svg>
