<svg xmlns="http://www.w3.org/2000/svg" width="27" height="27" viewBox="0 0 27 27">
    <path fill="#227EDC" fill-rule="nonzero" d="M25.121 10.688h-2.244c-.45 0-.816-.248-.99-.664-.169-.41-.084-.85.236-1.165l1.586-1.586a1.888 1.888 0 0 0 0-2.66l-1.322-1.317c-.708-.714-1.946-.714-2.654 0L18.14 4.882a1.01 1.01 0 0 1-.743.315c-.275 0-.551-.106-.754-.298a1.027 1.027 0 0 1-.331-.776V1.88A1.878 1.878 0 0 0 14.433 0h-1.861c-1.04 0-1.884.844-1.884 1.879v2.244c0 .675-.546 1.074-1.08 1.074a1.01 1.01 0 0 1-.743-.315L7.273 3.296c-.709-.714-1.946-.714-2.655 0L3.296 4.613a1.868 1.868 0 0 0-.551 1.327c0 .506.197.979.551 1.333L4.882 8.86c.321.315.406.754.237 1.165a1.048 1.048 0 0 1-.99.664H1.884C.844 10.688 0 11.53 0 12.566v1.868c0 1.035.844 1.879 1.884 1.879H4.13c.444 0 .815.247.99.663.169.41.084.85-.237 1.165l-1.586 1.586a1.868 1.868 0 0 0-.551 1.327c0 .507.197.98.551 1.333l1.322 1.317c.709.714 1.946.714 2.655 0l1.592-1.586a1.01 1.01 0 0 1 .743-.315c.534 0 1.08.399 1.08 1.074v2.244c0 1.035.843 1.879 1.884 1.879h1.862c1.04 0 1.879-.844 1.879-1.879v-2.244c0-.675.55-1.074 1.085-1.074.197 0 .484.05.743.315l1.586 1.586c.714.714 1.952.714 2.66 0l1.322-1.317c.355-.354.552-.826.552-1.333 0-.5-.197-.973-.552-1.327l-1.586-1.586a1.037 1.037 0 0 1-.236-1.165c.174-.416.54-.663.99-.663h2.244A1.882 1.882 0 0 0 27 14.433v-1.867a1.882 1.882 0 0 0-1.879-1.879zM13.5 19.124A5.634 5.634 0 0 1 7.875 13.5c0-3.1 2.526-5.625 5.625-5.625a5.63 5.63 0 0 1 5.625 5.625 5.63 5.63 0 0 1-5.625 5.625z"/>
</svg>
