#k_imuluses
##d_imuluses
###c_eonkavan
551 = {		#Eonkavan

    # Misc
    culture = sun_elvish
    religion = bulwari_sun_cult
	holding = castle_holding

    # History
}

6356 = {		#

    # Misc
    culture = sun_elvish
    religion = bulwari_sun_cult
	holding = none

    # History
}

6357 = {		#

    # Misc
    culture = sun_elvish
    religion = bulwari_sun_cult
	holding = none

    # History
}

###c_tunkalem
553 = {		#Tunkalem

    # Misc
    culture = sun_elvish
    religion = bulwari_sun_cult
	holding = castle_holding

    # History
}

6358 = {		#

    # Misc
    culture = sun_elvish
    religion = bulwari_sun_cult
	holding = none

    # History
}

6359 = {		#

    # Misc
    culture = sun_elvish
    religion = bulwari_sun_cult
	holding = none

    # History
}

###c_kaboustraz
552 = {		#Kaboustraz

    # Misc
    culture = kuzarami
    religion = bulwari_sun_cult
	holding = castle_holding

    # History
}

6360 = {		#

    # Misc
    culture = kuzarami
    religion = bulwari_sun_cult
	holding = none

    # History
}

6361 = {		#

    # Misc
    culture = kuzarami
    religion = bulwari_sun_cult
	holding = none

    # History
}

6362 = {		#

    # Misc
    culture = kuzarami
    religion = bulwari_sun_cult
	holding = none

    # History
}

##d_sad_kuz
###c_sad_kuz
556 = {		#Sad Kuz

    # Misc
    culture = kuzarami
    religion = bulwari_sun_cult
	holding = castle_holding

    # History
}

6363 = {		#

    # Misc
    culture = kuzarami
    religion = bulwari_sun_cult
	holding = none

    # History
}

6364 = {		#

    # Misc
    culture = kuzarami
    religion = bulwari_sun_cult
	holding = none

    # History
}

###c_kuztanuz
555 = {		#Kuztanuz

    # Misc
    culture = kuzarami
    religion = bulwari_sun_cult
	holding = castle_holding

    # History
}

6368 = {		#

    # Misc
    culture = kuzarami
    religion = bulwari_sun_cult
	holding = none

    # History
}

6369 = {		#

    # Misc
    culture = kuzarami
    religion = bulwari_sun_cult
	holding = none

    # History
}

###c_tuklum_elum
554 = {		#Tuklum Elum

    # Misc
    culture = kuzarami
    religion = bulwari_sun_cult
	holding = castle_holding

    # History
}

6370 = {		#

    # Misc
    culture = kuzarami
    religion = bulwari_sun_cult
	holding = none

    # History
}

6371 = {		#

    # Misc
    culture = kuzarami
    religion = bulwari_sun_cult
	holding = none

    # History
}

###c_barzilsad
557 = {		#Barzilsad

    # Misc
    culture = kuzarami
    religion = bulwari_sun_cult
	holding = castle_holding

    # History
}

6365 = {		#

    # Misc
    culture = kuzarami
    religion = bulwari_sun_cult
	holding = none

    # History
}

6366 = {		#

    # Misc
    culture = kuzarami
    religion = bulwari_sun_cult
	holding = none

    # History
}

6367 = {		#

    # Misc
    culture = kuzarami
    religion = bulwari_sun_cult
	holding = none

    # History
}