{
	"info": {
		"_postman_id": "811affec-de1a-4368-b5ab-6534c1750c0b",
		"name": "todoApp",
		"schema": "https://schema.getpostman.com/json/collection/v2.1.0/collection.json"
	},
	"item": [
		{
			"name": "login",
			"request": {
				"method": "GET",
				"header": [],
				"url": {
					"raw": "http://localhost:8000/api/login/?email=test@abc.com&password=test123",
					"protocol": "http",
					"host": [
						"localhost"
					],
					"port": "8000",
					"path": [
						"api",
						"login",
						""
					],
					"query": [
						{
							"key": "email",
							"value": "test@abc.com"
						},
						{
							"key": "password",
							"value": "test123"
						}
					]
				}
			},
			"response": []
		},
		{
			"name": "getAll",
			"request": {
				"method": "GET",
				"header": [
					{
						"key": "Authorization",
						"value": "bearer M2JjYzc2NmI2ZTI5ZTkzODMyNmVkYmY0ZDk1YjY2Mjk=",
						"type": "text"
					}
				],
				"url": {
					"raw": "http://localhost:8000/api/todo?status_id=0",
					"protocol": "http",
					"host": [
						"localhost"
					],
					"port": "8000",
					"path": [
						"api",
						"todo"
					],
					"query": [
						{
							"key": "status_id",
							"value": "0",
							"description": "//0 for All, 1=Pending, 2 = Snoozed, 3 = Completed, 4 = overdue"
						}
					]
				}
			},
			"response": []
		},
		{
			"name": "createToDo",
			"request": {
				"method": "POST",
				"header": [
					{
						"key": "Authorization",
						"value": "bearer M2JjYzc2NmI2ZTI5ZTkzODMyNmVkYmY0ZDk1YjY2Mjk=",
						"type": "text"
					}
				],
				"body": {
					"mode": "formdata",
					"formdata": [
						{
							"key": "todo",
							"value": "Title of Todo",
							"type": "text"
						},
						{
							"key": "description",
							"value": "Description of task in detail",
							"type": "text"
						},
						{
							"key": "category",
							"value": "personal",
							"type": "text"
						}
					]
				},
				"url": {
					"raw": "http://localhost:8000/api/todo",
					"protocol": "http",
					"host": [
						"localhost"
					],
					"port": "8000",
					"path": [
						"api",
						"todo"
					]
				}
			},
			"response": []
		},
		{
			"name": "register",
			"request": {
				"method": "POST",
				"header": [],
				"url": {
					"raw": "http://localhost:8000/api/register/?email=test@abc.com&password=test123",
					"protocol": "http",
					"host": [
						"localhost"
					],
					"port": "8000",
					"path": [
						"api",
						"register",
						""
					],
					"query": [
						{
							"key": "email",
							"value": "test@abc.com"
						},
						{
							"key": "password",
							"value": "test123"
						}
					]
				}
			},
			"response": []
		},
		{
			"name": "editTodo",
			"request": {
				"method": "PUT",
				"header": [
					{
						"key": "Authorization",
						"value": "bearer M2JjYzc2NmI2ZTI5ZTkzODMyNmVkYmY0ZDk1YjY2Mjk=",
						"type": "text"
					}
				],
				"body": {
					"mode": "formdata",
					"formdata": [
						{
							"key": "todo",
							"value": "task 2",
							"type": "text"
						},
						{
							"key": "description",
							"value": "task 2 details",
							"type": "text"
						},
						{
							"key": "category",
							"value": "personal",
							"type": "text"
						}
					]
				},
				"url": {
					"raw": "http://localhost:8000/api/todo/1",
					"protocol": "http",
					"host": [
						"localhost"
					],
					"port": "8000",
					"path": [
						"api",
						"todo",
						"1"
					]
				}
			},
			"response": []
		}
	],
	"protocolProfileBehavior": {}
}