{
	"info": {
		"_postman_id": "ceb4277e-5d83-45b0-841b-d14697edcf4d",
		"name": "formacao",
		"schema": "https://schema.getpostman.com/json/collection/v2.1.0/collection.json"
	},
	"item": [
		{
			"name": "add",
			"request": {
				"method": "POST",
				"header": [
					{
						"key": "Content-Type",
						"value": "application/json",
						"type": "text"
					}
				],
				"body": {
					"mode": "raw",
					"raw": "{\n\t\"id\" : 5,\n\t\"num1\": 1,\n\t\"num2\": 9,\n\t\"resultado\": 10\n}"
				},
				"url": {
					"raw": "http://localhost:8083/calc/add",
					"protocol": "http",
					"host": [
						"localhost"
					],
					"port": "8083",
					"path": [
						"calc",
						"add"
					]
				}
			},
			"response": []
		},
		{
			"name": "all",
			"protocolProfileBehavior": {
				"disableBodyPruning": true
			},
			"request": {
				"method": "GET",
				"header": [
					{
						"key": "Content-Type",
						"type": "text",
						"value": "application/json"
					}
				],
				"body": {
					"mode": "raw",
					"raw": "{\n\t\"id\" : 5,\n\t\"num1\": 1,\n\t\"num2\": 9,\n\t\"resultado\": 10\n}"
				},
				"url": {
					"raw": "http://localhost:8083/calc/all",
					"protocol": "http",
					"host": [
						"localhost"
					],
					"port": "8083",
					"path": [
						"calc",
						"all"
					]
				}
			},
			"response": []
		},
		{
			"name": "by id",
			"protocolProfileBehavior": {
				"disableBodyPruning": true
			},
			"request": {
				"method": "GET",
				"header": [
					{
						"key": "Content-Type",
						"type": "text",
						"value": "application/json"
					}
				],
				"body": {
					"mode": "raw",
					"raw": "{\n\t\"id\" : 5,\n\t\"num1\": 1,\n\t\"num2\": 9,\n\t\"resultado\": 10\n}"
				},
				"url": {
					"raw": "http://localhost:8083/calc/1",
					"protocol": "http",
					"host": [
						"localhost"
					],
					"port": "8083",
					"path": [
						"calc",
						"1"
					]
				}
			},
			"response": []
		},
		{
			"name": "update",
			"request": {
				"method": "PUT",
				"header": [
					{
						"key": "Content-Type",
						"type": "text",
						"value": "application/json"
					}
				],
				"body": {
					"mode": "raw",
					"raw": "{\n\t\"id\" : 5,\n\t\"num1\": 1,\n\t\"num2\": 9,\n\t\"resultado\": 10\n}"
				},
				"url": {
					"raw": "http://localhost:8083/calc/update/1",
					"protocol": "http",
					"host": [
						"localhost"
					],
					"port": "8083",
					"path": [
						"calc",
						"update",
						"1"
					]
				}
			},
			"response": []
		},
		{
			"name": "by resultado",
			"request": {
				"method": "GET",
				"header": [
					{
						"key": "Content-Type",
						"type": "text",
						"value": "application/json",
						"disabled": true
					}
				],
				"body": {
					"mode": "raw",
					"raw": ""
				},
				"url": {
					"raw": "http://localhost:8083/calc/resultado?resultado=6",
					"protocol": "http",
					"host": [
						"localhost"
					],
					"port": "8083",
					"path": [
						"calc",
						"resultado"
					],
					"query": [
						{
							"key": "resultado",
							"value": "6"
						}
					]
				}
			},
			"response": []
		},
		{
			"name": "delete",
			"request": {
				"method": "DELETE",
				"header": [
					{
						"key": "Content-Type",
						"type": "text",
						"value": "application/json"
					}
				],
				"body": {
					"mode": "raw",
					"raw": ""
				},
				"url": {
					"raw": "http://localhost:8083/calc/delete/1",
					"protocol": "http",
					"host": [
						"localhost"
					],
					"port": "8083",
					"path": [
						"calc",
						"delete",
						"1"
					]
				}
			},
			"response": []
		},
		{
			"name": "by num1",
			"request": {
				"method": "GET",
				"header": [
					{
						"key": "Content-Type",
						"type": "text",
						"value": "application/json",
						"disabled": true
					}
				],
				"body": {
					"mode": "raw",
					"raw": ""
				},
				"url": {
					"raw": "http://localhost:8083/calc/num?num1=3",
					"protocol": "http",
					"host": [
						"localhost"
					],
					"port": "8083",
					"path": [
						"calc",
						"num"
					],
					"query": [
						{
							"key": "num1",
							"value": "3"
						}
					]
				}
			},
			"response": []
		},
		{
			"name": "by num2",
			"request": {
				"method": "GET",
				"header": [
					{
						"key": "Content-Type",
						"type": "text",
						"value": "application/json",
						"disabled": true
					}
				],
				"body": {
					"mode": "raw",
					"raw": ""
				},
				"url": {
					"raw": "http://localhost:8083/calc/num?num2=3",
					"protocol": "http",
					"host": [
						"localhost"
					],
					"port": "8083",
					"path": [
						"calc",
						"num"
					],
					"query": [
						{
							"key": "num2",
							"value": "3"
						}
					]
				}
			},
			"response": []
		}
	]
}