{"test_parselogs":{"ignore_errors":[
    "(WW) warning, (EE) error, (NI) not implemented, (??) unknown.",
    "ACPI _OSC request failed (AE_SUPPORT)",
    "AE_ALREADY_EXISTS",
    "BAR 0-9",
    "Cannot find a map file",
    "Cannot set xattr user.Librepo.DownloadInProgress",
    "Delete temporary files failed!",
    "Failed to find URL:http://ipv4.connman.net/online/status.html",
    "Failed to load module \"ati\"",
    "Failed to load module \"fbdev\"",
    "Failed to load module \"glx\"",
    "Failed to load module \"modesetting\"",
    "Failed to load module \"vesa\"",
    "Failed to load module fbdev",
    "Failed to load module glx",
    "Failed to load module modesetting",
    "Failed to load module vesa",
    "Failed to process device, ignoring: Device or resource busy",
    "Failed to read /var/lib/nfs/statd/state: Success",
    "Failed to rename network interface",
    "Fast TSC calibration",
    "GPT: Use GNU Parted to correct GPT errors",
    "NETLINK INITIALIZATION FAILED",
    "NX (Execute Disable) protection cannot be enabled: non-PAE kernel!",
    "Online check failed for",
    "Open ACPI failed (/var/run/acpid.socket) (No such file or directory)",
    "VGA arbiter: cannot open kernel arbiter, no multi-card support",
    "[drm] Cannot find any crtc or sizes",
    "[pulseaudio] authkey.c: Failed to load authentication key",
    "[pulseaudio] authkey.c: Failed to open cookie file",
    "[rdrand]: Initialization Failed",
    "[rndr  ]: Initialization Failed",
    "_OSC failed (AE_ERROR)",
    "_OSC failed (AE_NOT_FOUND); disabling ASPM",
    "_OSC failed (AE_SUPPORT)",
    "can't add hid device:",
    "can't disable ASPM",
    "controller can't do DEVSLP, turning off",
    "dma timeout",
    "error retry time-out =",
    "error: couldn't mount because of unsupported optional features",
    "hd.: possibly failed opcode",
    "kernel: Cannot find map file",
    "logind: cannot setup systemd-logind helper (-61), using legacy fallback",
    "msg='unit=parsec comm=\"systemd\" exe=\"/lib/systemd/systemd\" hostname=? addr=? terminal=? res=failed",
    "netlink init failed",
    "omap_hwmod: debugss: _wait_target_disable failed",
    "stmmac_dvr_probe: warning: cannot get CSR clock",
    "tpm_tis_core: module verification failed:",
    "usbhid: probe of ",
    "was skipped because all trigger condition checks failed",
    "was skipped because of a failed condition check",
    "xf86OpenConsole: Switching VT failed"
]}}
