{
    "dcr_id": "1533220557240",
    "lang": "fr",
    "title": "Analyste",
    "modified": "2018-08-17 00:00:00.0",
    "issued": "2018-08-07 00:00:00.0",
    "type_name": "intra-intra\/empl-empl",
    "node_id": "1279029955397",
    "layout_name": null,
    "created": "2018-08-17 16:01:21.0",
    "updated": "2018-08-17 16:01:21.0"
}