{
    "dcr_id": "1556638875205",
    "lang": "en",
    "title": {
        "en": "North American Occupational Safety and Health Week - May 5-11",
        "fr": "Semaine nord-am\u00e9ricaine de la s\u00e9curit\u00e9 et de la sant\u00e9 au travail - Du 5 au 11 mai"
    },
    "modified": "2019-05-02 00:00:00.0",
    "issued": "2019-05-02 00:00:00.0",
    "type_name": "intra-intra\/news-nouv",
    "node_id": "1279030006975",
    "layout_name": null,
    "created": "2019-05-02 10:07:34.0",
    "updated": "2019-05-02 10:07:34.0"
}