{
    "dcr_id": "1467226639014",
    "lang": "en",
    "title": {
        "en": "This Week in AgriCulture - Quality Scientific Publications: It's in Our Nature",
        "fr": "Au menu d'AgriCulture cette semaine - Publications scientifiques de qualit\u00e9 : c'est dans notre \u00ab nature \u00bb"
    },
    "modified": "2016-06-30 00:00:00.0",
    "issued": "2016-06-30 00:00:00.0",
    "type_name": "intra-intra\/news-nouv",
    "node_id": "1279030006975",
    "layout_name": "1 column",
    "created": "2017-03-31 15:46:44.0",
    "updated": "2017-03-31 15:46:44.0"
}