{
    "dcr_id": "1566322610459",
    "lang": "en",
    "title": {
        "en": "Program Manager - AgriInsurance",
        "fr": "Gestionnaire de programmes \u2013 Agri-protection"
    },
    "modified": "2019-08-21 00:00:00.0",
    "issued": "2019-08-21 00:00:00.0",
    "type_name": "intra-intra\/empl-empl",
    "node_id": "1279029955397",
    "layout_name": null,
    "created": "2019-08-21 14:11:29.0",
    "updated": "2019-08-21 14:11:29.0"
}