{
    "dcr_id": "1452098722195",
    "lang": "en",
    "title": {
        "en": "This Week in AgriCulture - The Power of Purple Wheat",
        "fr": "Au menu d'AgriCulture cette semaine : Les bienfaits du bl\u00e9 violet"
    },
    "modified": "2016-01-07 00:00:00.0",
    "issued": "2016-01-07 00:00:00.0",
    "type_name": "intra-intra\/news-nouv",
    "node_id": "1279030006975",
    "layout_name": "1 column",
    "created": "2017-03-31 15:46:44.0",
    "updated": "2017-03-31 15:46:44.0"
}