{
    "dcr_id": "1560978446270",
    "lang": "en",
    "title": {
        "en": "NCR - Pride Flags Raising Invitation - June 20",
        "fr": "RCN - Invitation pour la lev\u00e9e des drapeaux de la Fiert\u00e9 - 20 juin"
    },
    "modified": "2019-06-19 00:00:00.0",
    "issued": "2019-06-19 00:00:00.0",
    "type_name": "intra-intra\/news-nouv",
    "node_id": "1279030006975",
    "layout_name": null,
    "created": "2019-06-19 17:15:05.0",
    "updated": "2019-06-19 17:15:05.0"
}