{
    "dcr_id": "1363275398375",
    "lang": "en",
    "title": {
        "en": "Deskside Support Coordinator",
        "fr": "Coordinateur du soutien sur place"
    },
    "modified": "2013-03-22 00:00:00.0",
    "issued": "2013-03-22 00:00:00.0",
    "type_name": "intra-intra\/empl-empl",
    "node_id": "1279029955397",
    "layout_name": "1 column",
    "created": "2017-03-30 13:06:10.0",
    "updated": "2017-03-30 13:06:10.0"
}