{
    "dcr_id": "1541424390477",
    "lang": "en",
    "title": {
        "en": "Workplace Safety Procedures: What to Do With Unattended Packages ",
        "fr": "Proc\u00e9dures de s\u00e9curit\u00e9 en milieu de travail : Que faire en pr\u00e9sence de colis laiss\u00e9s sans surveillance?"
    },
    "modified": "2018-11-06 00:00:00.0",
    "issued": "2018-11-06 00:00:00.0",
    "type_name": "intra-intra\/news-nouv",
    "node_id": "1279030006975",
    "layout_name": null,
    "created": "2018-11-06 08:50:01.0",
    "updated": "2018-11-06 08:50:01.0"
}