{
    "dcr_id": "1347457406254",
    "lang": "fr",
    "title": "Adjoint(e) administratif(ve) ",
    "modified": "2012-09-13 00:00:00.0",
    "issued": "2012-09-13 00:00:00.0",
    "type_name": "intra-intra\/empl-empl",
    "node_id": "1279029955397",
    "layout_name": "1 column",
    "created": "2017-03-30 13:06:10.0",
    "updated": "2017-03-30 13:06:10.0"
}