{
    "dcr_id": "1397659769245",
    "lang": "en",
    "title": {
        "en": "Manager, Service Policy and Improvement",
        "fr": "Gestionnaire, Am\u00e9lioration et politique en mati\u00e8re de services"
    },
    "modified": "2014-04-22 00:00:00.0",
    "issued": "2014-04-22 00:00:00.0",
    "type_name": "intra-intra\/empl-empl",
    "node_id": "1279029955397",
    "layout_name": "1 column",
    "created": "2017-03-30 13:06:10.0",
    "updated": "2017-03-30 13:06:10.0"
}