{
    "dcr_id": "1532439541544",
    "lang": "fr",
    "title": "Sant\u00e9 animale, maladies des cultures, l'agriculture biologique et plus encore : Les nouveaut\u00e9s de juillet ajout\u00e9es \u00e0 la collection de la Biblioth\u00e8que canadienne de l'agriculture",
    "modified": "2018-07-26 00:00:00.0",
    "issued": "2018-07-26 00:00:00.0",
    "type_name": "intra-intra\/news-nouv",
    "node_id": "1279030006975",
    "layout_name": null,
    "created": "2018-07-26 08:37:09.0",
    "updated": "2018-07-26 08:37:09.0"
}