{
    "dcr_id": "1504037432788",
    "lang": "fr",
    "title": "Rappel - RCN - Bouger pour ce qui est important - marche\/course de 5 km",
    "modified": "2017-09-14 00:00:00.0",
    "issued": "2017-08-30 00:00:00.0",
    "type_name": "intra-intra\/news-nouv",
    "node_id": "1279030006975",
    "layout_name": null,
    "created": "2017-09-14 13:12:11.0",
    "updated": "2017-09-14 13:12:11.0"
}