{
    "dcr_id": "1461262610699",
    "lang": "en",
    "title": {
        "en": "Reminder - Visible Minorities Network Activities: Diversity and Inclusiveness Month - May 18",
        "fr": "Rappel - Activit\u00e9s du R\u00e9seau des Minorit\u00e9s Visibles : Mois de la Diversit\u00e9 et de l'Inclusion - Le 18 mai"
    },
    "modified": "2016-05-17 00:00:00.0",
    "issued": "2016-04-27 00:00:00.0",
    "type_name": "intra-intra\/news-nouv",
    "node_id": "1279030006975",
    "layout_name": "1 column",
    "created": "2017-03-31 15:46:44.0",
    "updated": "2017-03-31 15:46:44.0"
}