{
    "dcr_id": "1512747496284",
    "lang": "en",
    "title": {
        "en": "IT Team Leader",
        "fr": "Chef d'\u00e9quipe TI"
    },
    "modified": "2017-12-08 00:00:00.0",
    "issued": "2017-12-08 00:00:00.0",
    "type_name": "intra-intra\/empl-empl",
    "node_id": "1279029955397",
    "layout_name": null,
    "created": "2017-12-08 12:25:50.0",
    "updated": "2017-12-08 12:25:50.0"
}