{
    "dcr_id": "1554843455110",
    "lang": "en",
    "title": {
        "en": "This Week in The Harvest \u2013 \u201cOn the Job\u201d \u2013 Detective Work at the Canadian Agriculture Library",
        "fr": "Au menu de La Moisson cette semaine \u2013 \u00ab Au travail \u00bb \u2013 Travail de d\u00e9tective \u00e0 la Biblioth\u00e8que canadienne de l\u2019agriculture"
    },
    "modified": "2019-04-11 00:00:00.0",
    "issued": "2019-04-11 00:00:00.0",
    "type_name": "intra-intra\/news-nouv",
    "node_id": "1279030006975",
    "layout_name": null,
    "created": "2019-04-11 09:30:40.0",
    "updated": "2019-04-11 09:30:40.0"
}