{
    "dcr_id": "1434650323369",
    "lang": "fr",
    "title": "Analyste des activit\u00e9s scientifiques",
    "modified": "2015-06-22 00:00:00.0",
    "issued": "2015-06-22 00:00:00.0",
    "type_name": "intra-intra\/empl-empl",
    "node_id": "1279029955397",
    "layout_name": "1 column",
    "created": "2017-03-30 13:06:11.0",
    "updated": "2017-03-30 13:06:11.0"
}