{
    "dcr_id": "1520276897751",
    "lang": "en",
    "title": {
        "en": "Update on Benefit Coverage",
        "fr": "Mise \u00e0 jour sur la protection des r\u00e9gimes de prestations"
    },
    "modified": "2018-03-06 00:00:00.0",
    "issued": "2018-03-06 00:00:00.0",
    "type_name": "intra-intra\/news-nouv",
    "node_id": "1279030006975",
    "layout_name": null,
    "created": "2018-03-06 08:18:43.0",
    "updated": "2018-03-06 08:18:43.0"
}