{
    "dcr_id": "1481139136029",
    "lang": "en",
    "title": {
        "en": "Forum for Young Canadians - Seeking Volunteer Group Leaders - Application Deadline is December 16",
        "fr": "Forum pour jeunes Canadiens - \u00c0 la recherche de chefs de groupe b\u00e9n\u00e9voles - La date limite des inscriptions est le 16 d\u00e9cembre"
    },
    "modified": "2016-12-08 00:00:00.0",
    "issued": "2016-12-08 00:00:00.0",
    "type_name": "intra-intra\/news-nouv",
    "node_id": "1279030006975",
    "layout_name": "1 column",
    "created": "2017-03-31 15:46:45.0",
    "updated": "2017-03-31 15:46:45.0"
}