{
    "dcr_id": "1516827524772",
    "lang": "en",
    "title": {
        "en": "Gender and Sexual Diversity in the Workplace (AGR-563)",
        "fr": "La diversit\u00e9 des genres et de la sexualit\u00e9 en milieu de travail (AGR-563) "
    },
    "modified": "2018-12-20 00:00:00.0",
    "issued": "2018-02-14 00:00:00.0",
    "type_name": "intra-intra\/gene-gene",
    "node_id": "1524660248728",
    "layout_name": "1 column",
    "created": "2018-12-20 09:42:44.0",
    "updated": "2018-12-20 09:42:44.0"
}