{
    "dcr_id": "1516294951881",
    "lang": "fr",
    "title": "Postes bilingue en administration",
    "modified": "2018-01-25 00:00:00.0",
    "issued": "2018-01-19 00:00:00.0",
    "type_name": "intra-intra\/empl-empl",
    "node_id": "1279029955397",
    "layout_name": null,
    "created": "2018-01-25 15:27:13.0",
    "updated": "2018-01-25 15:27:13.0"
}