{
    "dcr_id": "1402949823931",
    "lang": "en",
    "title": {
        "en": "Sector Analyst",
        "fr": "Analyste sectoriel"
    },
    "modified": "2014-06-20 00:00:00.0",
    "issued": "2014-06-20 00:00:00.0",
    "type_name": "intra-intra\/empl-empl",
    "node_id": "1279029955397",
    "layout_name": "1 column",
    "created": "2017-03-30 13:06:10.0",
    "updated": "2017-03-30 13:06:10.0"
}