{
    "dcr_id": "1583519614215",
    "lang": "en",
    "title": {
        "en": "Update on 2019 Novel Coronavirus ",
        "fr": "Le point sur le nouveau coronavirus "
    },
    "modified": "2020-03-06 00:00:00.0",
    "issued": "2020-03-06 00:00:00.0",
    "type_name": "intra-intra\/news-nouv",
    "node_id": "1279030006975",
    "layout_name": null,
    "created": "2020-03-06 14:30:16.0",
    "updated": "2020-03-06 14:30:16.0"
}