{
    "dcr_id": "1519235052177",
    "lang": "en",
    "title": {
        "en": "Scheduled Maintenance of ISB Services Including Email and BlackBerry Email - February 24-25",
        "fr": "Entretien pr\u00e9vu des services de la DGSI, y compris les services de courriel et de courriel BlackBerry - Du 24 au 25 f\u00e9vrier"
    },
    "modified": "2018-02-23 00:00:00.0",
    "issued": "2018-02-22 00:00:00.0",
    "type_name": "intra-intra\/news-nouv",
    "node_id": "1279030006975",
    "layout_name": null,
    "created": "2018-02-23 10:48:15.0",
    "updated": "2018-02-23 10:48:15.0"
}