{
    "dcr_id": "1488312865944",
    "lang": "fr",
    "title": "L'\u00e9galit\u00e9, \u00e7a compte - C\u00e9l\u00e9brez la Journ\u00e9e internationale des femmes - Le 8 mars",
    "modified": "2017-03-02 00:00:00.0",
    "issued": "2017-03-02 00:00:00.0",
    "type_name": "intra-intra\/news-nouv",
    "node_id": "1279030006975",
    "layout_name": "1 column",
    "created": "2017-03-31 15:46:45.0",
    "updated": "2017-03-31 15:46:45.0"
}