{
    "dcr_id": "1365605059283",
    "lang": "en",
    "title": {
        "en": "Chief, Enabling Tools and Information Services",
        "fr": "Chef, Outils habilitant et service d'information"
    },
    "modified": "2013-04-11 00:00:00.0",
    "issued": "2013-04-11 00:00:00.0",
    "type_name": "intra-intra\/empl-empl",
    "node_id": "1279029955397",
    "layout_name": "1 column",
    "created": "2017-03-30 13:06:10.0",
    "updated": "2017-03-30 13:06:10.0"
}