{
    "dcr_id": "1491227857337",
    "lang": "en",
    "title": {
        "en": "Reminder - Scheduled Maintenance of ISB Services Including BlackBerry Email Services - April 15",
        "fr": "Rappel - Entretien pr\u00e9vu des services de la DGSI, y compris les services de courriel et de courriel BlackBerry - Le 15 avril"
    },
    "modified": "2017-04-13 00:00:00.0",
    "issued": "2017-04-05 00:00:00.0",
    "type_name": "intra-intra\/news-nouv",
    "node_id": "1279030006975",
    "layout_name": null,
    "created": "2017-04-13 12:00:37.0",
    "updated": "2017-04-13 12:00:37.0"
}