{
    "dcr_id": "1570537823529",
    "lang": "en",
    "title": {
        "en": "NCR - Giving Thanks and Giving Back",
        "fr": "RCN \u2013 Remercier et redonner"
    },
    "modified": "2019-10-10 00:00:00.0",
    "issued": "2019-10-10 00:00:00.0",
    "type_name": "intra-intra\/news-nouv",
    "node_id": "1279030006975",
    "layout_name": null,
    "created": "2019-10-10 12:18:06.0",
    "updated": "2019-10-10 12:18:06.0"
}