{
    "dcr_id": "1559743865987",
    "lang": "en",
    "title": {
        "en": "National Public Service Week Events - June 10-14",
        "fr": "\u00c9v\u00e9nements de la Semaine nationale de la fonction publique - du 10 au 14 juin"
    },
    "modified": "2019-06-06 00:00:00.0",
    "issued": "2019-06-06 00:00:00.0",
    "type_name": "intra-intra\/news-nouv",
    "node_id": "1279030006975",
    "layout_name": null,
    "created": "2019-06-06 10:02:41.0",
    "updated": "2019-06-06 10:02:41.0"
}