{
    "dcr_id": "1504802759747",
    "lang": "en",
    "title": {
        "en": "Reminder - NCR - Fall 2017 Window Cleaning - NHCAP",
        "fr": "Rappel - RCN - Nettoyage des fen\u00eatres du CACPA \u00e0 l'automne 2017"
    },
    "modified": "2017-09-20 00:00:00.0",
    "issued": "2017-09-13 00:00:00.0",
    "type_name": "intra-intra\/news-nouv",
    "node_id": "1279030006975",
    "layout_name": null,
    "created": "2017-09-20 15:35:36.0",
    "updated": "2017-09-20 15:35:36.0"
}