{
    "dcr_id": "1320698284084",
    "lang": "en",
    "title": {
        "en": "Executive Assistant ",
        "fr": "Adjoint ex\u00e9cutif "
    },
    "modified": "2011-11-10 00:00:00.0",
    "issued": "2011-11-10 00:00:00.0",
    "type_name": "intra-intra\/empl-empl",
    "node_id": "1279029955397",
    "layout_name": "1 column",
    "created": "2017-03-30 13:06:10.0",
    "updated": "2017-03-30 13:06:10.0"
}