{
    "dcr_id": "1495563154058",
    "lang": "en",
    "title": {
        "en": "This Week in The Harvest - Celebrating Diversity and Success",
        "fr": "Au menu de La Moisson cette semaine \u2013 C\u00e9l\u00e9brer la diversit\u00e9 et la r\u00e9ussite"
    },
    "modified": "2017-05-25 00:00:00.0",
    "issued": "2017-05-25 00:00:00.0",
    "type_name": "intra-intra\/news-nouv",
    "node_id": "1279030006975",
    "layout_name": null,
    "created": "2017-05-25 08:13:00.0",
    "updated": "2017-05-25 08:13:00.0"
}