{
    "dcr_id": "1547218458659",
    "lang": "en",
    "title": {
        "en": "Reminder - \"You Don't Look Like a Scientist\" - Women in Science Panel - January 24",
        "fr": "Rappel - \u00ab Vous n'avez pas l'air d'une scientifique \u00bb - Panel des femmes en sciences - 24 janvier"
    },
    "modified": "2019-01-24 00:00:00.0",
    "issued": "2019-01-16 00:00:00.0",
    "type_name": "intra-intra\/news-nouv",
    "node_id": "1279030006975",
    "layout_name": null,
    "created": "2019-01-24 15:05:56.0",
    "updated": "2019-01-24 15:05:56.0"
}