{
    "node_id": "1403608853390",
    "parent_node_id": "1279035844850",
    "dc_id": "1403616174239",
    "landingPageUrl": {
        "en": "1403616174239",
        "fr": "1403616174239"
    },
    "parent_dc_id": "1287776331844",
    "node_title": {
        "en": "null",
        "fr": "null"
    },
    "title": {
        "en": "Organizational Charts",
        "fr": "Organigrammes"
    },
    "type": "hr"
}