{
    "dcr_id": "1512166063557",
    "lang": "fr",
    "title": "Analyste de soutien",
    "modified": "2017-12-05 00:00:00.0",
    "issued": "2017-12-05 00:00:00.0",
    "type_name": "intra-intra\/empl-empl",
    "node_id": "1279029955397",
    "layout_name": null,
    "created": "2017-12-05 09:05:28.0",
    "updated": "2017-12-05 09:05:28.0"
}