{
    "dcr_id": "1497353084894",
    "lang": "en",
    "title": {
        "en": "Scheduled Maintenance of ISB Services Including Email and BlackBerry Email Services - June 17",
        "fr": "Entretien pr\u00e9vu des services de la DGSI, y compris les services de courriel et de courriel BlackBerry - Le 17 juin"
    },
    "modified": "2017-06-15 00:00:00.0",
    "issued": "2017-06-14 00:00:00.0",
    "type_name": "intra-intra\/news-nouv",
    "node_id": "1279030006975",
    "layout_name": null,
    "created": "2017-06-15 10:44:11.0",
    "updated": "2017-06-15 10:44:11.0"
}