{
    "dcr_id": "1464204810009",
    "lang": "en",
    "title": {
        "en": "This Week in AgriCulture - AAFC's Erle Einarsson Receives Governor General's Award",
        "fr": "Au menu d'AgriCulture cette semaine - Erle Einarsson d'AAC re\u00e7oit un Prix du Gouverneur g\u00e9n\u00e9ral"
    },
    "modified": "2016-05-26 00:00:00.0",
    "issued": "2016-05-26 00:00:00.0",
    "type_name": "intra-intra\/news-nouv",
    "node_id": "1279030006975",
    "layout_name": "1 column",
    "created": "2017-03-31 15:46:44.0",
    "updated": "2017-03-31 15:46:44.0"
}