{
    "dcr_id": "1571147620908",
    "lang": "en",
    "title": {
        "en": "AAFC's Pay Pod Report - September 2019",
        "fr": "\u00c9quipe mixte de paye d'AAC \u2013 Septembre 2019"
    },
    "modified": "2019-10-16 00:00:00.0",
    "issued": "2019-10-16 00:00:00.0",
    "type_name": "intra-intra\/gene-gene",
    "node_id": "1279035583756",
    "layout_name": "1 column",
    "created": "2019-10-16 13:05:09.0",
    "updated": "2019-10-16 13:05:09.0"
}