{
    "dcr_id": "1470834545243",
    "lang": "en",
    "title": {
        "en": "Add Yourself to the Student Bridging Inventory",
        "fr": "Ajoutez votre nom au R\u00e9pertoire d'\u00e9tudiants admissibles \u00e0 la transition"
    },
    "modified": "2016-08-11 00:00:00.0",
    "issued": "2016-08-11 00:00:00.0",
    "type_name": "intra-intra\/news-nouv",
    "node_id": "1279030006975",
    "layout_name": "1 column",
    "created": "2017-03-31 15:46:45.0",
    "updated": "2017-03-31 15:46:45.0"
}