{
    "dcr_id": "1528750380088",
    "lang": "en",
    "title": {
        "en": "NCR - Bicycle Parking",
        "fr": "RCN - Stationnement de bicyclettes"
    },
    "modified": "2018-06-13 00:00:00.0",
    "issued": "2018-06-13 00:00:00.0",
    "type_name": "intra-intra\/news-nouv",
    "node_id": "1279030006975",
    "layout_name": null,
    "created": "2018-06-13 16:07:16.0",
    "updated": "2018-06-13 16:07:16.0"
}