{
    "dcr_id": "1527255816330",
    "lang": "en",
    "title": {
        "en": "Reminder - Move or Delete Documents You Saved Through AgriApps by June 29",
        "fr": "Rappel - D\u00e9placer ou supprimer les documents sauvegard\u00e9s dans AgriApps d'ici le 29 juin"
    },
    "modified": "2018-06-26 00:00:00.0",
    "issued": "2018-06-07 00:00:00.0",
    "type_name": "intra-intra\/news-nouv",
    "node_id": "1279030006975",
    "layout_name": null,
    "created": "2018-06-26 14:31:28.0",
    "updated": "2018-06-26 14:31:28.0"
}