{
    "dcr_id": "1523285476886",
    "lang": "en",
    "title": {
        "en": "Phoenix Self-Service for Employees (C601)",
        "fr": "Libre-service de Ph\u00e9nix pour les employ\u00e9s (C601)"
    },
    "modified": "2018-11-21 00:00:00.0",
    "issued": "2018-05-16 00:00:00.0",
    "type_name": "intra-intra\/gene-gene",
    "node_id": "1524660248728",
    "layout_name": "1 column",
    "created": "2018-11-21 15:01:19.0",
    "updated": "2018-11-21 15:01:19.0"
}