{
    "dcr_id": "1349793599041",
    "lang": "en",
    "title": {
        "en": "Science Program Coordinator",
        "fr": "Agent(e) de d\u00e9veloppement des entreprises"
    },
    "modified": "2012-10-10 00:00:00.0",
    "issued": "2012-10-10 00:00:00.0",
    "type_name": "intra-intra\/empl-empl",
    "node_id": "1279029955397",
    "layout_name": "1 column",
    "created": "2017-03-30 13:06:10.0",
    "updated": "2017-03-30 13:06:10.0"
}