{
    "dcr_id": "1436818255669",
    "lang": "en",
    "title": {
        "en": "Market Analyst",
        "fr": "Analyste sur les march\u00e9s"
    },
    "modified": "2015-07-14 00:00:00.0",
    "issued": "2015-07-14 00:00:00.0",
    "type_name": "intra-intra\/empl-empl",
    "node_id": "1279029955397",
    "layout_name": "1 column",
    "created": "2017-03-30 13:06:11.0",
    "updated": "2017-03-30 13:06:11.0"
}