{
    "dcr_id": "1468866444852",
    "lang": "en",
    "title": {
        "en": "Launch of a National Consultation on Accessibility",
        "fr": "Lancement d'un processus de consultation national sur l'accessibilit\u00e9"
    },
    "modified": "2016-07-20 00:00:00.0",
    "issued": "2016-07-20 00:00:00.0",
    "type_name": "intra-intra\/news-nouv",
    "node_id": "1279030006975",
    "layout_name": "1 column",
    "created": "2017-03-31 15:46:44.0",
    "updated": "2017-03-31 15:46:44.0"
}