{
    "dcr_id": "1465410777791",
    "lang": "en",
    "title": {
        "en": "Reminder - NCR - You're Invited to Experience a Community Impact ''Seeing is Believing!'' Tour",
        "fr": "Rappel - RCN - Vous \u00eates invit\u00e9s \u00e0 vivre une exp\u00e9rience unique : une visite pour voir les effets de vos dons sur la communaut\u00e9 - \u00ab Le voir, c'est le croire! \u00bb"
    },
    "modified": "2016-06-15 00:00:00.0",
    "issued": "2016-06-09 00:00:00.0",
    "type_name": "intra-intra\/news-nouv",
    "node_id": "1279030006975",
    "layout_name": "1 column",
    "created": "2017-03-31 15:46:44.0",
    "updated": "2017-03-31 15:46:44.0"
}