{
    "dcr_id": "1496338122759",
    "lang": "en",
    "title": {
        "en": "NCR - Is Agri-Toastmasters Right for You?",
        "fr": "RCN - Agri-Toastmasters: Est-ce pour vous?"
    },
    "modified": "2017-07-19 00:00:00.0",
    "issued": "2017-06-07 00:00:00.0",
    "type_name": "intra-intra\/news-nouv",
    "node_id": "1279030006975",
    "layout_name": null,
    "created": "2017-07-19 13:47:22.0",
    "updated": "2017-07-19 13:47:22.0"
}