{
    "dcr_id": "1527616469593",
    "lang": "fr",
    "title": "Activit\u00e9s de la Semaine canadienne de l'environnement - 4 au 8 juin",
    "modified": "2018-06-13 00:00:00.0",
    "issued": "2018-05-31 00:00:00.0",
    "type_name": "intra-intra\/news-nouv",
    "node_id": "1279030006975",
    "layout_name": null,
    "created": "2018-06-13 08:43:43.0",
    "updated": "2018-06-13 08:43:43.0"
}