{
    "dcr_id": "1578502792371",
    "lang": "en",
    "title": {
        "en": "AAFC's Pay Pod \u2013 December 2019",
        "fr": "\u00c9quipe mixte de paye d'AAC \u2013 d\u00e9cembre 2019"
    },
    "modified": "2020-01-08 00:00:00.0",
    "issued": "2020-01-08 00:00:00.0",
    "type_name": "intra-intra\/gene-gene",
    "node_id": "1279035583756",
    "layout_name": "1 column",
    "created": "2020-01-08 12:55:04.0",
    "updated": "2020-01-08 12:55:04.0"
}