{
    "dcr_id": "1581522383597",
    "lang": "fr",
    "title": "Conseiller(\u00e8re) en RH",
    "modified": "2020-02-17 00:00:00.0",
    "issued": "2020-02-17 00:00:00.0",
    "type_name": "intra-intra\/empl-empl",
    "node_id": "1279029955397",
    "layout_name": null,
    "created": "2020-02-17 08:08:37.0",
    "updated": "2020-02-17 08:08:37.0"
}