{
    "dcr_id": "1500910496526",
    "lang": "en",
    "title": {
        "en": "Deputy Ministers' Update - Federal, Provincial and Territorial Ministers of Agriculture Annual Conference",
        "fr": "Nouvelles des sous-ministres - Conf\u00e9rence annuelle des ministres de l'Agriculture des gouvernements f\u00e9d\u00e9ral, provinciaux et territoriaux"
    },
    "modified": "2017-07-26 00:00:00.0",
    "issued": "2017-07-24 00:00:00.0",
    "type_name": "intra-intra\/news-nouv",
    "node_id": "1279030006975",
    "layout_name": null,
    "created": "2017-07-26 13:26:44.0",
    "updated": "2017-07-26 13:26:44.0"
}