{
    "dcr_id": "1548778175474",
    "lang": "en",
    "title": {
        "en": "NCR - Security Awareness Week - February 4 to 8",
        "fr": "RCN - Semaine de la sensibilisation \u00e0 la s\u00e9curit\u00e9 - 4 au 8 f\u00e9vrier"
    },
    "modified": "2019-01-30 00:00:00.0",
    "issued": "2019-01-30 00:00:00.0",
    "type_name": "intra-intra\/news-nouv",
    "node_id": "1279030006975",
    "layout_name": null,
    "created": "2019-01-31 08:31:57.0",
    "updated": "2019-01-31 08:31:57.0"
}