{
    "dcr_id": "1560782067248",
    "lang": "en",
    "title": {
        "en": "Deputy Director, Multilateral Relations",
        "fr": "Directeur adjoint\/directrice adjointe, Relations multilat\u00e9rales"
    },
    "modified": "2019-06-19 00:00:00.0",
    "issued": "2019-06-18 00:00:00.0",
    "type_name": "intra-intra\/empl-empl",
    "node_id": "1279029955397",
    "layout_name": null,
    "created": "2019-06-19 08:04:58.0",
    "updated": "2019-06-19 08:04:58.0"
}