{
    "dcr_id": "1475676704560",
    "lang": "en",
    "title": {
        "en": "NCR - Reminder - All-Star Basketball Game - October 28",
        "fr": "RCN - Rappel - Match des \u00e9toiles de basketball - Le 28 octobre "
    },
    "modified": "2016-10-27 00:00:00.0",
    "issued": "2016-10-06 00:00:00.0",
    "type_name": "intra-intra\/news-nouv",
    "node_id": "1279030006975",
    "layout_name": "1 column",
    "created": "2017-03-31 15:46:45.0",
    "updated": "2017-03-31 15:46:45.0"
}