{
    "dcr_id": "1513633569955",
    "lang": "en",
    "title": {
        "en": "Deputy Director, Operations",
        "fr": "Directeur adjoint - op\u00e9rations"
    },
    "modified": "2017-12-20 00:00:00.0",
    "issued": "2017-12-20 00:00:00.0",
    "type_name": "intra-intra\/empl-empl",
    "node_id": "1279029955397",
    "layout_name": null,
    "created": "2017-12-20 10:36:03.0",
    "updated": "2017-12-20 10:36:03.0"
}