{
    "dcr_id": "1506954803495",
    "lang": "fr",
    "title": "Rappel - RCN - Vente de livres de la CCMTGC - Les 2 et 3 novembre",
    "modified": "2017-11-02 00:00:00.0",
    "issued": "2017-10-05 00:00:00.0",
    "type_name": "intra-intra\/news-nouv",
    "node_id": "1279030006975",
    "layout_name": null,
    "created": "2017-11-02 10:05:48.0",
    "updated": "2017-11-02 10:05:48.0"
}