{
    "dcr_id": "1489595290051",
    "lang": "en",
    "title": {
        "en": "Reminder - Scheduled Maintenance of ISB Services (911 Access) - March 24-27",
        "fr": "Rappel - Entretien pr\u00e9vu des services de la DGSI (acc\u00e8s au 911) - 24 au 27 mars"
    },
    "modified": "2017-03-22 00:00:00.0",
    "issued": "2017-03-16 00:00:00.0",
    "type_name": "intra-intra\/news-nouv",
    "node_id": "1279030006975",
    "layout_name": "1 column",
    "created": "2017-03-31 15:46:45.0",
    "updated": "2017-03-31 15:46:45.0"
}