{
    "dcr_id": "1566571125743",
    "lang": "en",
    "title": {
        "en": "New Leave Credits Completed for Eligible Current Employees ",
        "fr": "Nouveaux cr\u00e9dits de cong\u00e9 accord\u00e9s aux employ\u00e9s actuels admissibles"
    },
    "modified": "2019-08-26 00:00:00.0",
    "issued": "2019-08-26 00:00:00.0",
    "type_name": "intra-intra\/news-nouv",
    "node_id": "1279030006975",
    "layout_name": null,
    "created": "2019-08-26 11:19:00.0",
    "updated": "2019-08-26 11:19:00.0"
}