{
    "dcr_id": "1500577166037",
    "lang": "en",
    "title": {
        "en": "Senior Delivery Advisor \/ Delivery Officer ",
        "fr": "Conseiller principal en mati\u00e8re d\u2019ex\u00e9cution \/ agent d\u2019ex\u00e9cution"
    },
    "modified": "2017-07-31 00:00:00.0",
    "issued": "2017-07-21 00:00:00.0",
    "type_name": "intra-intra\/empl-empl",
    "node_id": "1279029955397",
    "layout_name": null,
    "created": "2017-07-31 16:18:05.0",
    "updated": "2017-07-31 16:18:05.0"
}