{
    "dcr_id": "1287487950140",
    "lang": "en",
    "title": {
        "en": "Canadian Pari-Mutuel Agency",
        "fr": "Agence canadienne du pari mutuel "
    },
    "modified": "2017-06-15 00:00:00.0",
    "issued": "2010-11-02 00:00:00.0",
    "type_name": "intra-intra\/gene-gene",
    "node_id": "1279030343272",
    "layout_name": "1 column",
    "created": "2017-06-15 08:10:39.0",
    "updated": "2017-06-15 08:10:39.0"
}