{
    "dcr_id": "1416508807601",
    "lang": "en",
    "title": {
        "en": "AgPal",
        "fr": "AgriGuichet"
    },
    "modified": "2018-12-20 00:00:00.0",
    "issued": "2014-11-24 00:00:00.0",
    "type_name": "intra-intra\/gene-gene",
    "node_id": "1306352625916",
    "layout_name": "1 column",
    "created": "2018-12-20 12:37:04.0",
    "updated": "2018-12-20 12:37:04.0"
}