{
    "dcr_id": "1337777184725",
    "lang": "en",
    "title": {
        "en": "Anonymous File Transfer Protocol (FTP) Service",
        "fr": "Service protocole de transfert de fichier (FTP) anonyme"
    },
    "modified": "2017-02-24 00:00:00.0",
    "issued": "2012-05-30 00:00:00.0",
    "type_name": "intra-intra\/gene-gene",
    "node_id": "1333380344003",
    "layout_name": "1 column",
    "created": "2017-03-30 13:07:01.0",
    "updated": "2017-03-30 13:07:01.0"
}