{
    "dcr_id": "1562619276358",
    "lang": "fr",
    "title": "Formation et l\u2019apprentissage en ligne",
    "modified": "2019-09-03 00:00:00.0",
    "issued": "2019-07-25 00:00:00.0",
    "type_name": "intra-intra\/gene-gene",
    "node_id": "1279035654038",
    "layout_name": "1 column",
    "created": "2019-09-03 10:31:11.0",
    "updated": "2019-09-03 10:31:11.0"
}