{
    "dcr_id": "1557335976627",
    "lang": "en",
    "title": {
        "en": "Modernizing Science Infrastructure",
        "fr": "Modernisation de l'infrastructure scientifique"
    },
    "modified": "2019-05-09 00:00:00.0",
    "issued": "2019-05-09 00:00:00.0",
    "type_name": "intra-intra\/news-nouv",
    "node_id": "1279030006975",
    "layout_name": null,
    "created": "2019-05-09 09:37:01.0",
    "updated": "2019-05-09 09:37:01.0"
}