{
    "dcr_id": "1476969794574",
    "lang": "en",
    "title": {
        "en": "Temporary Changes to Group Insurance Benefit Plans Administration Processes",
        "fr": "Processus temporaires pour l'administration des r\u00e9gimes de prestations d'assurance collective"
    },
    "modified": "2016-10-20 00:00:00.0",
    "issued": "2016-10-20 00:00:00.0",
    "type_name": "intra-intra\/news-nouv",
    "node_id": "1279030006975",
    "layout_name": "1 column",
    "created": "2017-03-31 15:46:45.0",
    "updated": "2017-03-31 15:46:45.0"
}