{
    "dcr_id": "1287498451322",
    "lang": "en",
    "title": {
        "en": "Finance and Resource Management Services Directorate",
        "fr": "Direction des services des finances et de la gestion des ressources"
    },
    "modified": "2017-11-02 00:00:00.0",
    "issued": "2010-11-09 00:00:00.0",
    "type_name": "intra-intra\/gene-gene",
    "node_id": "1279030343272",
    "layout_name": "1 column",
    "created": "2017-11-02 15:07:05.0",
    "updated": "2017-11-02 15:07:05.0"
}