{
    "dcr_id": "1335471244103",
    "lang": "en",
    "title": {
        "en": "Instant Messaging and Desktop Sharing Service",
        "fr": "Messagerie instantan\u00e9e et Service de partage de bureau"
    },
    "modified": "2017-07-28 00:00:00.0",
    "issued": "2012-05-02 00:00:00.0",
    "type_name": "intra-intra\/gene-gene",
    "node_id": "1333380344003",
    "layout_name": "1 column",
    "created": "2017-07-28 10:34:29.0",
    "updated": "2017-07-28 10:34:29.0"
}