{
    "dcr_id": "1527536878626",
    "lang": "en",
    "title": {
        "en": "Scheduled Maintenance of ISB Services - June 1- 4",
        "fr": "Entretien pr\u00e9vu des services de la DGSI - Du 1<sup>er<\/sup> au 4 juin"
    },
    "modified": "2018-06-05 00:00:00.0",
    "issued": "2018-05-31 00:00:00.0",
    "type_name": "intra-intra\/news-nouv",
    "node_id": "1279030006975",
    "layout_name": null,
    "created": "2018-06-05 15:25:11.0",
    "updated": "2018-06-05 15:25:11.0"
}