{
    "dcr_id": "1506968578339",
    "lang": "en",
    "title": {
        "en": "Reminder - Chart of the Week - Sign Up to Learn More about Canadian Agriculture",
        "fr": "Rappel - Graphique de la semaine - Abonnez-vous pour en apprendre davantage sur l'agriculture canadienne"
    },
    "modified": "2017-10-11 00:00:00.0",
    "issued": "2017-10-05 00:00:00.0",
    "type_name": "intra-intra\/news-nouv",
    "node_id": "1279030006975",
    "layout_name": null,
    "created": "2017-10-11 11:54:51.0",
    "updated": "2017-10-11 11:54:51.0"
}