{
    "dcr_id": "1537459996922",
    "lang": "en",
    "title": {
        "en": "Access and Privacy 101 \u2013 The Basics (AGR-213)",
        "fr": "Acc\u00e8s \u00e0 l\u2019information et sur la protection de la vie priv\u00e9e \u2013 Notions de base "
    },
    "modified": "2018-09-21 00:00:00.0",
    "issued": "2018-09-21 00:00:00.0",
    "type_name": "intra-intra\/gene-gene",
    "node_id": "1524660248728",
    "layout_name": "1 column",
    "created": "2018-09-21 12:26:41.0",
    "updated": "2018-09-21 12:26:41.0"
}