{
    "dcr_id": "1420658717369",
    "lang": "en",
    "title": {
        "en": "INFORMATION MANAGEMENT ANALYST",
        "fr": "ANALYSTE DE LA GESTION DE L\u2019INFORMATION"
    },
    "modified": "2015-01-13 00:00:00.0",
    "issued": "2015-01-12 00:00:00.0",
    "type_name": "intra-intra\/empl-empl",
    "node_id": "1279029955397",
    "layout_name": "1 column",
    "created": "2017-03-30 13:06:11.0",
    "updated": "2017-03-30 13:06:11.0"
}