{
    "dcr_id": "1488226222264",
    "lang": "en",
    "title": {
        "en": "Web Communications Officer (6 months assignment)",
        "fr": "Agent des communications Web (affectation de 6 mois)"
    },
    "modified": "2017-03-02 00:00:00.0",
    "issued": "2017-03-02 00:00:00.0",
    "type_name": "intra-intra\/empl-empl",
    "node_id": "1279029955397",
    "layout_name": "1 column",
    "created": "2017-03-30 13:06:11.0",
    "updated": "2017-03-30 13:06:11.0"
}