{
    "dcr_id": "1522080884509",
    "lang": "fr",
    "title": "Rappel - Sondage sur la dotation et l'impartialit\u00e9 politique de 2018 - La date limite est repouss\u00e9e au 20 avril",
    "modified": "2018-04-18 00:00:00.0",
    "issued": "2018-03-29 00:00:00.0",
    "type_name": "intra-intra\/news-nouv",
    "node_id": "1279030006975",
    "layout_name": null,
    "created": "2018-04-18 12:49:04.0",
    "updated": "2018-04-18 12:49:04.0"
}