{
    "dcr_id": "1463592890899",
    "lang": "en",
    "title": {
        "en": "Canada-Australia Public Policy Initiative Public Lecture - May 25",
        "fr": "Conf\u00e9rence dans le cadre de l'Initiative Canada-Australie en mati\u00e8re de politique publique - Le 25 mai "
    },
    "modified": "2016-05-18 00:00:00.0",
    "issued": "2016-05-18 00:00:00.0",
    "type_name": "intra-intra\/news-nouv",
    "node_id": "1279030006975",
    "layout_name": "1 column",
    "created": "2017-03-31 15:46:44.0",
    "updated": "2017-03-31 15:46:44.0"
}