{
    "dcr_id": "1494950353248",
    "lang": "en",
    "title": {
        "en": "Diversity Resources",
        "fr": "Ressources sur la diversit\u00e9"
    },
    "modified": "2017-05-17 00:00:00.0",
    "issued": "2017-05-17 00:00:00.0",
    "type_name": "intra-intra\/news-nouv",
    "node_id": "1279030006975",
    "layout_name": null,
    "created": "2017-05-17 11:44:46.0",
    "updated": "2017-05-17 11:44:46.0"
}