{
    "dcr_id": "1405693627715",
    "lang": "en",
    "title": {
        "en": "Conflict of Interest",
        "fr": "Conflits d'int\u00e9r\u00eats"
    },
    "modified": "2018-12-11 00:00:00.0",
    "issued": "2014-07-22 00:00:00.0",
    "type_name": "intra-intra\/gene-gene",
    "node_id": "1279035911647",
    "layout_name": "1 column",
    "created": "2018-12-11 07:55:18.0",
    "updated": "2018-12-11 07:55:18.0"
}