{
    "dcr_id": "1329492520008",
    "lang": "en",
    "title": {
        "en": "Staffing",
        "fr": "Dotation"
    },
    "modified": "2019-12-04 00:00:00.0",
    "issued": "2012-03-08 00:00:00.0",
    "type_name": "intra-intra\/gene-gene",
    "node_id": "1279035869288",
    "layout_name": "1 column",
    "created": "2019-12-04 14:57:31.0",
    "updated": "2019-12-04 14:57:31.0"
}