{
    "dcr_id": "1402577458610",
    "lang": "en",
    "title": {
        "en": "Considerations when Staffing",
        "fr": "Consid\u00e9rations au moment de la dotation"
    },
    "modified": "2017-05-04 00:00:00.0",
    "issued": "2014-07-03 00:00:00.0",
    "type_name": "intra-intra\/gene-gene",
    "node_id": "1279035869288",
    "layout_name": "1 column",
    "created": "2017-05-04 15:25:57.0",
    "updated": "2017-05-04 15:25:57.0"
}