{
    "dcr_id": "1424871270752",
    "lang": "en",
    "title": {
        "en": "Brian Gray",
        "fr": "Brian Gray"
    },
    "modified": "2017-02-07 00:00:00.0",
    "issued": "2015-03-02 00:00:00.0",
    "type_name": "intra-intra\/gene-gene",
    "node_id": "1300446283361",
    "layout_name": "1 column",
    "created": "2017-03-30 12:58:24.0",
    "updated": "2017-03-30 12:58:24.0"
}