{
    "dcr_id": "1363704631840",
    "lang": "en",
    "title": {
        "en": "Federal Student Work Experience Program Hiring Process",
        "fr": "Processus d'embauche du Programme f\u00e9d\u00e9ral d'exp\u00e9rience de travail \u00e9tudiant"
    },
    "modified": "2019-05-10 00:00:00.0",
    "issued": "2013-03-27 00:00:00.0",
    "type_name": "intra-intra\/gene-gene",
    "node_id": "1279035869288",
    "layout_name": "1 column",
    "created": "2019-05-10 12:31:48.0",
    "updated": "2019-05-10 12:31:48.0"
}