{
    "dcr_id": "1527687516812",
    "lang": "fr",
    "title": "Rappel - RCN - Cheval Indien: projection gratuite pour les fonctionnaires - Le 14 juin ",
    "modified": "2018-06-07 00:00:00.0",
    "issued": "2018-05-31 00:00:00.0",
    "type_name": "intra-intra\/news-nouv",
    "node_id": "1279030006975",
    "layout_name": null,
    "created": "2018-06-07 09:26:28.0",
    "updated": "2018-06-07 09:26:28.0"
}