{
    "dcr_id": "1462471545034",
    "lang": "fr",
    "title": "Rapport annuel du greffier sur la fonction publique",
    "modified": "2016-05-05 00:00:00.0",
    "issued": "2016-05-05 00:00:00.0",
    "type_name": "intra-intra\/news-nouv",
    "node_id": "1279030006975",
    "layout_name": "1 column",
    "created": "2017-03-31 15:46:44.0",
    "updated": "2017-03-31 15:46:44.0"
}