{
    "dcr_id": "1489076537015",
    "lang": "en",
    "title": {
        "en": "Our Department",
        "fr": "Notre Minist\u00e8re"
    },
    "modified": "2019-05-31 00:00:00.0",
    "issued": "2017-03-21 00:00:00.0",
    "type_name": "intra-intra\/gene-gene",
    "node_id": "1279029750897",
    "layout_name": "1 column",
    "created": "2019-05-31 09:30:03.0",
    "updated": "2019-05-31 09:30:03.0"
}