{
    "dcr_id": "1329513601852",
    "lang": "en",
    "title": {
        "en": "Exit Interview Fact Sheet for Departing Employees",
        "fr": "Feuille de renseignements sur l'entrevue de d\u00e9part \u00e0 l'intention des employ\u00e9s"
    },
    "modified": "2017-01-23 00:00:00.0",
    "issued": "2012-02-23 00:00:00.0",
    "type_name": "intra-intra\/gene-gene",
    "node_id": "1480694666448",
    "layout_name": "1 column",
    "created": "2017-03-30 13:02:28.0",
    "updated": "2017-03-30 13:02:28.0"
}