{
    "dcr_id": "1457013537751",
    "lang": "en",
    "title": {
        "en": "NCR - NHCAP - Voice Communication System and Fire Alarm Bell Testing on March 10",
        "fr": "RCN - CACPA - Test du syst\u00e8me de communication vocale et de la sonnerie d'alarme d'incendie le 10 mars"
    },
    "modified": "2016-03-03 00:00:00.0",
    "issued": "2016-03-03 00:00:00.0",
    "type_name": "intra-intra\/news-nouv",
    "node_id": "1279030006975",
    "layout_name": "1 column",
    "created": "2017-03-31 15:46:44.0",
    "updated": "2017-03-31 15:46:44.0"
}