{
    "dcr_id": "1562079992080",
    "lang": "en",
    "title": {
        "en": "NCR - Testing of Fire Alarms",
        "fr": "RCN - Mise \u00e0 l'essai de l'alarme incendie"
    },
    "modified": "2019-07-04 00:00:00.0",
    "issued": "2019-07-04 00:00:00.0",
    "type_name": "intra-intra\/news-nouv",
    "node_id": "1279030006975",
    "layout_name": null,
    "created": "2019-07-04 09:22:04.0",
    "updated": "2019-07-04 09:22:04.0"
}