{
    "dcr_id": "1517518905795",
    "lang": "fr",
    "title": "Conseiller technique, Architecture d'entreprise ",
    "modified": "2018-02-05 00:00:00.0",
    "issued": "2018-02-05 00:00:00.0",
    "type_name": "intra-intra\/empl-empl",
    "node_id": "1279029955397",
    "layout_name": null,
    "created": "2018-02-05 09:21:10.0",
    "updated": "2018-02-05 09:21:10.0"
}