{
    "dcr_id": "1556628209400",
    "lang": "en",
    "title": {
        "en": "May is International Internal Audit Awareness Month",
        "fr": "Mai est le mois international de sensibilisation \u00e0 l'audit interne"
    },
    "modified": "2019-05-02 00:00:00.0",
    "issued": "2019-05-02 00:00:00.0",
    "type_name": "intra-intra\/news-nouv",
    "node_id": "1279030006975",
    "layout_name": null,
    "created": "2019-05-02 09:55:45.0",
    "updated": "2019-05-02 09:55:45.0"
}