{
    "dcr_id": "1527514313190",
    "lang": "en",
    "title": {
        "en": "Asian Heritage Month Employee Spotlight: Dr. Thin-Meiw Choo",
        "fr": "Pleins feux sur un employ\u00e9 \u00e0 l'occasion du Mois du patrimoine asiatique : Thin-Meiw Choo (Ph. D.)"
    },
    "modified": "2018-05-31 00:00:00.0",
    "issued": "2018-05-31 00:00:00.0",
    "type_name": "intra-intra\/news-nouv",
    "node_id": "1279030006975",
    "layout_name": null,
    "created": "2018-05-31 08:10:49.0",
    "updated": "2018-05-31 08:10:49.0"
}