{
    "dcr_id": "1546874344888",
    "lang": "en",
    "title": {
        "en": "Reminder - Conversation with the Associate Deputy Minister - January 24",
        "fr": "Rappel - Conversation avec la sous-ministre d\u00e9l\u00e9gu\u00e9e - 24 janvier"
    },
    "modified": "2019-01-18 00:00:00.0",
    "issued": "2019-01-10 00:00:00.0",
    "type_name": "intra-intra\/news-nouv",
    "node_id": "1279030006975",
    "layout_name": null,
    "created": "2019-01-18 08:02:19.0",
    "updated": "2019-01-18 08:02:19.0"
}