{
    "dcr_id": "1580248309346",
    "lang": "en",
    "title": {
        "en": "This Week in <em>The Harvest<\/em> - Southern Ontario Researchers Recognized for Scientific Contributions",
        "fr": "Au menu de La Moisson cette semaine - Reconnaissance des contributions scientifiques de chercheurs dans le Sud de l\u2019Ontario"
    },
    "modified": "2020-01-30 00:00:00.0",
    "issued": "2020-01-30 00:00:00.0",
    "type_name": "intra-intra\/news-nouv",
    "node_id": "1279030006975",
    "layout_name": null,
    "created": "2020-01-30 10:58:14.0",
    "updated": "2020-01-30 10:58:14.0"
}