{
    "dcr_id": "1363284085601",
    "lang": "en",
    "title": {
        "en": "Awards and Recognition Coordinator",
        "fr": "Coordonnateur ou coordonnatrice, Prix et reconnaissance"
    },
    "modified": "2013-03-15 00:00:00.0",
    "issued": "2013-03-15 00:00:00.0",
    "type_name": "intra-intra\/empl-empl",
    "node_id": "1279029955397",
    "layout_name": "1 column",
    "created": "2017-03-30 13:06:10.0",
    "updated": "2017-03-30 13:06:10.0"
}