{
    "dcr_id": "1462562365555",
    "lang": "en",
    "title": {
        "en": "Reminder - Establishing 2016-2017 Performance Agreement and Learning and Development Plan",
        "fr": "Rappel - \u00c9tablissement de l'entente de rendement et du plan d'apprentissage et de perfectionnement pour 2016-2017"
    },
    "modified": "2016-06-09 00:00:00.0",
    "issued": "2016-05-12 00:00:00.0",
    "type_name": "intra-intra\/news-nouv",
    "node_id": "1279030006975",
    "layout_name": "1 column",
    "created": "2017-03-31 15:46:44.0",
    "updated": "2017-03-31 15:46:44.0"
}