{
    "dcr_id": "1566313632077",
    "lang": "en",
    "title": {
        "en": "Scheduled Maintenance of ISB Services (Knowledge Workspace) - August 25",
        "fr": "Entretien pr\u00e9vu des services de la DGSI (Espace de travail du savoir) - 25 ao\u00fbt"
    },
    "modified": "2019-08-22 00:00:00.0",
    "issued": "2019-08-22 00:00:00.0",
    "type_name": "intra-intra\/news-nouv",
    "node_id": "1279030006975",
    "layout_name": null,
    "created": "2019-08-22 12:22:35.0",
    "updated": "2019-08-22 12:22:35.0"
}