{
    "dcr_id": "1537284133364",
    "lang": "en",
    "title": {
        "en": "This Week in The Harvest - Everyone Has a Story to Tell",
        "fr": "Au menu de La Moisson cette semaine - Chacun a quelque chose \u00e0 raconter"
    },
    "modified": "2018-09-20 00:00:00.0",
    "issued": "2018-09-20 00:00:00.0",
    "type_name": "intra-intra\/news-nouv",
    "node_id": "1279030006975",
    "layout_name": null,
    "created": "2018-09-20 07:54:18.0",
    "updated": "2018-09-20 07:54:18.0"
}