{
    "dcr_id": "1567102881365",
    "lang": "en",
    "title": {
        "en": "Reminder - Student Orientation Session - September 19",
        "fr": "Rappel - S\u00e9ance d'orientation pour les \u00e9tudiants - Le 19 septembre"
    },
    "modified": "2019-09-11 00:00:00.0",
    "issued": "2019-09-05 00:00:00.0",
    "type_name": "intra-intra\/news-nouv",
    "node_id": "1279030006975",
    "layout_name": null,
    "created": "2019-09-11 15:12:39.0",
    "updated": "2019-09-11 15:12:39.0"
}