{
    "dcr_id": "1568735171746",
    "lang": "en",
    "title": {
        "en": "Soils, Plant Breeding and Food Safety:  September Additions to the Canadian Agriculture Library",
        "fr": "Les sols, la s\u00e9lection des v\u00e9g\u00e9taux et la salubrit\u00e9 des aliments : nouveaux titres ajout\u00e9s \u00e0 la collection de la Biblioth\u00e8que canadienne de l\u2019agriculture en septembre"
    },
    "modified": "2019-09-19 00:00:00.0",
    "issued": "2019-09-19 00:00:00.0",
    "type_name": "intra-intra\/news-nouv",
    "node_id": "1279030006975",
    "layout_name": null,
    "created": "2019-09-19 09:34:19.0",
    "updated": "2019-09-19 09:34:19.0"
}