{
    "dcr_id": "1542727010663",
    "lang": "en",
    "title": {
        "en": "Fostering a Safe and Respectful Workplace - November 29",
        "fr": "Favoriser un milieu de travail s\u00e9curitaire et respectueux - 29 novembre"
    },
    "modified": "2018-11-22 00:00:00.0",
    "issued": "2018-11-22 00:00:00.0",
    "type_name": "intra-intra\/news-nouv",
    "node_id": "1279030006975",
    "layout_name": null,
    "created": "2018-11-22 09:30:03.0",
    "updated": "2018-11-22 09:30:03.0"
}