{
    "dcr_id": "1499977663108",
    "lang": "fr",
    "title": "Lancement de la mise oeuvre de la convention collective des groupes RO, RE, EC et TR",
    "modified": "2017-07-14 00:00:00.0",
    "issued": "2017-07-14 00:00:00.0",
    "type_name": "intra-intra\/news-nouv",
    "node_id": "1279030006975",
    "layout_name": null,
    "created": "2017-07-20 10:08:11.0",
    "updated": "2017-07-20 10:08:11.0"
}