{
    "dcr_id": "1501876129387",
    "lang": "en",
    "title": {
        "en": "Program and Administration Services Collective Agreement Employee Payment Schedule",
        "fr": "Calendrier de paiement des employ\u00e9s selon la convention collective du groupe Services des programmes et de l\u2019administration"
    },
    "modified": "2017-08-09 00:00:00.0",
    "issued": "2017-08-04 00:00:00.0",
    "type_name": "intra-intra\/news-nouv",
    "node_id": "1279030006975",
    "layout_name": null,
    "created": "2017-08-09 15:37:56.0",
    "updated": "2017-08-09 15:37:56.0"
}