{
    "dcr_id": "1532361433539",
    "lang": "en",
    "title": {
        "en": "Deputy Minister's Update - Federal, Provincial and Territorial Ministers of Agriculture Annual Conference 2018",
        "fr": "Nouvelles du sous-ministre - Conf\u00e9rence annuelle de 2018 des ministres f\u00e9d\u00e9ral, provinciaux et territoriaux de l'agriculture"
    },
    "modified": "2018-07-26 00:00:00.0",
    "issued": "2018-07-23 00:00:00.0",
    "type_name": "intra-intra\/news-nouv",
    "node_id": "1279030006975",
    "layout_name": null,
    "created": "2018-07-26 09:42:14.0",
    "updated": "2018-07-26 09:42:14.0"
}