{
    "dcr_id": "1467140594124",
    "lang": "en",
    "title": {
        "en": "Video of the Week - Wild Pollinators",
        "fr": "Vid\u00e9o de la semaine - Les pollinisateurs sauvages"
    },
    "modified": "2016-06-30 00:00:00.0",
    "issued": "2016-06-30 00:00:00.0",
    "type_name": "intra-intra\/news-nouv",
    "node_id": "1279030006975",
    "layout_name": "1 column",
    "created": "2017-03-31 15:46:44.0",
    "updated": "2017-03-31 15:46:44.0"
}