{
    "dcr_id": "1456239034807",
    "lang": "en",
    "title": {
        "en": "Intellectual Property Procedures (16 of 16)",
        "fr": "Guide d'exploitation de la propri\u00e9t\u00e9 intellectuelle (16 de 16)"
    },
    "modified": "2017-02-07 00:00:00.0",
    "issued": "2016-04-27 00:00:00.0",
    "type_name": "intra-intra\/gene-gene",
    "node_id": "1374858655573",
    "layout_name": "1 column",
    "created": "2017-03-30 12:58:24.0",
    "updated": "2017-03-30 12:58:24.0"
}