{
    "dcr_id": "1471377789634",
    "lang": "en",
    "title": {
        "en": "Secure Use of Portable Storage Devices - Summer 2016 Update",
        "fr": "Utilisation s\u00e9curitaire des dispositifs de stockage portatifs - Compte rendu de l'\u00e9t\u00e9 2016"
    },
    "modified": "2016-08-18 00:00:00.0",
    "issued": "2016-08-17 00:00:00.0",
    "type_name": "intra-intra\/news-nouv",
    "node_id": "1279030006975",
    "layout_name": "1 column",
    "created": "2017-03-31 15:46:45.0",
    "updated": "2017-03-31 15:46:45.0"
}