{
    "dcr_id": "1465412316880",
    "lang": "en",
    "title": {
        "en": "NCR - National Public Service Week 2016 - Activities",
        "fr": "RCN - Activit\u00e9s de la Semaine nationale de la fonction publique de 2016"
    },
    "modified": "2016-06-09 00:00:00.0",
    "issued": "2016-06-09 00:00:00.0",
    "type_name": "intra-intra\/news-nouv",
    "node_id": "1279030006975",
    "layout_name": "1 column",
    "created": "2017-03-31 15:46:44.0",
    "updated": "2017-03-31 15:46:44.0"
}