{
    "dcr_id": "1559744233726",
    "lang": "en",
    "title": {
        "en": "NCR - National Public Service Week - June 10-14",
        "fr": "RCN - Semaine nationale de la fonction publique - du 10 au 14 juin"
    },
    "modified": "2019-06-07 00:00:00.0",
    "issued": "2019-06-06 00:00:00.0",
    "type_name": "intra-intra\/news-nouv",
    "node_id": "1279030006975",
    "layout_name": null,
    "created": "2019-06-07 12:33:13.0",
    "updated": "2019-06-07 12:33:13.0"
}