{
    "dcr_id": "1555415497816",
    "lang": "en",
    "title": {
        "en": "Travel Reminders 2019",
        "fr": "Rappels en mati\u00e8re de d\u00e9placements 2019"
    },
    "modified": "2019-04-17 00:00:00.0",
    "issued": "2019-04-17 00:00:00.0",
    "type_name": "intra-intra\/news-nouv",
    "node_id": "1279030006975",
    "layout_name": null,
    "created": "2019-04-17 17:01:12.0",
    "updated": "2019-04-17 17:01:12.0"
}