{
    "dcr_id": "1486150635883",
    "lang": "en",
    "title": {
        "en": "Manager, Corporate Business Solutions",
        "fr": "Gestionnaire, Solutions minist\u00e9rielles et op\u00e9rationnelles"
    },
    "modified": "2017-02-10 00:00:00.0",
    "issued": "2017-02-07 00:00:00.0",
    "type_name": "intra-intra\/empl-empl",
    "node_id": "1279029955397",
    "layout_name": "1 column",
    "created": "2017-03-30 13:06:11.0",
    "updated": "2017-03-30 13:06:11.0"
}