{
    "dcr_id": "1427912242216",
    "lang": "en",
    "title": {
        "en": "Executive Assistant to Regional Director",
        "fr": "Adjoint(e) ex\u00e9cutif (ve) \u00e0 la directrice r\u00e9gionale "
    },
    "modified": "2015-04-02 00:00:00.0",
    "issued": "2015-04-02 00:00:00.0",
    "type_name": "intra-intra\/empl-empl",
    "node_id": "1279029955397",
    "layout_name": "1 column",
    "created": "2017-03-30 13:06:11.0",
    "updated": "2017-03-30 13:06:11.0"
}