{
    "dcr_id": "1368560135488",
    "lang": "en",
    "title": {
        "en": "Junior Business Analyst - End User Support",
        "fr": "Analyste d\u2019entreprise d\u00e9butant \u2013 Soutien aux utilisateurs"
    },
    "modified": "2013-05-21 00:00:00.0",
    "issued": "2013-05-21 00:00:00.0",
    "type_name": "intra-intra\/empl-empl",
    "node_id": "1279029955397",
    "layout_name": "1 column",
    "created": "2017-03-30 13:06:10.0",
    "updated": "2017-03-30 13:06:10.0"
}