{
    "dcr_id": "1563295994613",
    "lang": "en",
    "title": {
        "en": "Manager checklist",
        "fr": "Liste de v\u00e9rification du gestionnaire"
    },
    "modified": "2019-08-08 00:00:00.0",
    "issued": "2019-08-08 00:00:00.0",
    "type_name": "intra-intra\/gene-gene",
    "node_id": "1279035654038",
    "layout_name": "1 column",
    "created": "2019-08-08 12:14:36.0",
    "updated": "2019-08-08 12:14:36.0"
}