{
    "dcr_id": "1415297726311",
    "lang": "en",
    "title": {
        "en": "Prepare for Your Travel",
        "fr": "Pr\u00e9parez votre voyage"
    },
    "modified": "2019-02-11 00:00:00.0",
    "issued": "2014-12-04 00:00:00.0",
    "type_name": "intra-intra\/gene-gene",
    "node_id": "1320677087463",
    "layout_name": "1 column",
    "created": "2019-02-11 12:04:14.0",
    "updated": "2019-02-11 12:04:14.0"
}