{
    "dcr_id": "1555359830080",
    "lang": "fr",
    "title": "Jeunes professionnels : Faites conna\u00eetre votre travail aux cadres sup\u00e9rieurs",
    "modified": "2019-04-18 00:00:00.0",
    "issued": "2019-04-17 00:00:00.0",
    "type_name": "intra-intra\/news-nouv",
    "node_id": "1279030006975",
    "layout_name": null,
    "created": "2019-04-24 12:37:25.0",
    "updated": "2019-04-24 12:37:25.0"
}