{
    "dcr_id": "1545168862938",
    "lang": "fr",
    "title": "Message du temps des F\u00eates de la part des cochampions du mieux-\u00eatre d'AAC",
    "modified": "2018-12-20 00:00:00.0",
    "issued": "2018-12-20 00:00:00.0",
    "type_name": "intra-intra\/news-nouv",
    "node_id": "1279030006975",
    "layout_name": null,
    "created": "2018-12-20 10:38:40.0",
    "updated": "2018-12-20 10:38:40.0"
}