{
    "dcr_id": "1453236647966",
    "lang": "en",
    "title": {
        "en": "Lunch and Learn Sessions - Young Professionals Network",
        "fr": "D\u00eeners-conf\u00e9rences - R\u00e9seau des jeunes professionnels"
    },
    "modified": "2016-01-21 00:00:00.0",
    "issued": "2016-01-21 00:00:00.0",
    "type_name": "intra-intra\/news-nouv",
    "node_id": "1279030006975",
    "layout_name": "1 column",
    "created": "2017-03-31 15:46:44.0",
    "updated": "2017-03-31 15:46:44.0"
}