{
    "dcr_id": "1499256111207",
    "lang": "fr",
    "title": "Rappel - Entretien pr\u00e9vu des services de la DGSI, y compris les services de courriel et de courriel BlackBerry - Le 15 juillet",
    "modified": "2017-07-13 00:00:00.0",
    "issued": "2017-07-05 00:00:00.0",
    "type_name": "intra-intra\/news-nouv",
    "node_id": "1279030006975",
    "layout_name": null,
    "created": "2017-07-13 09:17:30.0",
    "updated": "2017-07-13 09:17:30.0"
}