{
    "dcr_id": "1324417007473",
    "lang": "fr",
    "title": "Adjoint(e) administratif(ve), Finance",
    "modified": "2011-12-22 00:00:00.0",
    "issued": "2011-12-22 00:00:00.0",
    "type_name": "intra-intra\/empl-empl",
    "node_id": "1279029955397",
    "layout_name": "1 column",
    "created": "2017-03-30 13:06:10.0",
    "updated": "2017-03-30 13:06:10.0"
}