{
    "dcr_id": "1573668779580",
    "lang": "en",
    "title": {
        "en": "My benefits",
        "fr": "Mes avantages sociaux"
    },
    "modified": "2020-02-18 00:00:00.0",
    "issued": "2020-02-17 00:00:00.0",
    "type_name": "intra-intra\/gene-gene",
    "node_id": "1582028124845",
    "layout_name": "1 column",
    "created": "2020-02-18 07:31:43.0",
    "updated": "2020-02-18 07:31:43.0"
}