{
    "dcr_id": "1533146440946",
    "lang": "en",
    "title": {
        "en": "Deputy Minister's Announcement - Departmental Champions Update",
        "fr": "Annonce du sous-ministre - Le point sur les champions du Minist\u00e8re"
    },
    "modified": "2018-08-02 00:00:00.0",
    "issued": "2018-08-02 00:00:00.0",
    "type_name": "intra-intra\/news-nouv",
    "node_id": "1279030006975",
    "layout_name": null,
    "created": "2018-08-02 08:09:35.0",
    "updated": "2018-08-02 08:09:35.0"
}