{
    "dcr_id": "1484749428887",
    "lang": "en",
    "title": {
        "en": "Reminder - Scheduled Maintenance of ISB Services Including Email and BlackBerry Email Services - February 4",
        "fr": "Rappel - Entretien pr\u00e9vu des services de la DGSI, y compris les services de courriel et de courriel BlackBerry - Le 4 f\u00e9vrier"
    },
    "modified": "2017-02-02 00:00:00.0",
    "issued": "2017-01-19 00:00:00.0",
    "type_name": "intra-intra\/news-nouv",
    "node_id": "1279030006975",
    "layout_name": "1 column",
    "created": "2017-03-31 15:46:45.0",
    "updated": "2017-03-31 15:46:45.0"
}