{
    "dcr_id": "1467136853175",
    "lang": "fr",
    "title": "Valeurs et \u00e9thique : conflit d'int\u00e9r\u00eats",
    "modified": "2016-06-30 00:00:00.0",
    "issued": "2016-06-30 00:00:00.0",
    "type_name": "intra-intra\/news-nouv",
    "node_id": "1279030006975",
    "layout_name": "1 column",
    "created": "2017-03-31 15:46:44.0",
    "updated": "2017-03-31 15:46:44.0"
}