{
    "dcr_id": "1580838945322",
    "lang": "en",
    "title": {
        "en": "Trade Commissioner",
        "fr": "D\u00e9l\u00e9gu\u00e9 commercial"
    },
    "modified": "2020-02-05 00:00:00.0",
    "issued": "2020-02-04 00:00:00.0",
    "type_name": "intra-intra\/empl-empl",
    "node_id": "1279029955397",
    "layout_name": null,
    "created": "2020-02-05 09:42:33.0",
    "updated": "2020-02-05 09:42:33.0"
}