{
    "dcr_id": "1523285243215",
    "lang": "en",
    "title": {
        "en": "Navigating Through Change (E236)",
        "fr": "Composer avec le changement (E236)"
    },
    "modified": "2018-11-21 00:00:00.0",
    "issued": "2018-05-16 00:00:00.0",
    "type_name": "intra-intra\/gene-gene",
    "node_id": "1524660248728",
    "layout_name": "1 column",
    "created": "2018-11-21 15:01:19.0",
    "updated": "2018-11-21 15:01:19.0"
}