{
    "dcr_id": "1321371652643",
    "lang": "en",
    "title": {
        "en": "Ministerial Correspondence and Briefings Division",
        "fr": "Division de la correspondance minist\u00e9rielle et breffages"
    },
    "modified": "2018-06-14 00:00:00.0",
    "issued": "2011-11-16 00:00:00.0",
    "type_name": "intra-intra\/gene-gene",
    "node_id": "1279030367366",
    "layout_name": "1 column",
    "created": "2018-06-14 14:57:52.0",
    "updated": "2018-06-14 14:57:52.0"
}