{
    "dcr_id": "1504725610694",
    "lang": "en",
    "title": {
        "en": "Reminder - NCR - MISB's Farmers' Market - Thursdays Until September 21",
        "fr": "Rappel - RCN - March\u00e9 fermier de la DGSIM - les  jeudis jusqu'au 21 septembre"
    },
    "modified": "2017-09-13 00:00:00.0",
    "issued": "2017-09-07 00:00:00.0",
    "type_name": "intra-intra\/news-nouv",
    "node_id": "1279030006975",
    "layout_name": null,
    "created": "2017-09-13 13:07:06.0",
    "updated": "2017-09-13 13:07:06.0"
}