{
    "dcr_id": "1536177893926",
    "lang": "fr",
    "title": "RCN - Tournoi annuel de volleyball de la CCMTGC",
    "modified": "2018-09-07 00:00:00.0",
    "issued": "2018-09-06 00:00:00.0",
    "type_name": "intra-intra\/news-nouv",
    "node_id": "1279030006975",
    "layout_name": null,
    "created": "2018-09-07 10:29:12.0",
    "updated": "2018-09-07 10:29:12.0"
}