{
    "dcr_id": "1496254945799",
    "lang": "fr",
    "title": "Conseiller",
    "modified": "2017-06-01 00:00:00.0",
    "issued": "2017-06-01 00:00:00.0",
    "type_name": "intra-intra\/empl-empl",
    "node_id": "1279029955397",
    "layout_name": null,
    "created": "2017-06-01 10:35:16.0",
    "updated": "2017-06-01 10:35:16.0"
}