{
    "dcr_id": "1568141304098",
    "lang": "en",
    "title": {
        "en": "NCR - Repair of Exterior Stairs and Landings - September 9 - October 11, 2019",
        "fr": "RCN - R\u00e9paration d'escaliers et de paliers ext\u00e9rieurs - Du 9 septembre au 11 octobre 2019"
    },
    "modified": "2019-09-12 00:00:00.0",
    "issued": "2019-09-12 00:00:00.0",
    "type_name": "intra-intra\/news-nouv",
    "node_id": "1279030006975",
    "layout_name": null,
    "created": "2019-09-12 09:49:14.0",
    "updated": "2019-09-12 09:49:14.0"
}