{
    "dcr_id": "1537298109817",
    "lang": "en",
    "title": {
        "en": "Reminder - Mid-Year Review - Deadline is October 19",
        "fr": "Rappel - Examen de mi-exercice - La date limite est le 19 octobre"
    },
    "modified": "2018-10-17 00:00:00.0",
    "issued": "2018-09-26 00:00:00.0",
    "type_name": "intra-intra\/news-nouv",
    "node_id": "1279030006975",
    "layout_name": null,
    "created": "2018-10-17 15:42:11.0",
    "updated": "2018-10-17 15:42:11.0"
}