{
    "dcr_id": "1480350467550",
    "lang": "en",
    "title": {
        "en": "Reminder - RAD Seminar on Food Waste - December 9",
        "fr": "Rappel - S\u00e9minaire de la DRA sur le gaspillage alimentaire - Le 9 d\u00e9cembre"
    },
    "modified": "2016-12-06 00:00:00.0",
    "issued": "2016-12-01 00:00:00.0",
    "type_name": "intra-intra\/news-nouv",
    "node_id": "1279030006975",
    "layout_name": "1 column",
    "created": "2017-03-31 15:46:45.0",
    "updated": "2017-03-31 15:46:45.0"
}