{
    "dcr_id": "1530638015851",
    "lang": "en",
    "title": {
        "en": "The July Edition of CUE Now Available",
        "fr": "Le num\u00e9ro de juillet de l'AIDE-M\u00c9MOIRE est maintenant en ligne"
    },
    "modified": "2019-02-07 00:00:00.0",
    "issued": "2018-07-05 00:00:00.0",
    "type_name": "intra-intra\/news-nouv",
    "node_id": "1279030006975",
    "layout_name": null,
    "created": "2019-02-07 13:13:58.0",
    "updated": "2019-02-07 13:13:58.0"
}