{
    "dcr_id": "1560359465030",
    "lang": "fr",
    "title": "Message de la ministre - Semaine nationale de la fonction publique",
    "modified": "2019-06-13 00:00:00.0",
    "issued": "2019-06-13 00:00:00.0",
    "type_name": "intra-intra\/news-nouv",
    "node_id": "1279030006975",
    "layout_name": null,
    "created": "2019-06-13 13:13:20.0",
    "updated": "2019-06-13 13:13:20.0"
}