{
    "dcr_id": "1555613334922",
    "lang": "en",
    "title": {
        "en": "Reminder - Volunteer as a \"Book\" for Our Living Library",
        "fr": "Rappel - Portez-vous volontaire pour jouer le r\u00f4le d'un \u00ab livre \u00bb dans la biblioth\u00e8que vivante"
    },
    "modified": "2019-05-09 00:00:00.0",
    "issued": "2019-04-25 00:00:00.0",
    "type_name": "intra-intra\/news-nouv",
    "node_id": "1279030006975",
    "layout_name": null,
    "created": "2019-05-09 08:09:11.0",
    "updated": "2019-05-09 08:09:11.0"
}