{
    "dcr_id": "1564683325439",
    "lang": "en",
    "title": {
        "en": "Commercialization Officer",
        "fr": "Agent de commercialisation"
    },
    "modified": "2019-08-09 00:00:00.0",
    "issued": "2019-08-06 00:00:00.0",
    "type_name": "intra-intra\/empl-empl",
    "node_id": "1279029955397",
    "layout_name": null,
    "created": "2019-08-09 10:49:53.0",
    "updated": "2019-08-09 10:49:53.0"
}