{
    "dcr_id": "1479923088383",
    "lang": "en",
    "title": {
        "en": "Scheduled Maintenance of ISB Services - November 25-27",
        "fr": "Entretien pr\u00e9vu des services de la DGSI - Du 25 au 27 novembre"
    },
    "modified": "2016-11-24 00:00:00.0",
    "issued": "2016-11-24 00:00:00.0",
    "type_name": "intra-intra\/news-nouv",
    "node_id": "1279030006975",
    "layout_name": "1 column",
    "created": "2017-03-31 15:46:45.0",
    "updated": "2017-03-31 15:46:45.0"
}