{
    "node_id": "1320677087463",
    "parent_node_id": "1279030343272",
    "dc_id": "1320429524077",
    "landingPageUrl": {
        "en": "1320429524077",
        "fr": "1320429524077"
    },
    "parent_dc_id": "1287488508793",
    "node_title": {
        "en": "null",
        "fr": "null"
    },
    "title": {
        "en": "Services",
        "fr": "Services"
    },
    "type": "find_people"
}