{
    "dcr_id": "1508255344393",
    "lang": "en",
    "title": {
        "en": "Healthy Workplace Month - Events Schedule for October 23-31",
        "fr": "Mois de la sant\u00e9 au travail - Calendrier des activit\u00e9s du 23 au 31 octobre"
    },
    "modified": "2017-10-25 00:00:00.0",
    "issued": "2017-10-19 00:00:00.0",
    "type_name": "intra-intra\/news-nouv",
    "node_id": "1279030006975",
    "layout_name": null,
    "created": "2017-10-25 08:52:56.0",
    "updated": "2017-10-25 08:52:56.0"
}