{
    "dcr_id": "1542822852469",
    "lang": "en",
    "title": {
        "en": "Overpaid? 2018 Income Tax Implications",
        "fr": "Trop pay\u00e9? R\u00e9percussions fiscales pour 2018"
    },
    "modified": "2018-11-22 00:00:00.0",
    "issued": "2018-11-22 00:00:00.0",
    "type_name": "intra-intra\/news-nouv",
    "node_id": "1279030006975",
    "layout_name": null,
    "created": "2018-11-22 13:10:10.0",
    "updated": "2018-11-22 13:10:10.0"
}