{
    "dcr_id": "1495553433140",
    "lang": "en",
    "title": {
        "en": "Introducing National AccessAbility Week to Promote Accessibility Every Day, Everywhere in Canada",
        "fr": "Pr\u00e9sentation de la Semaine nationale de l'accessibilit\u00e9 : Promouvoir l'accessibilit\u00e9 tous les jours, partout au Canada"
    },
    "modified": "2017-05-25 00:00:00.0",
    "issued": "2017-05-24 00:00:00.0",
    "type_name": "intra-intra\/news-nouv",
    "node_id": "1279030006975",
    "layout_name": null,
    "created": "2017-05-25 08:52:08.0",
    "updated": "2017-05-25 08:52:08.0"
}