{
    "dcr_id": "1530023526740",
    "lang": "fr",
    "title": "Au menu de La Moisson cette semaine - La fresque qui a \u00e9chapp\u00e9 au boulet de d\u00e9molition ",
    "modified": "2018-06-28 00:00:00.0",
    "issued": "2018-06-28 00:00:00.0",
    "type_name": "intra-intra\/news-nouv",
    "node_id": "1279030006975",
    "layout_name": null,
    "created": "2018-06-28 09:18:37.0",
    "updated": "2018-06-28 09:18:37.0"
}