{
    "dcr_id": "1311799574349",
    "lang": "en",
    "title": {
        "en": "Exhibits Best Practices Video: Disengage",
        "fr": "Vid\u00e9o - Pratiques exemplaires pour les exposants : Conclusion"
    },
    "modified": "2017-02-07 00:00:00.0",
    "issued": "2011-08-02 00:00:00.0",
    "type_name": "intra-intra\/gene-gene",
    "node_id": "1279030317647",
    "layout_name": "1 column",
    "created": "2017-03-30 12:58:24.0",
    "updated": "2017-03-30 12:58:24.0"
}