{
    "dcr_id": "1533652168128",
    "lang": "en",
    "title": {
        "en": "Reminder - Traditional Knowledge and Environmental Governance - September 6",
        "fr": "Rappel - Le savoir traditionnel et la gouvernance en mati\u00e8re d'environnement - 6 septembre "
    },
    "modified": "2018-08-31 00:00:00.0",
    "issued": "2018-08-08 00:00:00.0",
    "type_name": "intra-intra\/news-nouv",
    "node_id": "1279030006975",
    "layout_name": null,
    "created": "2018-08-31 10:53:12.0",
    "updated": "2018-08-31 10:53:12.0"
}