{
    "dcr_id": "1401816513460",
    "lang": "en",
    "title": {
        "en": "Administrative Assistant \u2013 BP2020 Secretariat",
        "fr": "Adjoint administratif \u2013 Secr\u00e9tariat d'Objectif 2020 "
    },
    "modified": "2014-06-09 00:00:00.0",
    "issued": "2014-06-03 00:00:00.0",
    "type_name": "intra-intra\/empl-empl",
    "node_id": "1279029955397",
    "layout_name": "1 column",
    "created": "2017-03-30 13:06:10.0",
    "updated": "2017-03-30 13:06:10.0"
}