{
    "dcr_id": "1453818517128",
    "lang": "en",
    "title": {
        "en": "Security Awareness Week 2016",
        "fr": "Semaine de sensibilisation \u00e0 la s\u00e9curit\u00e9 2016"
    },
    "modified": "2018-03-23 00:00:00.0",
    "issued": "2016-02-04 00:00:00.0",
    "type_name": "intra-intra\/news-nouv",
    "node_id": "1279030006975",
    "layout_name": "1 column",
    "created": "2018-03-23 15:04:40.0",
    "updated": "2018-03-23 15:04:40.0"
}