{
    "dcr_id": "1503325824613",
    "lang": "en",
    "title": {
        "en": "NCR - Baconpalooza - August 25 to 27",
        "fr": "RCN - Festival du bacon - Du 25 au 27 ao\u00fbt"
    },
    "modified": "2017-08-29 00:00:00.0",
    "issued": "2017-08-23 00:00:00.0",
    "type_name": "intra-intra\/news-nouv",
    "node_id": "1279030006975",
    "layout_name": null,
    "created": "2017-08-29 11:52:07.0",
    "updated": "2017-08-29 11:52:07.0"
}