{
    "dcr_id": "1501774273011",
    "lang": "en",
    "title": {
        "en": "Throwback Thursday - Hire a Student ",
        "fr": "Jeudi r\u00e9tro - Embaucher un \u00e9tudiant "
    },
    "modified": "2017-08-10 00:00:00.0",
    "issued": "2017-08-09 00:00:00.0",
    "type_name": "intra-intra\/news-nouv",
    "node_id": "1279030006975",
    "layout_name": null,
    "created": "2017-08-10 10:09:05.0",
    "updated": "2017-08-10 10:09:05.0"
}