{
    "dcr_id": "1509479870520",
    "lang": "en",
    "title": {
        "en": "Reminder - Call Letter: Forum for Young Canadians Seeking Volunteer Group Leaders - Deadline is November 24",
        "fr": "Rappel - Lettre d'appel : Le Forum pour jeunes Canadiens \u00e0 la recherche de chefs de groupe b\u00e9n\u00e9voles - La date limite est le 24 novembre"
    },
    "modified": "2017-11-15 00:00:00.0",
    "issued": "2017-11-02 00:00:00.0",
    "type_name": "intra-intra\/news-nouv",
    "node_id": "1279030006975",
    "layout_name": null,
    "created": "2017-11-15 15:50:37.0",
    "updated": "2017-11-15 15:50:37.0"
}