{
    "node_id": "1279030317647",
    "parent_node_id": "1279029900850",
    "dc_id": {
        "en": "1287487121135",
        "fr": "1287487121135"
    },
    "title": {
        "en": "null",
        "fr": "null"
    },
    "breadcrumb": {
        "en": "Public Affairs Branch",
        "fr": "Direction g\u00c3\u00a9n\u00c3\u00a9rale des affaires publiques"
    },
    "type": "find_people"
}