{
    "dcr_id": "1291147044686",
    "lang": "en",
    "title": {
        "en": "Ethics Advisory Board",
        "fr": "Conseil consultatif en mati\u00e8re d'\u00e9thique"
    },
    "modified": "2016-09-22 00:00:00.0",
    "issued": "2010-12-09 00:00:00.0",
    "type_name": "intra-intra\/gene-gene",
    "node_id": "1279035911647",
    "layout_name": "1 column",
    "created": "2017-03-30 13:04:01.0",
    "updated": "2017-03-30 13:04:01.0"
}