{
    "dcr_id": "1288733160934",
    "lang": "fr",
    "title": "<NULL>",
    "modified": "<NULL>",
    "issued": "2010-11-02 00:00:00.0",
    "type_name": "intra-intra\/widg-widg",
    "node_id": "<NULL>",
    "layout_name": null,
    "created": "2017-03-30 13:06:44.0",
    "updated": "2017-03-30 13:06:44.0"
}