{
    "dcr_id": "1545167756487",
    "lang": "fr",
    "title": "Au menu de La Moisson cette semaine - La musique, la fonction publique et l'avenir \u00e0 AAC - Rencontre avec la sous-ministre d\u00e9l\u00e9gu\u00e9e Annette Gibbons",
    "modified": "2018-12-27 00:00:00.0",
    "issued": "2018-12-20 00:00:00.0",
    "type_name": "intra-intra\/news-nouv",
    "node_id": "1279030006975",
    "layout_name": null,
    "created": "2018-12-27 08:41:04.0",
    "updated": "2018-12-27 08:41:04.0"
}