{
    "node_id": "1492537962455",
    "parent_node_id": "1320677087463",
    "dc_id": "1325875953386",
    "landingPageUrl": {
        "en": "1325875953386",
        "fr": "1325875953386"
    },
    "parent_dc_id": "1320429524077",
    "node_title": {
        "en": "null",
        "fr": "null"
    },
    "title": {
        "en": "Financial Training and Development",
        "fr": "Formation financi\u00c3\u00a8re et perfectionnement"
    },
    "type": "find_people"
}