{
    "dcr_id": "1565120163397",
    "lang": "fr",
    "title": "Au menu de La Moisson cette semaine - Contr\u00f4le \u00e0 distance de productions agricoles",
    "modified": "2019-08-08 00:00:00.0",
    "issued": "2019-08-08 00:00:00.0",
    "type_name": "intra-intra\/news-nouv",
    "node_id": "1279030006975",
    "layout_name": null,
    "created": "2019-08-08 09:49:16.0",
    "updated": "2019-08-08 09:49:16.0"
}