{
    "dcr_id": "1476895526406",
    "lang": "en",
    "title": {
        "en": "NCR - Reminder - Show You Scare for GCWCC",
        "fr": "RCN - Rappel - Montrez votre petit c\u00f4t\u00e9 g\u00e9n\u00e9reusement terrifiant dans le cadre de la CCMTGC"
    },
    "modified": "2016-10-27 00:00:00.0",
    "issued": "2016-10-20 00:00:00.0",
    "type_name": "intra-intra\/news-nouv",
    "node_id": "1279030006975",
    "layout_name": "1 column",
    "created": "2017-03-31 15:46:45.0",
    "updated": "2017-03-31 15:46:45.0"
}