{
    "dcr_id": "1543262648436",
    "lang": "en",
    "title": {
        "en": "AAFC's Mental Health Strategy ",
        "fr": "Strat\u00e9gie en mati\u00e8re de sant\u00e9 mentale d'AAC"
    },
    "modified": "2018-11-28 00:00:00.0",
    "issued": "2018-11-28 00:00:00.0",
    "type_name": "intra-intra\/news-nouv",
    "node_id": "1279030006975",
    "layout_name": null,
    "created": "2018-11-28 13:31:12.0",
    "updated": "2018-11-28 13:31:12.0"
}