{
    "dcr_id": "1486741607833",
    "lang": "fr",
    "title": "Rappel - Auto-identification - Pourquoi demander? Pourquoi r\u00e9pondre?",
    "modified": "2017-03-16 00:00:00.0",
    "issued": "2017-02-16 00:00:00.0",
    "type_name": "intra-intra\/news-nouv",
    "node_id": "1279030006975",
    "layout_name": "1 column",
    "created": "2017-03-31 15:46:45.0",
    "updated": "2017-03-31 15:46:45.0"
}