{
    "dcr_id": "1456413774611",
    "lang": "en",
    "title": {
        "en": "Intellectual Property Decision-Making Manual (1 of 6)",
        "fr": "Manuel de prise de d\u00e9cision en mati\u00e8re de propri\u00e9t\u00e9 intellectuelle (1 de 6)"
    },
    "modified": "2017-02-07 00:00:00.0",
    "issued": "2016-04-27 00:00:00.0",
    "type_name": "intra-intra\/gene-gene",
    "node_id": "1374858655573",
    "layout_name": "1 column",
    "created": "2017-03-30 12:58:24.0",
    "updated": "2017-03-30 12:58:24.0"
}