{
    "dcr_id": "1502722439677",
    "lang": "fr",
    "title": "RCN - R\u00e9novation des salles de toilettes de la tour 7",
    "modified": "2017-08-17 00:00:00.0",
    "issued": "2017-08-16 00:00:00.0",
    "type_name": "intra-intra\/news-nouv",
    "node_id": "1279030006975",
    "layout_name": null,
    "created": "2017-08-17 08:57:58.0",
    "updated": "2017-08-17 08:57:58.0"
}