{
    "dcr_id": "1478006300464",
    "lang": "fr",
    "title": "Rappel - S\u00e9rie de discussions sur le leadership : L'art de mobiliser les employ\u00e9s - Le 23 novembre",
    "modified": "2016-11-16 00:00:00.0",
    "issued": "2016-11-03 00:00:00.0",
    "type_name": "intra-intra\/news-nouv",
    "node_id": "1279030006975",
    "layout_name": "1 column",
    "created": "2017-03-31 15:46:45.0",
    "updated": "2017-03-31 15:46:45.0"
}