{
    "dcr_id": "1530295940910",
    "lang": "en",
    "title": {
        "en": "NCR - Save Valuable Time - Visit the Canadian Agriculture Library - July 11",
        "fr": "RCN - Gagnez du temps en visitant la Biblioth\u00e8que canadienne de l'agriculture - 11 juillet"
    },
    "modified": "2018-07-05 00:00:00.0",
    "issued": "2018-07-05 00:00:00.0",
    "type_name": "intra-intra\/news-nouv",
    "node_id": "1279030006975",
    "layout_name": null,
    "created": "2018-07-05 08:15:25.0",
    "updated": "2018-07-05 08:15:25.0"
}