{
    "dcr_id": "1567088304131",
    "lang": "fr",
    "title": "Mise \u00e0 jour sur les r\u00e9servations de voyage",
    "modified": "2019-09-05 00:00:00.0",
    "issued": "2019-09-05 00:00:00.0",
    "type_name": "intra-intra\/news-nouv",
    "node_id": "1279030006975",
    "layout_name": null,
    "created": "2019-09-05 09:43:42.0",
    "updated": "2019-09-05 09:43:42.0"
}