{
    "dcr_id": "1507664792928",
    "lang": "fr",
    "title": "Conflits non r\u00e9solus : l'impact sur le mieux \u00eatre au travail",
    "modified": "2017-10-11 00:00:00.0",
    "issued": "2017-10-11 00:00:00.0",
    "type_name": "intra-intra\/news-nouv",
    "node_id": "1279030006975",
    "layout_name": null,
    "created": "2017-10-11 15:57:25.0",
    "updated": "2017-10-11 15:57:25.0"
}