{
    "dcr_id": "1363008060670",
    "lang": "en",
    "title": {
        "en": "Web Analyst",
        "fr": "Analyste sur le web"
    },
    "modified": "2013-03-12 00:00:00.0",
    "issued": "2013-03-12 00:00:00.0",
    "type_name": "intra-intra\/empl-empl",
    "node_id": "1279029955397",
    "layout_name": "1 column",
    "created": "2017-03-30 13:06:10.0",
    "updated": "2017-03-30 13:06:10.0"
}