{
    "dcr_id": "1497984922288",
    "lang": "en",
    "title": {
        "en": "Reminder - NCR - Calling All Students in the NCR! Conversation with the Deputy Minister - July 11",
        "fr": "Rappel - RCN - Appel \u00e0 tous les \u00e9tudiants dans la RCN! Conversation avec le sous ministre - 11 juillet"
    },
    "modified": "2017-06-28 00:00:00.0",
    "issued": "2017-06-21 00:00:00.0",
    "type_name": "intra-intra\/news-nouv",
    "node_id": "1279030006975",
    "layout_name": null,
    "created": "2017-06-28 13:13:48.0",
    "updated": "2017-06-28 13:13:48.0"
}