{
    "dcr_id": "1567517546875",
    "lang": "en",
    "title": {
        "en": "September 10 is World Suicide Prevention Day",
        "fr": "Le 10 septembre est la Journ\u00e9e mondiale de la pr\u00e9vention du suicide"
    },
    "modified": "2019-09-05 00:00:00.0",
    "issued": "2019-09-05 00:00:00.0",
    "type_name": "intra-intra\/news-nouv",
    "node_id": "1279030006975",
    "layout_name": null,
    "created": "2019-09-05 09:49:10.0",
    "updated": "2019-09-05 09:49:10.0"
}