{
    "dcr_id": "1525882997082",
    "lang": "en",
    "title": {
        "en": "Reminder - Aboriginal Awareness Week - May 22 to 25",
        "fr": "Rappel - Semaine de sensibilisation aux cultures autochtones - 22 au 25 mai"
    },
    "modified": "2018-05-16 00:00:00.0",
    "issued": "2018-05-09 00:00:00.0",
    "type_name": "intra-intra\/news-nouv",
    "node_id": "1279030006975",
    "layout_name": null,
    "created": "2018-05-16 15:16:14.0",
    "updated": "2018-05-16 15:16:14.0"
}