{
    "dcr_id": "1508443227032",
    "lang": "en",
    "title": {
        "en": "Scheduled Maintenance of ISB Services - November 1",
        "fr": "Entretien pr\u00e9vu des services de la DGSI - Le 1<sup>er<\/sup> novembre"
    },
    "modified": "2017-10-25 00:00:00.0",
    "issued": "2017-10-25 00:00:00.0",
    "type_name": "intra-intra\/news-nouv",
    "node_id": "1279030006975",
    "layout_name": null,
    "created": "2017-10-25 15:54:21.0",
    "updated": "2017-10-25 15:54:21.0"
}