{
    "dcr_id": "1571762996169",
    "lang": "fr",
    "title": "Agent de projet",
    "modified": "2019-10-23 00:00:00.0",
    "issued": "2019-10-23 00:00:00.0",
    "type_name": "intra-intra\/empl-empl",
    "node_id": "1279029955397",
    "layout_name": null,
    "created": "2019-10-23 15:24:51.0",
    "updated": "2019-10-23 15:24:51.0"
}