{
    "dcr_id": "1525712483216",
    "lang": "en",
    "title": {
        "en": "Mental Health Week",
        "fr": "La Semaine de la sant\u00e9 mentale"
    },
    "modified": "2018-05-07 00:00:00.0",
    "issued": "2018-05-07 00:00:00.0",
    "type_name": "intra-intra\/news-nouv",
    "node_id": "1279030006975",
    "layout_name": null,
    "created": "2018-05-07 13:12:44.0",
    "updated": "2018-05-07 13:12:44.0"
}