{
    "dcr_id": "1487012956124",
    "lang": "fr",
    "title": "Un nouveau num\u00e9ro d'Agri-info est maintenant publi\u00e9",
    "modified": "2017-02-17 00:00:00.0",
    "issued": "2017-02-16 00:00:00.0",
    "type_name": "intra-intra\/news-nouv",
    "node_id": "1279030006975",
    "layout_name": "1 column",
    "created": "2017-03-31 15:46:45.0",
    "updated": "2017-03-31 15:46:45.0"
}