{
    "dcr_id": "1524584125845",
    "lang": "en",
    "title": {
        "en": "Policy Analyst\/Economist",
        "fr": "Analyste des politiques\/\u00e9conomiste"
    },
    "modified": "2018-04-24 00:00:00.0",
    "issued": "2018-04-24 00:00:00.0",
    "type_name": "intra-intra\/empl-empl",
    "node_id": "1279029955397",
    "layout_name": null,
    "created": "2018-04-24 15:12:15.0",
    "updated": "2018-04-24 15:12:15.0"
}