{
    "dcr_id": "1520966562289",
    "lang": "fr",
    "title": "Analyste des investissements (PPEC)",
    "modified": "2018-03-19 00:00:00.0",
    "issued": "2018-03-16 00:00:00.0",
    "type_name": "intra-intra\/empl-empl",
    "node_id": "1279029955397",
    "layout_name": null,
    "created": "2018-03-19 10:22:54.0",
    "updated": "2018-03-19 10:22:54.0"
}