{
    "dcr_id": "1564503225182",
    "lang": "en",
    "title": {
        "en": "Upcoming - The 2019 Student Exit Survey ",
        "fr": "Lancement prochain du sondage de fin d\u2019emploi \u00e9tudiant 2019 "
    },
    "modified": "2019-08-01 00:00:00.0",
    "issued": "2019-08-01 00:00:00.0",
    "type_name": "intra-intra\/news-nouv",
    "node_id": "1279030006975",
    "layout_name": null,
    "created": "2019-08-01 09:30:35.0",
    "updated": "2019-08-01 09:30:35.0"
}