{
    "dcr_id": "1484773766797",
    "lang": "en",
    "title": {
        "en": "Preview Creative Concepts for New Corporate Look - January 24",
        "fr": "Aper\u00e7u des concepts cr\u00e9atifs pour la nouvelle image minist\u00e9rielle - Le 24 janvier"
    },
    "modified": "2017-01-19 00:00:00.0",
    "issued": "2017-01-19 00:00:00.0",
    "type_name": "intra-intra\/news-nouv",
    "node_id": "1279030006975",
    "layout_name": "1 column",
    "created": "2017-03-31 15:46:45.0",
    "updated": "2017-03-31 15:46:45.0"
}