{
    "dcr_id": "1322660723839",
    "lang": "en",
    "title": {
        "en": "Integrated Services",
        "fr": "Services int\u00e9gr\u00e9s"
    },
    "modified": "2019-12-05 00:00:00.0",
    "issued": "2011-12-09 00:00:00.0",
    "type_name": "intra-intra\/gene-gene",
    "node_id": "1575547477796",
    "layout_name": "1 column",
    "created": "2019-12-05 07:25:05.0",
    "updated": "2019-12-05 07:25:05.0"
}