{
    "dcr_id": "1554299645135",
    "lang": "en",
    "title": {
        "en": "CUE: A Quick Reference Tool for Managers",
        "fr": "AIDE-M\u00c9MOIRE : Outil de reference rapide \u00e0 l\u2019intention des gestionnaires"
    },
    "modified": "2020-02-05 00:00:00.0",
    "issued": "2019-04-04 00:00:00.0",
    "type_name": "intra-intra\/gene-gene",
    "node_id": "1313612045286",
    "layout_name": "1 column",
    "created": "2020-02-05 07:35:52.0",
    "updated": "2020-02-05 07:35:52.0"
}