{
    "dcr_id": "1324415305993",
    "lang": "fr",
    "title": "AgriApps",
    "modified": "2017-05-01 00:00:00.0",
    "issued": "2012-01-03 00:00:00.0",
    "type_name": "intra-intra\/gene-gene",
    "node_id": "1333380344003",
    "layout_name": "1 column",
    "created": "2017-05-01 14:16:50.0",
    "updated": "2017-05-01 14:16:50.0"
}