{
    "dcr_id": "1496160951038",
    "lang": "en",
    "title": {
        "en": "NCR - National Public Service Week Activities - June 12-16",
        "fr": "RCN - Activit\u00e9s de la Semaine nationale de la fonction publique dans la RCN - Du 12 au 16 juin"
    },
    "modified": "2017-06-08 00:00:00.0",
    "issued": "2017-05-31 00:00:00.0",
    "type_name": "intra-intra\/news-nouv",
    "node_id": "1279030006975",
    "layout_name": null,
    "created": "2017-06-08 11:36:44.0",
    "updated": "2017-06-08 11:36:44.0"
}