{
    "dcr_id": "1568740819714",
    "lang": "fr",
    "title": "Analyste subalterne",
    "modified": "2019-09-23 00:00:00.0",
    "issued": "2019-09-18 00:00:00.0",
    "type_name": "intra-intra\/empl-empl",
    "node_id": "1279029955397",
    "layout_name": null,
    "created": "2019-09-23 11:55:44.0",
    "updated": "2019-09-23 11:55:44.0"
}