{
    "dcr_id": "1527002681052",
    "lang": "en",
    "title": {
        "en": "National AccessAbility Week: Promoting Accessibility Every Day, Everywhere in Canada ",
        "fr": "Semaine nationale de l'accessibilit\u00e9 : Faire la promotion de l'accessibilit\u00e9 tous les jours, partout au Canada"
    },
    "modified": "2018-05-24 00:00:00.0",
    "issued": "2018-05-24 00:00:00.0",
    "type_name": "intra-intra\/news-nouv",
    "node_id": "1279030006975",
    "layout_name": null,
    "created": "2018-05-24 09:38:48.0",
    "updated": "2018-05-24 09:38:48.0"
}