{
    "dcr_id": "1353679831861",
    "lang": "fr",
    "title": "Engagement en mati\u00e8re de service",
    "modified": "2017-02-07 00:00:00.0",
    "issued": "2012-11-23 00:00:00.0",
    "type_name": "intra-intra\/gene-gene",
    "node_id": "1279029869959",
    "layout_name": "1 column",
    "created": "2017-03-30 12:58:24.0",
    "updated": "2017-03-30 12:58:24.0"
}