{
    "dcr_id": "1496165740677",
    "lang": "en",
    "title": {
        "en": "Impacts of Food Label Regulatory Changes on Canada's Food Processing Sector - June 6",
        "fr": "Modifications \u00e0 la r\u00e9glementation sur l'\u00e9tiquetage des aliments : r\u00e9percussions pour l'industrie canadienne de la transformation des aliments - Le 6 juin"
    },
    "modified": "2017-06-01 00:00:00.0",
    "issued": "2017-05-31 00:00:00.0",
    "type_name": "intra-intra\/news-nouv",
    "node_id": "1279030006975",
    "layout_name": null,
    "created": "2017-06-01 11:15:30.0",
    "updated": "2017-06-01 11:15:30.0"
}