{
    "dcr_id": "1389206028390",
    "lang": "en",
    "title": {
        "en": "Human Resources Advisor",
        "fr": "Conseiller ou Conseill\u00e8re en Ressources humaines"
    },
    "modified": "2014-01-09 00:00:00.0",
    "issued": "2014-01-09 00:00:00.0",
    "type_name": "intra-intra\/empl-empl",
    "node_id": "1279029955397",
    "layout_name": "1 column",
    "created": "2017-03-30 13:06:10.0",
    "updated": "2017-03-30 13:06:10.0"
}