{
    "dcr_id": "1432671669646",
    "lang": "en",
    "title": {
        "en": "<NULL>",
        "fr": "<NULL>"
    },
    "modified": "<NULL>",
    "issued": "2016-11-08 00:00:00.0",
    "type_name": "intra-intra\/widg-widg",
    "node_id": "<NULL>",
    "layout_name": null,
    "created": "2017-07-27 17:18:21.0",
    "updated": "2017-07-27 17:18:21.0"
}