{
    "dcr_id": "1541180101069",
    "lang": "en",
    "title": {
        "en": "Minister\u2019s Scheduling Assistant",
        "fr": "Adjoint(e) \u00e0 la planification du ministre "
    },
    "modified": "2018-11-02 00:00:00.0",
    "issued": "2018-11-02 00:00:00.0",
    "type_name": "intra-intra\/empl-empl",
    "node_id": "1279029955397",
    "layout_name": null,
    "created": "2018-11-02 14:23:22.0",
    "updated": "2018-11-02 14:23:22.0"
}