{
    "dcr_id": "1524840072258",
    "lang": "fr",
    "title": "RCN - Maple Leaf Property Management - Le programme de lutte contre les animaux nuisibles au CACPA",
    "modified": "2018-05-03 00:00:00.0",
    "issued": "2018-05-03 00:00:00.0",
    "type_name": "intra-intra\/news-nouv",
    "node_id": "1279030006975",
    "layout_name": null,
    "created": "2018-05-03 08:13:19.0",
    "updated": "2018-05-03 08:13:19.0"
}