{
    "dcr_id": "1463423935896",
    "lang": "en",
    "title": {
        "en": "NCR - Reminder - Research Development Centre Participating in Doors Open Ottawa - June 5",
        "fr": "RCN - Rappel - Le Centre de recherche et de d\u00e9veloppement participe \u00e0 l'\u00e9v\u00e9nement Portes ouvertes Ottawa - Le 5 juin"
    },
    "modified": "2016-05-25 00:00:00.0",
    "issued": "2016-05-19 00:00:00.0",
    "type_name": "intra-intra\/news-nouv",
    "node_id": "1279030006975",
    "layout_name": "1 column",
    "created": "2017-03-31 15:46:44.0",
    "updated": "2017-03-31 15:46:44.0"
}