{
    "dcr_id": "1327684996323",
    "lang": "en",
    "title": {
        "en": "Listserv (electronic mailing list)",
        "fr": "Listserv (liste postale \u00e9lectronique)"
    },
    "modified": "2019-09-19 00:00:00.0",
    "issued": "2012-02-01 00:00:00.0",
    "type_name": "intra-intra\/gene-gene",
    "node_id": "1333380344003",
    "layout_name": "1 column",
    "created": "2019-09-19 10:25:44.0",
    "updated": "2019-09-19 10:25:44.0"
}