{
    "dcr_id": "1455832080452",
    "lang": "en",
    "title": {
        "en": "Black History Month: Canada's First Black Man Appointed to the Senate",
        "fr": "Mois de l'histoire des Noirs : Premier s\u00e9nateur noir au Canada"
    },
    "modified": "2016-02-23 00:00:00.0",
    "issued": "2016-02-23 00:00:00.0",
    "type_name": "intra-intra\/news-nouv",
    "node_id": "1279030006975",
    "layout_name": "1 column",
    "created": "2017-03-31 15:46:44.0",
    "updated": "2017-03-31 15:46:44.0"
}