{
    "dcr_id": "1485794267759",
    "lang": "fr",
    "title": "Semaine de la sensibilisation \u00e0 la s\u00e9curit\u00e9 2017",
    "modified": "2017-02-02 00:00:00.0",
    "issued": "2017-01-30 00:00:00.0",
    "type_name": "intra-intra\/news-nouv",
    "node_id": "1279030006975",
    "layout_name": "1 column",
    "created": "2017-03-31 15:46:45.0",
    "updated": "2017-03-31 15:46:45.0"
}