{
    "dcr_id": "1280425702812",
    "lang": "fr",
    "title": "<NULL>",
    "modified": "<NULL>",
    "issued": "2010-09-28 00:00:00.0",
    "type_name": "intra-intra\/list-list",
    "node_id": "<NULL>",
    "layout_name": null,
    "created": "2017-03-30 12:57:29.0",
    "updated": "2017-03-30 12:57:29.0"
}