{
    "dcr_id": "1552679321672",
    "lang": "en",
    "title": {
        "en": " Policy Analyst ",
        "fr": "Analyste des politiques"
    },
    "modified": "2019-03-21 00:00:00.0",
    "issued": "2019-03-21 00:00:00.0",
    "type_name": "intra-intra\/empl-empl",
    "node_id": "1279029955397",
    "layout_name": null,
    "created": "2019-03-21 13:42:50.0",
    "updated": "2019-03-21 13:42:50.0"
}