{
    "dcr_id": "1494853027463",
    "lang": "en",
    "title": {
        "en": "Government of Canada Employees Travelling on Official Government Business",
        "fr": "Employ\u00e9s du gouvernement du Canada qui voyagent en service command\u00e9"
    },
    "modified": "2017-05-17 00:00:00.0",
    "issued": "2017-05-17 00:00:00.0",
    "type_name": "intra-intra\/news-nouv",
    "node_id": "1279030006975",
    "layout_name": null,
    "created": "2017-05-18 09:28:32.0",
    "updated": "2017-05-18 09:28:32.0"
}