{
    "dcr_id": "1532372246989",
    "lang": "en",
    "title": {
        "en": "Introducing the Indigenous Peoples Atlas of Canada",
        "fr": "L'Atlas des peuples autochtones du Canada"
    },
    "modified": "2018-07-26 00:00:00.0",
    "issued": "2018-07-26 00:00:00.0",
    "type_name": "intra-intra\/news-nouv",
    "node_id": "1279030006975",
    "layout_name": null,
    "created": "2018-07-26 15:48:29.0",
    "updated": "2018-07-26 15:48:29.0"
}