{
    "dcr_id": "1556637563273",
    "lang": "en",
    "title": {
        "en": "Indigenous Speaker Series - A Conversation on Northern Agriculture and Indigenous Research Partnerships - May 6",
        "fr": "S\u00e9rie de conf\u00e9rences autochtones - Une conversation sur l'agriculture dans les r\u00e9gions nordiques et les partenariats de recherche autochtones - 6 mai"
    },
    "modified": "2019-05-02 00:00:00.0",
    "issued": "2019-05-02 00:00:00.0",
    "type_name": "intra-intra\/news-nouv",
    "node_id": "1279030006975",
    "layout_name": null,
    "created": "2019-05-02 10:04:47.0",
    "updated": "2019-05-02 10:04:47.0"
}