{
    "dcr_id": "1456946835618",
    "lang": "en",
    "title": {
        "en": "This Week in AgriCulture - Breaking New Ground: First Annual Graduate Student Symposium - A Hit at the Lethbridge Research and Development Centre",
        "fr": "Au menu d'AgriCulture cette semaine - Explorer de nouveaux horizons : Premier Symposium annuel des \u00e9tudiants dipl\u00f4m\u00e9s - Un v\u00e9ritable succ\u00e8s au Centre de recherche et de d\u00e9veloppement de Lethbridge"
    },
    "modified": "2016-03-03 00:00:00.0",
    "issued": "2016-03-03 00:00:00.0",
    "type_name": "intra-intra\/news-nouv",
    "node_id": "1279030006975",
    "layout_name": "1 column",
    "created": "2017-03-31 15:46:44.0",
    "updated": "2017-03-31 15:46:44.0"
}