{
    "dcr_id": "1460034452005",
    "lang": "en",
    "title": {
        "en": "Email Transformation Initiative Update",
        "fr": "Le point sur l'Initiative de transformation des services de courriel"
    },
    "modified": "2016-04-07 00:00:00.0",
    "issued": "2016-04-07 00:00:00.0",
    "type_name": "intra-intra\/news-nouv",
    "node_id": "1279030006975",
    "layout_name": "1 column",
    "created": "2017-03-31 15:46:44.0",
    "updated": "2017-03-31 15:46:44.0"
}