{
    "dcr_id": "1559585754531",
    "lang": "en",
    "title": {
        "en": "Executive Assistant",
        "fr": "Adjoint(e) Ex\u00e9cutif(ve)"
    },
    "modified": "2019-06-06 00:00:00.0",
    "issued": "2019-06-06 00:00:00.0",
    "type_name": "intra-intra\/empl-empl",
    "node_id": "1279029955397",
    "layout_name": null,
    "created": "2019-06-06 14:01:50.0",
    "updated": "2019-06-06 14:01:50.0"
}