{
    "dcr_id": "1540321566883",
    "lang": "fr",
    "title": "M\u00e9fiez-vous des ran\u00e7ongiciels",
    "modified": "2018-10-25 00:00:00.0",
    "issued": "2018-10-25 00:00:00.0",
    "type_name": "intra-intra\/news-nouv",
    "node_id": "1279030006975",
    "layout_name": null,
    "created": "2018-10-25 11:49:48.0",
    "updated": "2018-10-25 11:49:48.0"
}