{
    "dcr_id": "1529928631828",
    "lang": "en",
    "title": {
        "en": "Reminder - A New Issue of Agri-info is Here",
        "fr": "Rappel - Un nouveau num\u00e9ro d'Agri-info est maintenant disponible"
    },
    "modified": "2018-07-10 00:00:00.0",
    "issued": "2018-06-27 00:00:00.0",
    "type_name": "intra-intra\/news-nouv",
    "node_id": "1279030006975",
    "layout_name": null,
    "created": "2018-07-10 11:18:05.0",
    "updated": "2018-07-10 11:18:05.0"
}