{
    "dcr_id": "1457466563631",
    "lang": "en",
    "title": {
        "en": "Policy Analyst ",
        "fr": "Analyste des politiques "
    },
    "modified": "2016-03-09 00:00:00.0",
    "issued": "2016-03-09 00:00:00.0",
    "type_name": "intra-intra\/empl-empl",
    "node_id": "1279029955397",
    "layout_name": "1 column",
    "created": "2017-03-30 13:06:11.0",
    "updated": "2017-03-30 13:06:11.0"
}