{
    "dcr_id": "1483719347452",
    "lang": "en",
    "title": {
        "en": "Business Value or Transitory? Proper Information Management is Important",
        "fr": "Information ayant une valeur op\u00e9rationnelle ou information transitoire? Il est important de bien g\u00e9rer l'information"
    },
    "modified": "2018-05-16 00:00:00.0",
    "issued": "2017-01-09 00:00:00.0",
    "type_name": "intra-intra\/news-nouv",
    "node_id": "1279030006975",
    "layout_name": "1 column",
    "created": "2018-05-16 07:45:23.0",
    "updated": "2018-05-16 07:45:23.0"
}