{
    "dcr_id": "1558725929689",
    "lang": "fr",
    "title": "Conseiller principal en politiques aupr\u00e8s de la sous-ministre adjointe",
    "modified": "2019-06-05 00:00:00.0",
    "issued": "2019-05-28 00:00:00.0",
    "type_name": "intra-intra\/empl-empl",
    "node_id": "1279029955397",
    "layout_name": null,
    "created": "2019-06-05 09:02:54.0",
    "updated": "2019-06-05 09:02:54.0"
}