{
    "dcr_id": "1543956274072",
    "lang": "fr",
    "title": "Agent(e) de programmes",
    "modified": "2018-12-05 00:00:00.0",
    "issued": "2018-12-05 00:00:00.0",
    "type_name": "intra-intra\/empl-empl",
    "node_id": "1279029955397",
    "layout_name": null,
    "created": "2018-12-05 14:44:38.0",
    "updated": "2018-12-05 14:44:38.0"
}