{
    "dcr_id": "1513613611687",
    "lang": "en",
    "title": {
        "en": "AAFC Online User Survey",
        "fr": "Sondage aupr\u00e8s des utilisateurs d'AAC en direct"
    },
    "modified": "2017-12-28 00:00:00.0",
    "issued": "2017-12-21 00:00:00.0",
    "type_name": "intra-intra\/news-nouv",
    "node_id": "1279030006975",
    "layout_name": null,
    "created": "2017-12-28 09:46:55.0",
    "updated": "2017-12-28 09:46:55.0"
}