{
    "dcr_id": "1571227869519",
    "lang": "en",
    "title": {
        "en": "Deadline Extended - 2020 Gold Harvest Awards - Call for Nominations",
        "fr": "Prix Moisson d'or de 2020 - Appel de mises en candidature - La date limite est repouss\u00e9e"
    },
    "modified": "2020-01-09 00:00:00.0",
    "issued": "2019-10-17 00:00:00.0",
    "type_name": "intra-intra\/news-nouv",
    "node_id": "1279030006975",
    "layout_name": null,
    "created": "2020-01-09 12:24:31.0",
    "updated": "2020-01-09 12:24:31.0"
}