{
    "dcr_id": "1483555429543",
    "lang": "fr",
    "title": "Rappel - S\u00e9minaire de la DRA sur la variabilit\u00e9 des rendements caus\u00e9e par les changements climatiques et les innovations - Le 13 janvier",
    "modified": "2017-01-10 00:00:00.0",
    "issued": "2017-01-05 00:00:00.0",
    "type_name": "intra-intra\/news-nouv",
    "node_id": "1279030006975",
    "layout_name": "1 column",
    "created": "2017-03-31 15:46:45.0",
    "updated": "2017-03-31 15:46:45.0"
}