{
    "dcr_id": "1559671092505",
    "lang": "en",
    "title": {
        "en": "NCR - Tower 7 Washroom Renovations",
        "fr": "RCN - R\u00e9novation des salles de toilettes de la tour 7"
    },
    "modified": "2019-06-06 00:00:00.0",
    "issued": "2019-06-06 00:00:00.0",
    "type_name": "intra-intra\/news-nouv",
    "node_id": "1279030006975",
    "layout_name": null,
    "created": "2019-06-06 11:44:13.0",
    "updated": "2019-06-06 11:44:13.0"
}