{
    "dcr_id": "1505234438536",
    "lang": "en",
    "title": {
        "en": "Scheduled Maintenance of ISB Services (PeopleSoft) - September 16-17",
        "fr": "Entretien pr\u00e9vu des services de la DGSI (PeopleSoft) - Du 16 au 17 septembre"
    },
    "modified": "2017-09-14 00:00:00.0",
    "issued": "2017-09-13 00:00:00.0",
    "type_name": "intra-intra\/news-nouv",
    "node_id": "1279030006975",
    "layout_name": null,
    "created": "2017-09-14 09:21:52.0",
    "updated": "2017-09-14 09:21:52.0"
}