{
    "dcr_id": "1443018262884",
    "lang": "en",
    "title": {
        "en": "Project Leader, Project Portfolio Management",
        "fr": "Chef de projet, Gestion du portefeuille des projets"
    },
    "modified": "2015-10-06 00:00:00.0",
    "issued": "2015-09-30 00:00:00.0",
    "type_name": "intra-intra\/empl-empl",
    "node_id": "1279029955397",
    "layout_name": "1 column",
    "created": "2017-03-30 13:06:11.0",
    "updated": "2017-03-30 13:06:11.0"
}