{
    "dcr_id": "1576515516678",
    "lang": "fr",
    "title": "Analyste de base de donn\u00e9es \u2013 Administration de donn\u00e9es et de bases de donn\u00e9es ",
    "modified": "2019-12-16 00:00:00.0",
    "issued": "2019-12-16 00:00:00.0",
    "type_name": "intra-intra\/empl-empl",
    "node_id": "1279029955397",
    "layout_name": null,
    "created": "2019-12-16 13:45:46.0",
    "updated": "2019-12-16 13:45:46.0"
}