{
    "dcr_id": "1453324908524",
    "lang": "en",
    "title": {
        "en": "New Clerk of the Privy Council Announced",
        "fr": "Annonce de la nomination du nouveau greffier du Conseil priv\u00e9"
    },
    "modified": "2016-01-21 00:00:00.0",
    "issued": "2016-01-21 00:00:00.0",
    "type_name": "intra-intra\/news-nouv",
    "node_id": "1279030006975",
    "layout_name": "1 column",
    "created": "2017-03-31 15:46:44.0",
    "updated": "2017-03-31 15:46:44.0"
}