{
    "dcr_id": "1374754769425",
    "lang": "en",
    "title": {
        "en": "Team Leader, Portal Project",
        "fr": "\tChef d\u2019\u00e9quipe, Projet de portail"
    },
    "modified": "2013-07-29 00:00:00.0",
    "issued": "2013-07-29 00:00:00.0",
    "type_name": "intra-intra\/empl-empl",
    "node_id": "1279029955397",
    "layout_name": "1 column",
    "created": "2017-03-30 13:06:10.0",
    "updated": "2017-03-30 13:06:10.0"
}