{
    "dcr_id": "1580324500677",
    "lang": "en",
    "title": {
        "en": "Deputy Director \u2013 Market Access",
        "fr": "Directeur adjoint \/ directrice adjointe \u2013 Acc\u00e8s aux march\u00e9s"
    },
    "modified": "2020-01-30 00:00:00.0",
    "issued": "2020-01-30 00:00:00.0",
    "type_name": "intra-intra\/empl-empl",
    "node_id": "1279029955397",
    "layout_name": null,
    "created": "2020-01-30 10:18:18.0",
    "updated": "2020-01-30 10:18:18.0"
}