{
    "dcr_id": "1504627814865",
    "lang": "en",
    "title": {
        "en": "NCR - Totem Pole Fundraising BBQ - CANCELLED",
        "fr": "RCN - Barbecue-b\u00e9n\u00e9fice pour le totem - ANNUL\u00c9"
    },
    "modified": "2017-09-13 00:00:00.0",
    "issued": "2017-09-06 00:00:00.0",
    "type_name": "intra-intra\/news-nouv",
    "node_id": "1279030006975",
    "layout_name": null,
    "created": "2017-09-13 10:52:20.0",
    "updated": "2017-09-13 10:52:20.0"
}