{
    "dcr_id": "1460564664105",
    "lang": "en",
    "title": {
        "en": "AgriSource User Survey",
        "fr": "Sondage aupr\u00e8s des utilisateurs d'AgriSource"
    },
    "modified": "2016-04-13 00:00:00.0",
    "issued": "2016-04-13 00:00:00.0",
    "type_name": "intra-intra\/news-nouv",
    "node_id": "1279030006975",
    "layout_name": "1 column",
    "created": "2017-03-31 15:46:44.0",
    "updated": "2017-03-31 15:46:44.0"
}