{
    "dcr_id": "1498766258145",
    "lang": "fr",
    "title": "Analyste de politique junior\/ Analyste de politique",
    "modified": "2017-06-30 00:00:00.0",
    "issued": "2017-06-30 00:00:00.0",
    "type_name": "intra-intra\/empl-empl",
    "node_id": "1279029955397",
    "layout_name": null,
    "created": "2017-06-30 14:41:19.0",
    "updated": "2017-06-30 14:41:19.0"
}