{
    "dcr_id": "1402595221779",
    "lang": "en",
    "title": {
        "en": "Internal versus External Staffing Process",
        "fr": "Processus de dotation interne ou externe"
    },
    "modified": "2017-05-04 00:00:00.0",
    "issued": "2014-07-03 00:00:00.0",
    "type_name": "intra-intra\/gene-gene",
    "node_id": "1279035869288",
    "layout_name": "1 column",
    "created": "2017-05-04 15:24:55.0",
    "updated": "2017-05-04 15:24:55.0"
}