{
    "node_id": "1522247529195",
    "parent_node_id": "1522242982779",
    "dc_id": {
        "en": "http:\/\/www.agr.gc.ca\/eng\/news\/news-releases-and-statements\/?id=1383076728778",
        "fr": "http:\/\/www.agr.gc.ca\/fra\/nouvelles\/communiques-et-declarations\/?id=1383076728778"
    },
    "title": {
        "en": "null",
        "fr": "null"
    },
    "breadcrumb": {
        "en": "News Releases and Statements",
        "fr": "Communiqu\u00c3\u00a9s et d\u00c3\u00a9clarations"
    },
    "type": "news"
}