{
    "dcr_id": "1499191556187",
    "lang": "en",
    "title": {
        "en": "We've Got a New Look!",
        "fr": "Nous avons une nouvelle image de marque!"
    },
    "modified": "2017-07-05 00:00:00.0",
    "issued": "2017-07-05 00:00:00.0",
    "type_name": "intra-intra\/news-nouv",
    "node_id": "1279030006975",
    "layout_name": null,
    "created": "2017-07-06 09:59:55.0",
    "updated": "2017-07-06 09:59:55.0"
}