{
    "dcr_id": "1474663276226",
    "lang": "en",
    "title": {
        "en": "Reminder - Falling for Autumn - Send Us Your Photos",
        "fr": "Rappel - On raffole de l'automne - Envoyez-nous vos photos"
    },
    "modified": "2016-10-12 00:00:00.0",
    "issued": "2016-09-27 00:00:00.0",
    "type_name": "intra-intra\/news-nouv",
    "node_id": "1279030006975",
    "layout_name": "1 column",
    "created": "2017-03-31 15:46:45.0",
    "updated": "2017-03-31 15:46:45.0"
}