{
    "dcr_id": "1462818857260",
    "lang": "en",
    "title": {
        "en": "2016 Census",
        "fr": "Recensement de 2016"
    },
    "modified": "2016-05-12 00:00:00.0",
    "issued": "2016-05-11 00:00:00.0",
    "type_name": "intra-intra\/news-nouv",
    "node_id": "1279030006975",
    "layout_name": "1 column",
    "created": "2017-03-31 15:46:44.0",
    "updated": "2017-03-31 15:46:44.0"
}