{
    "dcr_id": "1463680616299",
    "lang": "en",
    "title": {
        "en": "Online Consultation: Next Agricultural Policy Framework",
        "fr": "Consultation en ligne : Prochain cadre strat\u00e9gique pour l'agriculture"
    },
    "modified": "2016-05-25 00:00:00.0",
    "issued": "2016-05-25 00:00:00.0",
    "type_name": "intra-intra\/news-nouv",
    "node_id": "1279030006975",
    "layout_name": "1 column",
    "created": "2017-03-31 15:46:44.0",
    "updated": "2017-03-31 15:46:44.0"
}