{
    "dcr_id": "1473866914058",
    "lang": "en",
    "title": {
        "en": "This Week in AgriCulture - AAFC Employee Wins Top Prize at the Commanderie de l'\u00c9rable Maple Syrup Tasting Competition",
        "fr": "Au menu d'AgriCulture cette semaine - Un employ\u00e9 d'AAC remporte le premier prix du concours de d\u00e9gustation de sirop d'\u00e9rable de la Commanderie de l'\u00c9rable"
    },
    "modified": "2016-09-15 00:00:00.0",
    "issued": "2016-09-15 00:00:00.0",
    "type_name": "intra-intra\/news-nouv",
    "node_id": "1279030006975",
    "layout_name": "1 column",
    "created": "2017-03-31 15:46:45.0",
    "updated": "2017-03-31 15:46:45.0"
}