{
    "dcr_id": "1571841555112",
    "lang": "en",
    "title": {
        "en": "Cyber Security Month 2019: Protect Yourself From Online Dangers",
        "fr": "Mois de la sensibilisation \u00e0 la cybers\u00e9curit\u00e9 2019 : Prot\u00e9gez-vous des dangers en ligne"
    },
    "modified": "2019-10-24 00:00:00.0",
    "issued": "2019-10-24 00:00:00.0",
    "type_name": "intra-intra\/news-nouv",
    "node_id": "1279030006975",
    "layout_name": null,
    "created": "2019-10-24 10:05:52.0",
    "updated": "2019-10-24 10:05:52.0"
}