{
    "dcr_id": "1528147680612",
    "lang": "en",
    "title": {
        "en": "June is International Pride Month",
        "fr": "Juin est le Mois international de la fiert\u00e9"
    },
    "modified": "2018-06-07 00:00:00.0",
    "issued": "2018-06-07 00:00:00.0",
    "type_name": "intra-intra\/news-nouv",
    "node_id": "1279030006975",
    "layout_name": null,
    "created": "2018-06-07 08:49:05.0",
    "updated": "2018-06-07 08:49:05.0"
}