{
    "dcr_id": "1481142249324",
    "lang": "fr",
    "title": "Message du greffier \u00e0 tous les fonctionnaires au sujet du 150<sup>e<\/sup> anniversaire de la Conf\u00e9d\u00e9ration",
    "modified": "2016-12-08 00:00:00.0",
    "issued": "2016-12-07 00:00:00.0",
    "type_name": "intra-intra\/news-nouv",
    "node_id": "1279030006975",
    "layout_name": "1 column",
    "created": "2017-03-31 15:46:45.0",
    "updated": "2017-03-31 15:46:45.0"
}