{
    "dcr_id": "1348075628057",
    "lang": "en",
    "title": {
        "en": "Biodiversity Technician",
        "fr": "Technicien en biodiversit\u00e9"
    },
    "modified": "2012-09-20 00:00:00.0",
    "issued": "2012-09-20 00:00:00.0",
    "type_name": "intra-intra\/empl-empl",
    "node_id": "1279029955397",
    "layout_name": "1 column",
    "created": "2017-03-30 13:06:10.0",
    "updated": "2017-03-30 13:06:10.0"
}