{
    "dcr_id": "1471462233083",
    "lang": "en",
    "title": {
        "en": "This Week in AgriCulture - Photo Quiz - How Well Do You Know Your Pulses? And the Answers Are...",
        "fr": "Au menu d'AgriCulture cette semaine - Jeu-questionnaire photo - Connaissez-vous bien vos l\u00e9gumineuses? - Et les r\u00e9ponses sont..."
    },
    "modified": "2016-08-18 00:00:00.0",
    "issued": "2016-08-18 00:00:00.0",
    "type_name": "intra-intra\/news-nouv",
    "node_id": "1279030006975",
    "layout_name": "1 column",
    "created": "2017-03-31 15:46:45.0",
    "updated": "2017-03-31 15:46:45.0"
}