{
    "dcr_id": "1454086944205",
    "lang": "en",
    "title": {
        "en": "Preparing for 2015-2016 Year-End Performance Assessments",
        "fr": "Pr\u00e9paration en vue de l'\u00e9valuation du rendement de fin d'exercice 2015-2016"
    },
    "modified": "2016-02-01 00:00:00.0",
    "issued": "2016-02-01 00:00:00.0",
    "type_name": "intra-intra\/news-nouv",
    "node_id": "1279030006975",
    "layout_name": "1 column",
    "created": "2017-03-31 15:46:44.0",
    "updated": "2017-03-31 15:46:44.0"
}