{
    "dcr_id": "1526327013531",
    "lang": "en",
    "title": {
        "en": "Asian Heritage Month Employee Spotlight: Dr. Sankaran KrishnaRaj",
        "fr": "Pleins feux sur un employ\u00e9 \u00e0 l'occasion du Mois du patrimoine asiatique : Sankaran KrishnaRaj (Ph. D.)"
    },
    "modified": "2018-05-17 00:00:00.0",
    "issued": "2018-05-17 00:00:00.0",
    "type_name": "intra-intra\/news-nouv",
    "node_id": "1279030006975",
    "layout_name": null,
    "created": "2018-05-17 08:06:55.0",
    "updated": "2018-05-17 08:06:55.0"
}