{
    "dcr_id": "1557522735836",
    "lang": "en",
    "title": {
        "en": "Administrative Assistant",
        "fr": "Adjoint Administratif "
    },
    "modified": "2019-05-13 00:00:00.0",
    "issued": "2019-05-13 00:00:00.0",
    "type_name": "intra-intra\/empl-empl",
    "node_id": "1279029955397",
    "layout_name": null,
    "created": "2019-05-13 09:41:16.0",
    "updated": "2019-05-13 09:41:16.0"
}