{
    "dcr_id": "1570023671504",
    "lang": "fr",
    "title": "Possibilit\u00e9s \u00e0 l'\u00e9tranger accessible aux employ\u00e9es d'AAC",
    "modified": "2019-10-02 00:00:00.0",
    "issued": "2019-10-02 00:00:00.0",
    "type_name": "intra-intra\/gene-gene",
    "node_id": "1522247397123",
    "layout_name": "1 column",
    "created": "2019-10-02 14:44:24.0",
    "updated": "2019-10-02 14:44:24.0"
}