{
    "node_id": "1322231986293",
    "parent_node_id": "1313613624272",
    "dc_id": "1298990029142",
    "landingPageUrl": {
        "en": "1298990029142",
        "fr": "1298990029142"
    },
    "parent_dc_id": "1298922166577",
    "node_title": {
        "en": "null",
        "fr": "null"
    },
    "title": {
        "en": "Service Standards",
        "fr": "Normes de service"
    },
    "type": "find_people"
}