{
    "dcr_id": "1580777724806",
    "lang": "fr",
    "title": "Programme de d\u00e9veloppement de carri\u00e8re Dre Roberta Bondar pour les jeunes femmes en sciences et en technologie",
    "modified": "2020-02-06 00:00:00.0",
    "issued": "2020-02-06 00:00:00.0",
    "type_name": "intra-intra\/news-nouv",
    "node_id": "1279030006975",
    "layout_name": null,
    "created": "2020-02-06 10:10:02.0",
    "updated": "2020-02-06 10:10:02.0"
}