{
    "dcr_id": "1510160251662",
    "lang": "fr",
    "title": "Nouveau Rapport sur les r\u00e9sultats minist\u00e9riels",
    "modified": "2017-11-09 00:00:00.0",
    "issued": "2017-11-09 00:00:00.0",
    "type_name": "intra-intra\/news-nouv",
    "node_id": "1279030006975",
    "layout_name": null,
    "created": "2017-11-09 11:23:30.0",
    "updated": "2017-11-09 11:23:30.0"
}