{
    "dcr_id": "1556035497692",
    "lang": "en",
    "title": {
        "en": "This Week in The Harvest - Taking the Heat: Looking for Heat Tolerant Potato Varieties",
        "fr": "Au menu de La Moisson cette semaine - D\u00e9jouer la chaleur : Rechercher les vari\u00e9t\u00e9s de pommes de terre tol\u00e9rantes \u00e0 la chaleur"
    },
    "modified": "2019-04-25 00:00:00.0",
    "issued": "2019-04-25 00:00:00.0",
    "type_name": "intra-intra\/news-nouv",
    "node_id": "1279030006975",
    "layout_name": null,
    "created": "2019-04-25 09:32:11.0",
    "updated": "2019-04-25 09:32:11.0"
}