{
    "dcr_id": "1463694599028",
    "lang": "en",
    "title": {
        "en": "NCR - Join us For Bannock and Three Sisters Soup during Aboriginal Awareness Week",
        "fr": "RCN - Joignez-vous \u00e0 nous pour go\u00fbter \u00e0 la bannique et \u00e0 la soupe des Trois soeurs pendant la Semaine de sensibilisation aux cultures autochtones"
    },
    "modified": "2016-05-26 00:00:00.0",
    "issued": "2016-05-20 00:00:00.0",
    "type_name": "intra-intra\/news-nouv",
    "node_id": "1279030006975",
    "layout_name": "1 column",
    "created": "2017-03-31 15:46:44.0",
    "updated": "2017-03-31 15:46:44.0"
}