{
    "dcr_id": "1439561945085",
    "lang": "en",
    "title": {
        "en": "Adobe LiveCycle Design Architect",
        "fr": "Architecte d\u2019Adobe LiveCycle Designer"
    },
    "modified": "2015-08-25 00:00:00.0",
    "issued": "2015-08-25 00:00:00.0",
    "type_name": "intra-intra\/empl-empl",
    "node_id": "1279029955397",
    "layout_name": "1 column",
    "created": "2017-03-30 13:06:11.0",
    "updated": "2017-03-30 13:06:11.0"
}