{
    "dcr_id": "1281447944008",
    "lang": "en",
    "title": {
        "en": "<NULL>",
        "fr": "<NULL>"
    },
    "modified": "<NULL>",
    "issued": "2010-09-03 00:00:00.0",
    "type_name": "intra-intra\/widg-widg",
    "node_id": "<NULL>",
    "layout_name": null,
    "created": "2019-12-09 13:07:39.0",
    "updated": "2019-12-09 13:07:39.0"
}