{
    "dcr_id": "1560882595439",
    "lang": "fr",
    "title": "RCN - Interruption de l'alimentation en eau dans la Tour 7 - 24 juin",
    "modified": "2019-06-19 00:00:00.0",
    "issued": "2019-06-19 00:00:00.0",
    "type_name": "intra-intra\/news-nouv",
    "node_id": "1279030006975",
    "layout_name": null,
    "created": "2019-06-19 16:16:16.0",
    "updated": "2019-06-19 16:16:16.0"
}