{
    "dcr_id": "1526330751482",
    "lang": "en",
    "title": {
        "en": "Team Leader, Staffing Operations",
        "fr": "Chef d'\u00e9quipe, Op\u00e9rations de dotation"
    },
    "modified": "2018-05-15 00:00:00.0",
    "issued": "2018-05-15 00:00:00.0",
    "type_name": "intra-intra\/empl-empl",
    "node_id": "1279029955397",
    "layout_name": null,
    "created": "2018-05-15 13:26:36.0",
    "updated": "2018-05-15 13:26:36.0"
}