{
    "dcr_id": "1475692560762",
    "lang": "en",
    "title": {
        "en": "Video of the Week - DNA Barcoding",
        "fr": "Vid\u00e9o de la semaine - Les codes-barres d'ADN"
    },
    "modified": "2016-10-06 00:00:00.0",
    "issued": "2016-10-06 00:00:00.0",
    "type_name": "intra-intra\/news-nouv",
    "node_id": "1279030006975",
    "layout_name": "1 column",
    "created": "2017-03-31 15:46:45.0",
    "updated": "2017-03-31 15:46:45.0"
}