{
    "dcr_id": "1576166956507",
    "lang": "en",
    "title": {
        "en": "Reminder - news@work Over the Holidays",
        "fr": "Rappel - nouvelles@l'ouvrage pendant les F\u00eates"
    },
    "modified": "2019-12-19 00:00:00.0",
    "issued": "2019-12-12 00:00:00.0",
    "type_name": "intra-intra\/news-nouv",
    "node_id": "1279030006975",
    "layout_name": null,
    "created": "2019-12-19 10:07:28.0",
    "updated": "2019-12-19 10:07:28.0"
}