{
    "node_id": "1279035684616",
    "parent_node_id": "1279029955397",
    "dc_id": {
        "en": "1288034634018",
        "fr": "1288034634018"
    },
    "title": {
        "en": "null",
        "fr": "null"
    },
    "breadcrumb": {
        "en": "Employment Equity and Inclusiveness",
        "fr": "\u00c3\u0089quit\u00c3\u00a9 en mati\u00c3\u00a8re d'emploi et inclusivit\u00c3\u00a9"
    },
    "type": "hr"
}