{
    "dcr_id": "1331643881035",
    "lang": "en",
    "title": {
        "en": "Human Resources Coordinator Development Program - Staffing",
        "fr": "Programme de perfectionnement des coordonnateurs des ressources humaines - Dotation"
    },
    "modified": "2017-02-24 00:00:00.0",
    "issued": "2012-03-16 00:00:00.0",
    "type_name": "intra-intra\/gene-gene",
    "node_id": "1474032522040",
    "layout_name": "1 column",
    "created": "2017-03-30 13:04:01.0",
    "updated": "2017-03-30 13:04:01.0"
}