{
    "dcr_id": "1557428568283",
    "lang": "en",
    "title": {
        "en": "Reminder - Register Now: 6<sup>th<\/sup> Annual GCWCC Golf Tournament",
        "fr": "Rappel - Inscrivez-vous d\u00e8s maintenant au 6<sup>e<\/sup> tournoi annuel de golf de la CCMTGC"
    },
    "modified": "2019-06-12 00:00:00.0",
    "issued": "2019-05-16 00:00:00.0",
    "type_name": "intra-intra\/news-nouv",
    "node_id": "1279030006975",
    "layout_name": null,
    "created": "2019-06-12 15:24:46.0",
    "updated": "2019-06-12 15:24:46.0"
}