{
    "dcr_id": "1576512407261",
    "lang": "fr",
    "title": "RCN - Formation sur la sant\u00e9 mentale - S\u00e9ance en janvier",
    "modified": "2019-12-19 00:00:00.0",
    "issued": "2019-12-19 00:00:00.0",
    "type_name": "intra-intra\/news-nouv",
    "node_id": "1279030006975",
    "layout_name": null,
    "created": "2019-12-19 10:02:21.0",
    "updated": "2019-12-19 10:02:21.0"
}