{
    "dcr_id": "1408474385710",
    "lang": "en",
    "title": {
        "en": "Assistant Director, Infrastructure Services, Canadian Agriculture Library ",
        "fr": "Directeur (trice) adjoint(e), Services d\u2019information, Biblioth\u00e8que canadienne de l\u2019agriculture"
    },
    "modified": "2014-08-21 00:00:00.0",
    "issued": "2014-08-21 00:00:00.0",
    "type_name": "intra-intra\/empl-empl",
    "node_id": "1279029955397",
    "layout_name": "1 column",
    "created": "2017-03-30 13:06:10.0",
    "updated": "2017-03-30 13:06:10.0"
}