{
    "dcr_id": "1522092668036",
    "lang": "en",
    "title": {
        "en": "News",
        "fr": "Nouvelles"
    },
    "modified": "2020-01-03 00:00:00.0",
    "issued": "2018-03-28 00:00:00.0",
    "type_name": "intra-intra\/gene-gene",
    "node_id": "1279029750897",
    "layout_name": "1 column",
    "created": "2020-01-03 10:16:01.0",
    "updated": "2020-01-03 10:16:01.0"
}