{
    "dcr_id": "1326906028682",
    "lang": "fr",
    "title": "Fin d'exercice",
    "modified": "2020-02-20 00:00:00.0",
    "issued": "2012-01-23 00:00:00.0",
    "type_name": "intra-intra\/gene-gene",
    "node_id": "1320677087463",
    "layout_name": "1 column",
    "created": "2020-02-20 16:53:45.0",
    "updated": "2020-02-20 16:53:45.0"
}