{
    "dcr_id": "1499951826475",
    "lang": "en",
    "title": {
        "en": "CANCELLED - Scheduled Maintenance of ISB Services Including Email and BlackBerry Email Services - July 20",
        "fr": "ANNUL\u00c9 - Entretien pr\u00e9vu des services de la DGSI, y compris les services de courriel et de courriel BlackBerry - Le 20 juillet"
    },
    "modified": "2017-07-20 00:00:00.0",
    "issued": "2017-07-13 00:00:00.0",
    "type_name": "intra-intra\/news-nouv",
    "node_id": "1279030006975",
    "layout_name": null,
    "created": "2017-07-20 11:03:39.0",
    "updated": "2017-07-20 11:03:39.0"
}