{
    "dcr_id": "1510670545646",
    "lang": "fr",
    "title": "Rappel - Savoir reconna\u00eetre la violence sexiste - Du 25 novembre au 10 d\u00e9cembre",
    "modified": "2017-11-22 00:00:00.0",
    "issued": "2017-11-16 00:00:00.0",
    "type_name": "intra-intra\/news-nouv",
    "node_id": "1279030006975",
    "layout_name": null,
    "created": "2017-12-06 16:21:04.0",
    "updated": "2017-12-06 16:21:04.0"
}