{
    "node_id": "1292442500698",
    "parent_node_id": "1285342872241",
    "dc_id": "1296755050989",
    "landingPageUrl": {
        "en": "1296755050989",
        "fr": "1296755050989"
    },
    "parent_dc_id": "1288789122212",
    "node_title": {
        "en": "null",
        "fr": "null"
    },
    "title": {
        "en": "Feedback",
        "fr": "R\u00c3\u00a9troaction"
    },
    "type": "our_dept"
}