{
    "node_id": "1313613580184",
    "parent_node_id": "1279030317647",
    "dc_id": "1298664211412",
    "landingPageUrl": {
        "en": "1298664211412",
        "fr": "1298664211412"
    },
    "parent_dc_id": "1287487121135",
    "node_title": {
        "en": "null",
        "fr": "null"
    },
    "title": {
        "en": "Regional Network",
        "fr": "R\u00c3\u00a9seau r\u00c3\u00a9gional"
    },
    "type": "find_people"
}