{
    "dcr_id": "1507747872272",
    "lang": "en",
    "title": {
        "en": "Administrative Assistant",
        "fr": "Adjoint Administratif "
    },
    "modified": "2017-10-17 00:00:00.0",
    "issued": "2017-10-17 00:00:00.0",
    "type_name": "intra-intra\/empl-empl",
    "node_id": "1279029955397",
    "layout_name": null,
    "created": "2017-10-17 09:51:07.0",
    "updated": "2017-10-17 09:51:07.0"
}