{
    "dcr_id": "1489599328690",
    "lang": "fr",
    "title": "Rappel - La science aux commandes des m\u00e9dias sociaux - Le 11 avril",
    "modified": "2017-04-06 00:00:00.0",
    "issued": "2017-03-16 00:00:00.0",
    "type_name": "intra-intra\/news-nouv",
    "node_id": "1279030006975",
    "layout_name": "1 column",
    "created": "2017-04-06 15:19:31.0",
    "updated": "2017-04-06 15:19:31.0"
}