{
    "dcr_id": "1551813967874",
    "lang": "fr",
    "title": "C\u00e9l\u00e9brez le Norouz, le Nouvel an persan",
    "modified": "2019-03-07 00:00:00.0",
    "issued": "2019-03-07 00:00:00.0",
    "type_name": "intra-intra\/news-nouv",
    "node_id": "1279030006975",
    "layout_name": null,
    "created": "2019-03-20 15:16:47.0",
    "updated": "2019-03-20 15:16:47.0"
}