{
    "dcr_id": "1501103083307",
    "lang": "en",
    "title": {
        "en": "2017 Saskatchewan Budget: Impact on Group Life and Disability Insurance",
        "fr": "Budget de la Saskatchewan de 2017 : incidence sur les r\u00e9gimes collectifs d'assurance-vie et d'assurance-invalidit\u00e9"
    },
    "modified": "2017-07-27 00:00:00.0",
    "issued": "2017-07-27 00:00:00.0",
    "type_name": "intra-intra\/news-nouv",
    "node_id": "1279030006975",
    "layout_name": null,
    "created": "2017-07-27 09:31:35.0",
    "updated": "2017-07-27 09:31:35.0"
}