{
    "dcr_id": "1528825768704",
    "lang": "fr",
    "title": "Rappel - Steven Pinker, professeur \u00e0 l'Universit\u00e9 Harvard - Le progr\u00e8s humain - Le 27 juin",
    "modified": "2018-06-20 00:00:00.0",
    "issued": "2018-06-14 00:00:00.0",
    "type_name": "intra-intra\/news-nouv",
    "node_id": "1279030006975",
    "layout_name": null,
    "created": "2018-06-20 12:51:09.0",
    "updated": "2018-06-20 12:51:09.0"
}