{
    "dcr_id": "1501775645986",
    "lang": "fr",
    "title": "Analyste et concepteur de syst\u00e8mes Web ",
    "modified": "2017-08-03 00:00:00.0",
    "issued": "2017-08-03 00:00:00.0",
    "type_name": "intra-intra\/empl-empl",
    "node_id": "1279029955397",
    "layout_name": null,
    "created": "2017-08-03 14:41:27.0",
    "updated": "2017-08-03 14:41:27.0"
}