{
    "dcr_id": "1476379440019",
    "lang": "en",
    "title": {
        "en": "Scheduled Maintenance of ISB Services Including Email and BlackBerry Email Services - October 22-23",
        "fr": "Entretien pr\u00e9vu des services de la DGSI, y compris les services de courriel et de courriel BlackBerry - Les 22 et 23 octobre"
    },
    "modified": "2016-10-18 00:00:00.0",
    "issued": "2016-10-18 00:00:00.0",
    "type_name": "intra-intra\/news-nouv",
    "node_id": "1279030006975",
    "layout_name": "1 column",
    "created": "2017-03-31 15:46:45.0",
    "updated": "2017-03-31 15:46:45.0"
}