{
    "dcr_id": "1405434967305",
    "lang": "en",
    "title": {
        "en": "EDRM IT Analyst",
        "fr": "Analyste des applications EDRM"
    },
    "modified": "2014-07-21 00:00:00.0",
    "issued": "2014-07-21 00:00:00.0",
    "type_name": "intra-intra\/empl-empl",
    "node_id": "1279029955397",
    "layout_name": "1 column",
    "created": "2017-03-30 13:06:10.0",
    "updated": "2017-03-30 13:06:10.0"
}