{
    "dcr_id": "1445287056642",
    "lang": "en",
    "title": {
        "en": "Using Social Media Responsibly",
        "fr": "Utilisation responsable des m\u00e9dias sociaux"
    },
    "modified": "2019-05-31 00:00:00.0",
    "issued": "2015-10-26 00:00:00.0",
    "type_name": "intra-intra\/gene-gene",
    "node_id": "1447698539491",
    "layout_name": "1 column",
    "created": "2019-05-31 09:30:03.0",
    "updated": "2019-05-31 09:30:03.0"
}