{
    "dcr_id": "1574187438833",
    "lang": "en",
    "title": {
        "en": "Departmental Policy on Motor Vehicles",
        "fr": "Politique minist\u00e9rielle portant sur les v\u00e9hicules \u00e0 moteur"
    },
    "modified": "2019-12-05 00:00:00.0",
    "issued": "2019-12-05 00:00:00.0",
    "type_name": "intra-intra\/gene-gene",
    "node_id": "1285342834276",
    "layout_name": "1 column",
    "created": "2019-12-05 07:25:05.0",
    "updated": "2019-12-05 07:25:05.0"
}