{
    "dcr_id": "1517233850058",
    "lang": "fr",
    "title": "Le 13 f\u00e9vrier est le Jour de l'agriculture canadienne - C\u00e9l\u00e9brons les aliments que nous aimons et les personnes qui les produisent!",
    "modified": "2018-02-13 00:00:00.0",
    "issued": "2018-02-08 00:00:00.0",
    "type_name": "intra-intra\/news-nouv",
    "node_id": "1279030006975",
    "layout_name": null,
    "created": "2018-02-13 09:12:59.0",
    "updated": "2018-02-13 09:12:59.0"
}