{
    "dcr_id": "1573673006847",
    "lang": "en",
    "title": {
        "en": "Tools for section 34 managers",
        "fr": "Outils pour les gestionnaires (article 34)"
    },
    "modified": "2020-02-26 00:00:00.0",
    "issued": "2020-02-17 00:00:00.0",
    "type_name": "intra-intra\/gene-gene",
    "node_id": "1279035583756",
    "layout_name": "1 column",
    "created": "2020-02-26 07:13:21.0",
    "updated": "2020-02-26 07:13:21.0"
}