{
    "dcr_id": "1478542784648",
    "lang": "en",
    "title": {
        "en": "Think Before You Click: Beware of Fraudulent Emails",
        "fr": "R\u00e9fl\u00e9chissez avant de cliquer : M\u00e9fiez-vous des courriels frauduleux"
    },
    "modified": "2016-11-10 00:00:00.0",
    "issued": "2016-11-10 00:00:00.0",
    "type_name": "intra-intra\/news-nouv",
    "node_id": "1279030006975",
    "layout_name": "1 column",
    "created": "2017-03-31 15:46:45.0",
    "updated": "2017-03-31 15:46:45.0"
}