{
    "dcr_id": "1545145499662",
    "lang": "fr",
    "title": "Meilleures voeux du temps des F\u00eates du ministre MacAulay",
    "modified": "2018-12-18 00:00:00.0",
    "issued": "2018-12-18 00:00:00.0",
    "type_name": "intra-intra\/news-nouv",
    "node_id": "1279030006975",
    "layout_name": null,
    "created": "2018-12-18 16:12:25.0",
    "updated": "2018-12-18 16:12:25.0"
}