{
    "dcr_id": "1287433961265",
    "lang": "en",
    "title": {
        "en": "Branches and Offices",
        "fr": "Directions g\u00e9n\u00e9rales et bureaux"
    },
    "modified": "2019-08-22 00:00:00.0",
    "issued": "2010-11-12 00:00:00.0",
    "type_name": "intra-intra\/gene-gene",
    "node_id": "1279029900850",
    "layout_name": "1 column",
    "created": "2019-08-22 11:08:53.0",
    "updated": "2019-08-22 11:08:53.0"
}