{
    "node_id": "1572956188384",
    "parent_node_id": "1320677087463",
    "dc_id": "1570644168915",
    "landingPageUrl": {
        "en": "1570644168915",
        "fr": "1570644168915"
    },
    "parent_dc_id": "1320429524077",
    "node_title": {
        "en": "null",
        "fr": "null"
    },
    "title": {
        "en": "Office of Emergency Management & Business Continuity Planning",
        "fr": "Bureau de la gestion des mesures d'urgence et de la planification des activit\u00c3\u00a9s"
    },
    "type": "find_people"
}