{
    "dcr_id": "1282322059430",
    "lang": "fr",
    "title": "Non trouv\u00e9",
    "modified": "2016-03-22 00:00:00.0",
    "issued": "2010-09-30 00:00:00.0",
    "type_name": "intra-intra\/gene-gene",
    "node_id": "1279029750897",
    "layout_name": "1 column",
    "created": "2017-03-30 13:06:44.0",
    "updated": "2017-03-30 13:06:44.0"
}