{
    "dcr_id": "1569007468176",
    "lang": "en",
    "title": {
        "en": "Invitation: AAFC All-Staff Meeting - October 3",
        "fr": "Invitation : R\u00e9union du personnel d\u2019AAC le 3 octobre "
    },
    "modified": "2019-09-26 00:00:00.0",
    "issued": "2019-09-23 00:00:00.0",
    "type_name": "intra-intra\/news-nouv",
    "node_id": "1279030006975",
    "layout_name": null,
    "created": "2019-09-26 10:14:56.0",
    "updated": "2019-09-26 10:14:56.0"
}