{
    "dcr_id": "1462311944630",
    "lang": "en",
    "title": {
        "en": "Reminder - Presentation: ''The Snowden Files: The Inside Story of the World's Most Wanted Man'' - May 16",
        "fr": "Rappel - Pr\u00e9sentation intitul\u00e9e \u00ab Le dossier Snowden : L'histoire de l'homme le plus recherch\u00e9 au monde \u00bb - Le 16 mai"
    },
    "modified": "2016-05-11 00:00:00.0",
    "issued": "2016-05-05 00:00:00.0",
    "type_name": "intra-intra\/news-nouv",
    "node_id": "1279030006975",
    "layout_name": "1 column",
    "created": "2017-03-31 15:46:44.0",
    "updated": "2017-03-31 15:46:44.0"
}