{
    "dcr_id": "1519237563276",
    "lang": "fr",
    "title": "Concepteur de formulaires",
    "modified": "2018-02-22 00:00:00.0",
    "issued": "2018-02-22 00:00:00.0",
    "type_name": "intra-intra\/empl-empl",
    "node_id": "1279029955397",
    "layout_name": null,
    "created": "2018-02-22 11:09:34.0",
    "updated": "2018-02-22 11:09:34.0"
}