{
    "dcr_id": "1571760602092",
    "lang": "en",
    "title": {
        "en": "Scheduled Maintenance of ISB Services - October 24-27",
        "fr": "Entretien pr\u00e9vu des services de la DGSI \u2013 Du 24 au 27 octobre"
    },
    "modified": "2019-10-24 00:00:00.0",
    "issued": "2019-10-24 00:00:00.0",
    "type_name": "intra-intra\/news-nouv",
    "node_id": "1279030006975",
    "layout_name": null,
    "created": "2019-10-24 10:07:59.0",
    "updated": "2019-10-24 10:07:59.0"
}