{
    "dcr_id": "1505850417423",
    "lang": "en",
    "title": {
        "en": "Reminder - Secondment Opportunity at Global Affairs Canada - Deadline October 6",
        "fr": "Rappel - Opportunit\u00e9 de d\u00e9tachement \u00e0 Affaires Mondiales Canada - La date limite est le 6 octobre"
    },
    "modified": "2017-10-04 00:00:00.0",
    "issued": "2017-09-21 00:00:00.0",
    "type_name": "intra-intra\/news-nouv",
    "node_id": "1279030006975",
    "layout_name": null,
    "created": "2017-10-04 10:40:50.0",
    "updated": "2017-10-04 10:40:50.0"
}