{
    "dcr_id": "1560344530804",
    "lang": "en",
    "title": {
        "en": "NCR - Water Shutoff in Tower 7 - June 17 ",
        "fr": "RCN - Interruption de l'alimentation en eau dans la Tour 7 - 17 juin"
    },
    "modified": "2019-06-13 00:00:00.0",
    "issued": "2019-06-13 00:00:00.0",
    "type_name": "intra-intra\/news-nouv",
    "node_id": "1279030006975",
    "layout_name": null,
    "created": "2019-06-13 10:44:56.0",
    "updated": "2019-06-13 10:44:56.0"
}