{
    "dcr_id": "1539090987599",
    "lang": "fr",
    "title": "Mois de la sant\u00e9 au travail - Activit\u00e9s pr\u00e9vues pour la semaine du 15 au 19 octobre - Inscription au s\u00e9minaire",
    "modified": "2019-01-28 00:00:00.0",
    "issued": "2018-10-11 00:00:00.0",
    "type_name": "intra-intra\/news-nouv",
    "node_id": "1279030006975",
    "layout_name": null,
    "created": "2019-01-28 13:42:37.0",
    "updated": "2019-01-28 13:42:37.0"
}