{
    "dcr_id": "1480704570790",
    "lang": "en",
    "title": {
        "en": "Frelighsburg Experimental Farm",
        "fr": "Ferme exp\u00e9rimentale de Frelighsburg"
    },
    "modified": "2016-12-02 00:00:00.0",
    "issued": "2016-12-02 00:00:00.0",
    "type_name": "intra-intra\/news-nouv",
    "node_id": "1279030006975",
    "layout_name": "1 column",
    "created": "2017-03-31 15:46:45.0",
    "updated": "2017-03-31 15:46:45.0"
}