{
    "dcr_id": "1539615745852",
    "lang": "en",
    "title": {
        "en": "NCR - AAFC Procurement Processing for Deliveries Prior to March 31, 2019 in the NCR",
        "fr": "RCN - Traitement des achats \u00e0 AAC pour livraisons avant le 31 mars 2019 dans la RCN"
    },
    "modified": "2018-10-18 00:00:00.0",
    "issued": "2018-10-18 00:00:00.0",
    "type_name": "intra-intra\/news-nouv",
    "node_id": "1279030006975",
    "layout_name": null,
    "created": "2018-10-18 08:31:37.0",
    "updated": "2018-10-18 08:31:37.0"
}