{
    "dcr_id": "1466004553926",
    "lang": "en",
    "title": {
        "en": "Scheduled Maintenance of ISB Services including BlackBerry Email Services - June 18-19",
        "fr": "Entretien pr\u00e9vu des services de la DGSI, y compris les services de courriel BlackBerry - Les 18 et 19 juin"
    },
    "modified": "2016-06-16 00:00:00.0",
    "issued": "2016-06-16 00:00:00.0",
    "type_name": "intra-intra\/news-nouv",
    "node_id": "1279030006975",
    "layout_name": "1 column",
    "created": "2017-03-31 15:46:44.0",
    "updated": "2017-03-31 15:46:44.0"
}