{
    "dcr_id": "1460573161569",
    "lang": "en",
    "title": {
        "en": " Web Analyst",
        "fr": "Analyste Web"
    },
    "modified": "2016-04-18 00:00:00.0",
    "issued": "2016-04-18 00:00:00.0",
    "type_name": "intra-intra\/empl-empl",
    "node_id": "1279029955397",
    "layout_name": "1 column",
    "created": "2017-03-30 13:06:11.0",
    "updated": "2017-03-30 13:06:11.0"
}