{
    "dcr_id": "1571240495917",
    "lang": "en",
    "title": {
        "en": "Scheduled Maintenance of ISB Services - October 17-20",
        "fr": "Entretien pr\u00e9vu des services de la DGSI - Du 17 au 20 octobre"
    },
    "modified": "2019-10-17 00:00:00.0",
    "issued": "2019-10-17 00:00:00.0",
    "type_name": "intra-intra\/news-nouv",
    "node_id": "1279030006975",
    "layout_name": null,
    "created": "2019-10-17 09:07:02.0",
    "updated": "2019-10-17 09:07:02.0"
}