{
    "dcr_id": "1499788765543",
    "lang": "fr",
    "title": "Notre engagement d'embaucher des \u00e9tudiants - Responsabilit\u00e9 du gestionnaire",
    "modified": "2017-07-13 00:00:00.0",
    "issued": "2017-07-12 00:00:00.0",
    "type_name": "intra-intra\/news-nouv",
    "node_id": "1279030006975",
    "layout_name": null,
    "created": "2017-07-13 15:57:03.0",
    "updated": "2017-07-13 15:57:03.0"
}