{
    "dcr_id": "1340725625099",
    "lang": "fr",
    "title": "Complexe de l'Administration centrale pour le portefeuille de l'agriculture",
    "modified": "2018-05-30 00:00:00.0",
    "issued": "2012-06-29 00:00:00.0",
    "type_name": "intra-intra\/gene-gene",
    "node_id": "1320677087463",
    "layout_name": "1 column",
    "created": "2018-05-30 09:08:58.0",
    "updated": "2018-05-30 09:08:58.0"
}