{
    "dcr_id": "1367244339790",
    "lang": "en",
    "title": {
        "en": "Chief, Information Services Western Region",
        "fr": "Chef, Services d\u2019information de la r\u00e9gion de l\u2019Ouest"
    },
    "modified": "2013-05-01 00:00:00.0",
    "issued": "2013-05-01 00:00:00.0",
    "type_name": "intra-intra\/empl-empl",
    "node_id": "1279029955397",
    "layout_name": "1 column",
    "created": "2017-03-30 13:06:10.0",
    "updated": "2017-03-30 13:06:10.0"
}