{
    "dcr_id": "1340646730855",
    "lang": "en",
    "title": {
        "en": "Audit Officer",
        "fr": "Agent de v\u00e9rification "
    },
    "modified": "2012-06-28 00:00:00.0",
    "issued": "2012-06-28 00:00:00.0",
    "type_name": "intra-intra\/empl-empl",
    "node_id": "1279029955397",
    "layout_name": "1 column",
    "created": "2017-03-30 13:06:10.0",
    "updated": "2017-03-30 13:06:10.0"
}