{
    "dcr_id": "1493733547124",
    "lang": "en",
    "title": {
        "en": "Reminder - Resources for Your Diversity and Inclusiveness Journey",
        "fr": "Rappel - Ressources pour votre cheminemant en diversit\u00e9 et en inclusivit\u00e9"
    },
    "modified": "2017-05-17 00:00:00.0",
    "issued": "2017-05-04 00:00:00.0",
    "type_name": "intra-intra\/news-nouv",
    "node_id": "1279030006975",
    "layout_name": null,
    "created": "2017-05-18 12:29:32.0",
    "updated": "2017-05-18 12:29:32.0"
}