{
    "dcr_id": "1512423715947",
    "lang": "en",
    "title": {
        "en": "Deputy Ministers' Announcement",
        "fr": "Annonce des sous-ministres"
    },
    "modified": "2017-12-05 00:00:00.0",
    "issued": "2017-12-05 00:00:00.0",
    "type_name": "intra-intra\/news-nouv",
    "node_id": "1279030006975",
    "layout_name": null,
    "created": "2017-12-05 11:52:18.0",
    "updated": "2017-12-05 11:52:18.0"
}