{
    "dcr_id": "1455723001455",
    "lang": "fr",
    "title": "Rappel - Appel d'int\u00e9r\u00eat : S\u00e9ance d'information sur la m\u00e9thode d'am\u00e9lioration des processus",
    "modified": "2016-02-24 00:00:00.0",
    "issued": "2016-02-17 00:00:00.0",
    "type_name": "intra-intra\/news-nouv",
    "node_id": "1279030006975",
    "layout_name": "1 column",
    "created": "2017-03-31 15:46:44.0",
    "updated": "2017-03-31 15:46:44.0"
}