{
    "dcr_id": "1554406329036",
    "lang": "en",
    "title": {
        "en": "Administrative Coordinator",
        "fr": "Coordonnateur administratif"
    },
    "modified": "2019-04-05 00:00:00.0",
    "issued": "2019-04-05 00:00:00.0",
    "type_name": "intra-intra\/empl-empl",
    "node_id": "1279029955397",
    "layout_name": null,
    "created": "2019-04-05 10:11:13.0",
    "updated": "2019-04-05 10:11:13.0"
}