{
    "dcr_id": "1523361774806",
    "lang": "en",
    "title": {
        "en": "Travel Tips and Reminders",
        "fr": "Conseils et rappels concernant les voyages"
    },
    "modified": "2018-04-12 00:00:00.0",
    "issued": "2018-04-12 00:00:00.0",
    "type_name": "intra-intra\/news-nouv",
    "node_id": "1279030006975",
    "layout_name": null,
    "created": "2018-04-12 09:45:31.0",
    "updated": "2018-04-12 09:45:31.0"
}