{
    "dcr_id": "1572375563358",
    "lang": "en",
    "title": {
        "en": "Message to Public Service Alliance of Canada (PSAC) Bargaining Unit Members",
        "fr": "Message aux membres de l'unit\u00e9 de n\u00e9gociation de l'Alliance de la fonction publique du Canada (AFPC)"
    },
    "modified": "2019-10-31 00:00:00.0",
    "issued": "2019-10-31 00:00:00.0",
    "type_name": "intra-intra\/news-nouv",
    "node_id": "1279030006975",
    "layout_name": null,
    "created": "2019-10-31 09:41:57.0",
    "updated": "2019-10-31 09:41:57.0"
}