{
    "node_id": "1559738674420",
    "parent_node_id": "1279035776084",
    "dc_id": "1371059757871",
    "landingPageUrl": {
        "en": "1371059757871",
        "fr": "1371059757871"
    },
    "parent_dc_id": "1306503292350",
    "node_title": {
        "en": "null",
        "fr": "null"
    },
    "title": {
        "en": "Education Leave",
        "fr": "Cong\u00c3\u00a9 d'\u00c3\u00a9tudes"
    },
    "type": "hr"
}