{
    "dcr_id": "1457709674758",
    "lang": "en",
    "title": {
        "en": "Sign Here Please - Mandatory Email Signature Blocks",
        "fr": "Veuillez signer ici - Bloc-signature de courriel obligatoire"
    },
    "modified": "2016-03-17 00:00:00.0",
    "issued": "2016-03-17 00:00:00.0",
    "type_name": "intra-intra\/news-nouv",
    "node_id": "1279030006975",
    "layout_name": "1 column",
    "created": "2017-03-31 15:46:44.0",
    "updated": "2017-03-31 15:46:44.0"
}