{
    "dcr_id": "1519159275716",
    "lang": "fr",
    "title": "Rappel - S\u00e9ances de d\u00e9monstration sur les d\u00e9fibrillateurs externes automatis\u00e9s",
    "modified": "2018-03-08 00:00:00.0",
    "issued": "2018-02-22 00:00:00.0",
    "type_name": "intra-intra\/news-nouv",
    "node_id": "1279030006975",
    "layout_name": null,
    "created": "2018-03-08 10:45:24.0",
    "updated": "2018-03-08 10:45:24.0"
}