{
    "dcr_id": "1527254458410",
    "lang": "fr",
    "title": "Formation sur la sant\u00e9 mentale pour les employ\u00e9s - S\u00e9ances offertes en juin ",
    "modified": "2018-05-31 00:00:00.0",
    "issued": "2018-05-31 00:00:00.0",
    "type_name": "intra-intra\/news-nouv",
    "node_id": "1279030006975",
    "layout_name": null,
    "created": "2018-05-31 08:55:23.0",
    "updated": "2018-05-31 08:55:23.0"
}