{
    "dcr_id": "1528143676792",
    "lang": "en",
    "title": {
        "en": "Invitation to Join AAFC's Policy Community of Practice ",
        "fr": "Invitation \u00e0 rejoindre les rangs de la Communaut\u00e9 de pratique du domaine des politiques d'AAC"
    },
    "modified": "2018-06-07 00:00:00.0",
    "issued": "2018-06-07 00:00:00.0",
    "type_name": "intra-intra\/news-nouv",
    "node_id": "1279030006975",
    "layout_name": null,
    "created": "2018-06-07 11:24:57.0",
    "updated": "2018-06-07 11:24:57.0"
}