{
    "dcr_id": "1359492169157",
    "lang": "en",
    "title": {
        "en": "Science Policy Analyst",
        "fr": "Analyste, Politiques scientifiques"
    },
    "modified": "2013-02-01 00:00:00.0",
    "issued": "2013-02-01 00:00:00.0",
    "type_name": "intra-intra\/empl-empl",
    "node_id": "1279029955397",
    "layout_name": "1 column",
    "created": "2017-03-30 13:06:10.0",
    "updated": "2017-03-30 13:06:10.0"
}