{
    "dcr_id": "1542730055342",
    "lang": "en",
    "title": {
        "en": "This Week in The Harvest - \"A Journey We Must Make Together\": Remembering the Brandon Indian Residential School",
        "fr": "Au menu de La Moisson cette semaine - \u00ab Un cheminement que nous devons faire ensemble \u00bb : en m\u00e9moire du pensionnat indien de Brandon"
    },
    "modified": "2018-11-22 00:00:00.0",
    "issued": "2018-11-22 00:00:00.0",
    "type_name": "intra-intra\/news-nouv",
    "node_id": "1279030006975",
    "layout_name": null,
    "created": "2018-11-22 09:30:13.0",
    "updated": "2018-11-22 09:30:13.0"
}