{
    "dcr_id": "1536074233297",
    "lang": "en",
    "title": {
        "en": "This Week in The Harvest - Working Together to Produce Results: Showcasing Quebec's Research and Development Centres",
        "fr": "Au menu de La Moisson cette semaine - Produire des r\u00e9sultats en travaillant ensemble : pleins feux sur les Centres de recherche et de d\u00e9veloppement du Qu\u00e9bec"
    },
    "modified": "2018-09-06 00:00:00.0",
    "issued": "2018-09-06 00:00:00.0",
    "type_name": "intra-intra\/news-nouv",
    "node_id": "1279030006975",
    "layout_name": null,
    "created": "2018-09-06 09:32:59.0",
    "updated": "2018-09-06 09:32:59.0"
}