{
    "dcr_id": "1327070002134",
    "lang": "en",
    "title": {
        "en": "Work Force Adjustment",
        "fr": "R\u00e9am\u00e9nagement des effectifs"
    },
    "modified": "2017-02-24 00:00:00.0",
    "issued": "2012-01-30 00:00:00.0",
    "type_name": "intra-intra\/gene-gene",
    "node_id": "1285347861916",
    "layout_name": "1 column",
    "created": "2017-03-30 13:04:01.0",
    "updated": "2017-03-30 13:04:01.0"
}