{
    "dcr_id": "1547592307292",
    "lang": "fr",
    "title": "Conseiller\/Conseill\u00e8re de politiques aupr\u00e8s du sous-ministre adjoint",
    "modified": "2019-01-17 00:00:00.0",
    "issued": "2019-01-17 00:00:00.0",
    "type_name": "intra-intra\/empl-empl",
    "node_id": "1279029955397",
    "layout_name": null,
    "created": "2019-01-17 10:09:57.0",
    "updated": "2019-01-17 10:09:57.0"
}