{
    "dcr_id": "1508183231302",
    "lang": "en",
    "title": {
        "en": "Cancelled - NCR - GCWCC Charity Chess Match - November 1",
        "fr": "Annul\u00e9 - RCN - Concours d'\u00e9checs de la CCMTGC - 1<sup>er<\/sup> novembre"
    },
    "modified": "2017-10-27 00:00:00.0",
    "issued": "2017-10-19 00:00:00.0",
    "type_name": "intra-intra\/news-nouv",
    "node_id": "1279030006975",
    "layout_name": null,
    "created": "2017-10-27 16:07:11.0",
    "updated": "2017-10-27 16:07:11.0"
}