{
    "dcr_id": "1558457995403",
    "lang": "en",
    "title": {
        "en": "Submit a Nomination for the Excellence and Leadership in Official Languages Award by July 15",
        "fr": "Soumettez une candidature pour le Prix d\u2019excellence et de leadership en langues officielles d\u2019ici le 15 juillet"
    },
    "modified": "2019-07-10 00:00:00.0",
    "issued": "2019-05-23 00:00:00.0",
    "type_name": "intra-intra\/news-nouv",
    "node_id": "1279030006975",
    "layout_name": null,
    "created": "2019-07-10 14:44:07.0",
    "updated": "2019-07-10 14:44:07.0"
}