{
    "dcr_id": "1489090331390",
    "lang": "en",
    "title": {
        "en": "Liaison Officer for Indigenous Strategy",
        "fr": "Agent\/agente de liaison pour la strat\u00e9gie Autochtone"
    },
    "modified": "2017-03-13 00:00:00.0",
    "issued": "2017-03-13 00:00:00.0",
    "type_name": "intra-intra\/empl-empl",
    "node_id": "1279029955397",
    "layout_name": "1 column",
    "created": "2017-03-30 13:06:11.0",
    "updated": "2017-03-30 13:06:11.0"
}