{
    "dcr_id": "1479922254280",
    "lang": "fr",
    "title": "Rappel - Entretien pr\u00e9vu des services de la DGSI, y compris le service de courriel BlackBerry - Le 3 d\u00e9cembre",
    "modified": "2016-11-29 00:00:00.0",
    "issued": "2016-11-24 00:00:00.0",
    "type_name": "intra-intra\/news-nouv",
    "node_id": "1279030006975",
    "layout_name": "1 column",
    "created": "2017-03-31 15:46:45.0",
    "updated": "2017-03-31 15:46:45.0"
}