{
    "dcr_id": "1574177768548",
    "lang": "en",
    "title": {
        "en": "Senior Business Manager",
        "fr": "Gestionnaire principal des affaires"
    },
    "modified": "2019-11-19 00:00:00.0",
    "issued": "2019-11-19 00:00:00.0",
    "type_name": "intra-intra\/empl-empl",
    "node_id": "1279029955397",
    "layout_name": null,
    "created": "2019-11-19 14:24:33.0",
    "updated": "2019-11-19 14:24:33.0"
}