{
    "dcr_id": "1479391834518",
    "lang": "fr",
    "title": "Rappel - Report de la date limite : Prix Moisson d'or de 2017 - Mises en candidature - Le 27 janvier",
    "modified": "2017-01-25 00:00:00.0",
    "issued": "2016-11-17 00:00:00.0",
    "type_name": "intra-intra\/news-nouv",
    "node_id": "1279030006975",
    "layout_name": "1 column",
    "created": "2017-03-31 15:46:45.0",
    "updated": "2017-03-31 15:46:45.0"
}