{
    "dcr_id": "1466610693344",
    "lang": "en",
    "title": {
        "en": "Mobile Device Use Outside of Canada",
        "fr": "Utilisation des appareils mobiles \u00e0 l'ext\u00e9rieur du Canada"
    },
    "modified": "2016-06-23 00:00:00.0",
    "issued": "2016-06-23 00:00:00.0",
    "type_name": "intra-intra\/news-nouv",
    "node_id": "1279030006975",
    "layout_name": "1 column",
    "created": "2017-03-31 15:46:44.0",
    "updated": "2017-03-31 15:46:44.0"
}