{
    "dcr_id": "1482353689214",
    "lang": "fr",
    "title": "Meilleurs voeux du temps des F\u00eates du ministre MacAulay",
    "modified": "2017-01-05 00:00:00.0",
    "issued": "2016-12-21 00:00:00.0",
    "type_name": "intra-intra\/news-nouv",
    "node_id": "1279030006975",
    "layout_name": "1 column",
    "created": "2017-03-31 15:46:45.0",
    "updated": "2017-03-31 15:46:45.0"
}