{
    "dcr_id": "1442419446949",
    "lang": "en",
    "title": {
        "en": "Research Officer \u2013 Special Project, Visible Minority Network",
        "fr": "Agent de recherche \u2013 projet sp\u00e9cial, R\u00e9seau des minorit\u00e9s visibles"
    },
    "modified": "2015-10-02 00:00:00.0",
    "issued": "2015-09-17 00:00:00.0",
    "type_name": "intra-intra\/empl-empl",
    "node_id": "1279029955397",
    "layout_name": "1 column",
    "created": "2017-03-30 13:06:11.0",
    "updated": "2017-03-30 13:06:11.0"
}