{
    "dcr_id": "1567790103084",
    "lang": "en",
    "title": {
        "en": "2019 Elections - Remembering Our Obligations as Public Servants",
        "fr": "\u00c9lections 2019 - Rappel de nos obligations \u00e0 titre de fonctionnaires"
    },
    "modified": "2019-09-12 00:00:00.0",
    "issued": "2019-09-06 00:00:00.0",
    "type_name": "intra-intra\/news-nouv",
    "node_id": "1279030006975",
    "layout_name": null,
    "created": "2019-09-12 11:42:19.0",
    "updated": "2019-09-12 11:42:19.0"
}