{
    "dcr_id": "1496925878286",
    "lang": "en",
    "title": {
        "en": "2017 Awards Recipients",
        "fr": "Laur\u00e9ats des prix de 2017 "
    },
    "modified": "2019-07-08 00:00:00.0",
    "issued": "2017-06-08 00:00:00.0",
    "type_name": "intra-intra\/gene-gene",
    "node_id": "1285342970491",
    "layout_name": "1 column",
    "created": "2019-07-08 13:50:30.0",
    "updated": "2019-07-08 13:50:30.0"
}