{
    "dcr_id": "1544637714445",
    "lang": "fr",
    "title": "Chef d\u2019\u00e9quipe, fonctionnement et soutien du SGDE",
    "modified": "2018-12-14 00:00:00.0",
    "issued": "2018-12-14 00:00:00.0",
    "type_name": "intra-intra\/empl-empl",
    "node_id": "1279029955397",
    "layout_name": null,
    "created": "2018-12-14 10:47:51.0",
    "updated": "2018-12-14 10:47:51.0"
}