{
    "dcr_id": "1460558089348",
    "lang": "en",
    "title": {
        "en": "Scheduled Maintenance of ISB Services including BlackBerry Email Services - April 16 to 17",
        "fr": "Entretien pr\u00e9vu des services de la DGSI, y compris les services de courriel BlackBerry - Du 16 au 17 avril"
    },
    "modified": "2016-04-13 00:00:00.0",
    "issued": "2016-04-13 00:00:00.0",
    "type_name": "intra-intra\/news-nouv",
    "node_id": "1279030006975",
    "layout_name": "1 column",
    "created": "2017-03-31 15:46:44.0",
    "updated": "2017-03-31 15:46:44.0"
}