{
    "dcr_id": "1554220820936",
    "lang": "en",
    "title": {
        "en": "Reminder: Managers' Community Learning Day - May 1 ",
        "fr": "Rappel : journ\u00e9e d'apprentissage pour la communaut\u00e9 des gestionnaires - 1<sup>er<\/sup> mai "
    },
    "modified": "2019-04-10 00:00:00.0",
    "issued": "2019-04-04 00:00:00.0",
    "type_name": "intra-intra\/news-nouv",
    "node_id": "1279030006975",
    "layout_name": null,
    "created": "2019-04-10 16:23:40.0",
    "updated": "2019-04-10 16:23:40.0"
}