{
    "dcr_id": "1545910929967",
    "lang": "en",
    "title": {
        "en": "Pension and Insurance Benefits Statement",
        "fr": "Relev\u00e9 de pensions et de prestations d'assurance"
    },
    "modified": "2019-01-03 00:00:00.0",
    "issued": "2019-01-03 00:00:00.0",
    "type_name": "intra-intra\/news-nouv",
    "node_id": "1279030006975",
    "layout_name": null,
    "created": "2019-01-03 08:30:28.0",
    "updated": "2019-01-03 08:30:28.0"
}