{
    "dcr_id": "1574793430578",
    "lang": "fr",
    "title": "RCN - GCWCC - Bilan et derni\u00e8re chance de faire un don",
    "modified": "2019-11-28 00:00:00.0",
    "issued": "2019-11-28 00:00:00.0",
    "type_name": "intra-intra\/news-nouv",
    "node_id": "1279030006975",
    "layout_name": null,
    "created": "2019-11-28 14:48:04.0",
    "updated": "2019-11-28 14:48:04.0"
}