{
    "dcr_id": "1475752937867",
    "lang": "fr",
    "title": "Au menu d'AgriCulture cette semaine - AAC passe au biologique",
    "modified": "2016-10-06 00:00:00.0",
    "issued": "2016-10-06 00:00:00.0",
    "type_name": "intra-intra\/news-nouv",
    "node_id": "1279030006975",
    "layout_name": "1 column",
    "created": "2017-03-31 15:46:45.0",
    "updated": "2017-03-31 15:46:45.0"
}