{
    "dcr_id": "1540911671892",
    "lang": "en",
    "title": {
        "en": "This Week in The Harvest - \"On the Verge of Something Big\": Women In Science Workshop in Fredericton",
        "fr": "Au menu de La Moisson cette semaine - \u00ab En voie de franchir une \u00e9tape importante \u00bb : un atelier sur les femmes en sciences \u00e0 Fredericton"
    },
    "modified": "2018-12-27 00:00:00.0",
    "issued": "2018-11-01 00:00:00.0",
    "type_name": "intra-intra\/news-nouv",
    "node_id": "1279030006975",
    "layout_name": null,
    "created": "2018-12-27 08:37:51.0",
    "updated": "2018-12-27 08:37:51.0"
}