{
    "dcr_id": "1504621950508",
    "lang": "fr",
    "title": "Au menu de La Moisson cette semaine - Un esprit sain dans un corps sain... dans un milieu de travail sain!",
    "modified": "2017-09-07 00:00:00.0",
    "issued": "2017-09-07 00:00:00.0",
    "type_name": "intra-intra\/news-nouv",
    "node_id": "1279030006975",
    "layout_name": null,
    "created": "2017-09-07 09:44:26.0",
    "updated": "2017-09-07 09:44:26.0"
}