{
    "dcr_id": "1573669963152",
    "lang": "en",
    "title": {
        "en": "Life changes and my pay and benefits",
        "fr": "Les changements dans ma vie, ma paye et mes avantages sociaux"
    },
    "modified": "2020-02-17 00:00:00.0",
    "issued": "2020-02-17 00:00:00.0",
    "type_name": "intra-intra\/gene-gene",
    "node_id": "1279035583756",
    "layout_name": "1 column",
    "created": "2020-02-20 12:51:28.0",
    "updated": "2020-02-20 12:51:28.0"
}