{
    "dcr_id": "1579114083473",
    "lang": "en",
    "title": {
        "en": "Scheduled Maintenance of ISB Services - January 18",
        "fr": "Entretien pr\u00e9vu des services de la DGSI - 18 janvier"
    },
    "modified": "2020-01-16 00:00:00.0",
    "issued": "2020-01-16 00:00:00.0",
    "type_name": "intra-intra\/news-nouv",
    "node_id": "1279030006975",
    "layout_name": null,
    "created": "2020-01-16 09:53:20.0",
    "updated": "2020-01-16 09:53:20.0"
}