fr\snyker\bots\commands\ICommand.class
fr\snyker\bots\Console.class
fr\snyker\bots\SoNight.class
fr\snyker\bots\audio\AudioPlayerSendHandler.class
fr\snyker\bots\commands\CommandLast.class
fr\snyker\bots\commands\CommandLeave.class
fr\snyker\bots\Main.class
fr\snyker\bots\commands\CommandManager.class
fr\snyker\bots\commands\CommandNext.class
fr\snyker\bots\commands\CommandJoin.class
fr\snyker\bots\commands\CommandExecutor.class
fr\snyker\bots\listeners\MessageReceivedListener.class
fr\snyker\bots\commands\CommandPlay.class
