vhdl work "E:\Relogio Mundial\RelogioMundial\tela.vhd"
vhdl work "E:\Relogio Mundial\RelogioMundial\Contador.vhd"
vhdl work "E:\Relogio Mundial\RelogioMundial\contadoHora.vhd"
vhdl work "E:\Relogio Mundial\RelogioMundial\ParteMinuto.vhd"
