1,3
2,1
3,2
4,3
5,1
6,2
7,3
8,1
9,2
10,3
11,1
12,2
13,2
14,2
15,3
16,1
17,2
18,3
19,1
20,2
21,3
22,1
23,2
24,3
25,1
26,2
27,2
28,3
29,1
30,2
31,1
32,1
33,2
34,3
35,1
36,2
37,3
38,1
39,3
40,2
41,3
42,1
43,2
44,3
45,1
46,2
47,3
48,1
49,2
50,3
