{
    "package_version": "1.0",
    "id": "2d520318-039f-4977-9609-1c47ade15712",
    "type": "client-app",
    "name": "Prx-custom html tile",
    "description": "Html tile without any borders",
    "minimum_version": "0080300000",
    "icon_16": "extension-16.png",
    "icon_48": "extension-48.png",
    "icon_128": "extension-128.png",
    "released_on": "2017-04-04T12:00:00.000Z",
    "service_url": "http://localhost",
    "redirect_url": "%serviceURL%",
    "releasedOn": "2017-04-04T12:00:00.000Z"
}
