<?xml version="1.0" encoding="utf-8"?>
<!-- Generator: Adobe Illustrator 19.0.0, SVG Export Plug-In . SVG Version: 6.00 Build 0)  -->
<svg version="1.1" id="Layer_1" xmlns="http://www.w3.org/2000/svg" xmlns:xlink="http://www.w3.org/1999/xlink" x="0px" y="0px"
	 viewBox="0 0 300 300" style="enable-background:new 0 0 300 300;" xml:space="preserve">
    <style type="text/css">
	.prx-svgpath{fill:#5c2d91;}
    </style>
<g id="XMLID_28_">
	<path class="prx-svgpath" id="XMLID_29_" d="M139.4,197.8c0,24.8-16.8,57.7-59.6,57.7c-34.8,0-57.1-25.4-57.1-54c0-15.5,6.2-37.2,15.5-57.1l34.1-74.5
		c6.2-14.3,17.4-25.5,38.5-25.5c19.2,0,29.8,13,29.8,24.8s-3.1,17.4-24.8,80.1C125.8,158.1,139.4,174.8,139.4,197.8z M93.5,152.5
		c0-1.9,1.9-8.7,3.1-11.8c7.4-22.4,23.6-62.7,23.6-68.3c0-6.2-3.1-9.3-9.3-9.3c-11.8,0-16.8,8.1-21.7,18.6l-31,70.1
		c-8.1,18.6-13,37.9-13,49.7c0,21.1,14.9,35.4,34.8,35.4c26.7,0,37.9-21.7,37.9-39.1c0-17.4-9.3-26.7-15.5-32.9
		C97.2,159.9,93.5,158.1,93.5,152.5z M276,197.8c0,24.8-16.8,57.7-59.6,57.7c-34.8,0-57.1-25.4-57.1-54c0-15.5,6.2-37.2,15.5-57.1
		L209,69.9c6.2-14.3,17.4-25.5,38.5-25.5c19.2,0,29.8,13,29.8,24.8s-3.1,17.4-24.8,80.1C262.4,158.1,276,174.8,276,197.8z
		 M230.1,152.5c0-1.9,1.9-8.7,3.1-11.8c7.5-22.4,23.6-62.7,23.6-68.3c0-6.2-3.1-9.3-9.3-9.3c-11.8,0-16.8,8.1-21.7,18.6l-31,70.1
		c-8.1,18.6-13,37.9-13,49.7c0,21.1,14.9,35.4,34.8,35.4c26.7,0,37.9-21.7,37.9-39.1c0-17.4-9.3-26.7-15.5-32.9
		C233.8,159.9,230.1,158.1,230.1,152.5z"/>
</g>
</svg>
