{
  "integrationUser": {
        "systemAdmin": false
    },
  "tiles": [
      {
          "displayName": "Proximus Video Hero Tile",
          "name": "CustomViewTile",
          "description": " Video Hero tiles",
          "style": "CUSTOM_VIEW",
          "displayWidth": "ALL",
          "dataProviderKey": "internal",
          "pageTypes": [
              "PLACE",
              "USER",
              "NEWS",
              "MOBILE"
          ],
          "i18n": "main.langstring",
          "icons": {
              "16": "extension-16.png",
              "48": "extension-48.png",
              "128": "extension-128.png"
          },
          "config":  "/public/tiles/CustomViewTile/configuration.html",
          "view": "/public/tiles/CustomViewTile/view.html?features=core-v3,tile,responsive"
      }
  ]
}
