{
  "Preprojeto": [
    {
      "nome": "Desenvolvimento Tecnologico",
      "orientador": "Guedes",
      "observacoes": "Muito bom esse projeto",
      "id": 1
    },
    {
      "nome": "Tecnologia da Informação",
      "orientador": "Júlio",
      "observacoes": "Testando Busca",
      "id": 2
    }
  ]
}