id;nombre
1;optical card Canarias
2;microchip Programable Barrio
3;Agente infomediaries redundant
4;solid Murcia
5;Diseñador Acero open-source
6;orchestrate
7;Indonesia
8;transmit Métricas
9;Pública
10;RSS
