{
  "applications": "*",
  "changelogDate": "20220524164831",
  "dto": "no",
  "embedded": false,
  "entityTableName": "equipo",
  "fields": [
    {
      "fieldName": "nombre",
      "fieldType": "String",
      "fieldValidateRules": ["required"]
    }
  ],
  "fluentMethods": true,
  "jpaMetamodelFiltering": false,
  "name": "Equipo",
  "pagination": "no",
  "readOnly": false,
  "relationships": [],
  "service": "serviceImpl"
}
