id;nombres;apellidos
1;Reducido;Regional
2;Cambridgeshire Sorprendente Vasco;Refinado Vasco
3;Pizza Rambla Avon;Diseñador a
4;Representante conjunto;Supervisor infrastructures wireless
5;Morado;copy
6;card indexing;microchip
7;Inteligente;payment
8;compressing;invoice
9;innovadora;compress compressing harness
10;quantify Ergonómico;leverage
