#(define (tie::tab-clear-tied-fret-numbers grob)
   (let* ((tied-fret-nr (ly:spanner-bound grob RIGHT)))
      (ly:grob-set-property! tied-fret-nr 'transparent #t)))

\version "2.16.0"
\paper {
   indent = #0
   print-all-headers = ##t
   print-all-headers = ##t
   ragged-right = ##f
   ragged-bottom = ##t
}
\layout {
   \context { \Score
      \override MetronomeMark #'padding = #'5
   }
   \context { \Staff
      \override TimeSignature #'style = #'numbered
      \override StringNumber #'transparent = ##t
   }
   \context { \TabStaff
      \override TimeSignature #'style = #'numbered
      \override Stem #'transparent = ##t
      \override Flag #'transparent = ##t
      \override Beam #'transparent = ##t
      \override Tie  #'after-line-breaking = #tie::tab-clear-tied-fret-numbers
   }
   \context { \TabVoice
      \override Tie #'stencil = ##f
   }
   \context { \StaffGroup
      \consists "Instrument_name_engraver"
   }
}
deadNote = #(define-music-function (parser location note) (ly:music?)
   (set! (ly:music-property note 'tweaks)
      (acons 'stencil ly:note-head::print
         (acons 'glyph-name "2cross"
            (acons 'style 'special
               (ly:music-property note 'tweaks)))))
   note)

palmMute = #(define-music-function (parser location note) (ly:music?)
   (set! (ly:music-property note 'tweaks)
      (acons 'style 'do (ly:music-property note 'tweaks)))
   note)

TrackAVoiceAMusic = #(define-music-function (parser location inTab) (boolean?)
#{
   %\tempo 4=120
   \clef #(if inTab "tab" "treble_8")
   \key c \major
   \time 4/4
   \oneVoice
   <f\2 c\3 >4 <f\2>4 <f\2 d\3 >4 <g\4>4 
   <a\1 f\2 >2 <e\2 g\4 >2 
   <d\3 f\2 >4 <a\1>4 <g\4 e\2 >4 <g\4>4 
   <c\3 f\2 >1 
   <f\2 c\3 >4 <f\2>4 <f\2 d\3 >4 <g\4>4 
   <a\1 f\2 >2 <e\2 g\4 >2 
   <d\3 f\2 >4 <a\1>4 <g\4 e\2 >4 <g\4>4 
   <c\3 f\2 >1 
   <e\2 g\4 >4 <g\4>4 <dis\3 g\4 >4 <g\4>4 
   <d\3 g\4 >2 <d\3>2 
   <g\4 e\2 >4 <d\3 f\2 >4 <e\2 c\3 >4 <d\3>4 
   <c\3>1 
   <f\2 c\3 >4 <f\2>4 <f\2 d\3 >4 <g\4>4 
   <a\1 f\2 >2 <e\2 g\4 >2 
   <d\3 f\2 >4 <a\1>4 <g\4 e\2 >4 <g\4>4 
   <c\3 f\2 >1 
   \bar "|."
   \pageBreak
#})
TrackAVoiceBMusic = #(define-music-function (parser location inTab) (boolean?)
#{
#})
TrackALyrics = \lyricmode {
   \set ignoreMelismata = ##t
   
   \unset ignoreMelismata
}
TrackAStaff = \new Staff <<
   \context Voice = "TrackAVoiceAMusic" {
      \removeWithTag #'chords
      \removeWithTag #'texts
      \TrackAVoiceAMusic ##f
   }
   \context Voice = "TrackAVoiceBMusic" {
      \removeWithTag #'chords
      \removeWithTag #'texts
      \TrackAVoiceBMusic ##f
   }
>>
TrackATabStaff = \new TabStaff \with { stringTunings = #`(,(ly:make-pitch -1 5 NATURAL) ,(ly:make-pitch -1 2 NATURAL) ,(ly:make-pitch -1 0 NATURAL) ,(ly:make-pitch -1 4 NATURAL) ) } <<
   \context TabVoice = "TrackAVoiceAMusic" {
      \removeWithTag #'chords
      \removeWithTag #'texts
      \TrackAVoiceAMusic ##t
   }
   \context TabVoice = "TrackAVoiceBMusic" {
      \removeWithTag #'chords
      \removeWithTag #'texts
      \TrackAVoiceBMusic ##t
   }
>>
TrackAStaffGroup = \new StaffGroup <<
   \TrackAStaff
   \TrackATabStaff
>>
\score {
   \TrackAStaffGroup
   \header {
      title = "Au Clair De La Lune" 
      composer = "" 
   }
%\midi{\tempo 4 = 160}
}
nt = "Ukulele (gCEA)"
      poet="Arranged by Julien Siebert"
   }
%\midi{\tempo 4 = 160}
\layout{}\midi{}
}
