#(define (tie::tab-clear-tied-fret-numbers grob)
   (let* ((tied-fret-nr (ly:spanner-bound grob RIGHT)))
      (ly:grob-set-property! tied-fret-nr 'transparent #t)))

\version "2.16.0"
\paper {
   indent = #0
   print-all-headers = ##t
   print-all-headers = ##t
   ragged-right = ##f
   ragged-bottom = ##t
}
\layout {
   \context { \Score
      \override MetronomeMark #'padding = #'5
   }
   \context { \Staff
      \override TimeSignature #'style = #'numbered
      \override StringNumber #'transparent = ##t
   }
   \context { \TabStaff
      \override TimeSignature #'style = #'numbered
      \override Stem #'transparent = ##t
      \override Flag #'transparent = ##t
      \override Beam #'transparent = ##t
      \override Tie  #'after-line-breaking = #tie::tab-clear-tied-fret-numbers
   }
   \context { \TabVoice
      \override Tie #'stencil = ##f
   }
   \context { \StaffGroup
      \consists "Instrument_name_engraver"
   }
}
deadNote = #(define-music-function (parser location note) (ly:music?)
   (set! (ly:music-property note 'tweaks)
      (acons 'stencil ly:note-head::print
         (acons 'glyph-name "2cross"
            (acons 'style 'special
               (ly:music-property note 'tweaks)))))
   note)

palmMute = #(define-music-function (parser location note) (ly:music?)
   (set! (ly:music-property note 'tweaks)
      (acons 'style 'do (ly:music-property note 'tweaks)))
   note)

TrackAVoiceAMusic = #(define-music-function (parser location inTab) (boolean?)
#{

   \clef #(if inTab "tab" "treble_8")
   \key c \major
   \time 4/4
   \oneVoice
   r2 r4 <c\3>8 <c\3>8
   <c\3 f\2 a\1 >2 r8 <f\2>8 <g\4>8 <f\2>8
   <d\3 f\2 a\1 >2 r4 <d\3>8 <d\3>8
   <d\3 f\2 ais\1 >2 r8 <g\4>8 <a\1>8 <g\4>8
   <e\2 c\3 g\4 >2 r4 <e\2>8 <e\2>8
   <f\2 c'\1 c\3 >2 r8 <a\1>8 <ais\2>8 <c'\4>8
   <d'\1 f\3 ais\2 >2 r4 <f\2>8 <g\4>8
   <a\1 f\2 >2 r8 <e\2>8 <f\3>8 <g\4>8
   <f\2 c\3 >1
   \bar "|."
   \pageBreak
#})
TrackAVoiceBMusic = #(define-music-function (parser location inTab) (boolean?)
#{
#})
TrackALyrics = \lyricmode {
   \set ignoreMelismata = ##t

   \unset ignoreMelismata
}
TrackAStaff = \new Staff <<
   \context Voice = "TrackAVoiceAMusic" {
      \TrackAVoiceAMusic ##f
   }
   \context Voice = "TrackAVoiceBMusic" {
      \TrackAVoiceBMusic ##f
   }
>>
TrackATabStaff = \new TabStaff \with { stringTunings = #`(,(ly:make-pitch -1 5 NATURAL) ,(ly:make-pitch -1 2 NATURAL) ,(ly:make-pitch -1 0 NATURAL) ,(ly:make-pitch -1 4 NATURAL) ) } <<
   \context TabVoice = "TrackAVoiceAMusic" {
      \removeWithTag #'chords
      \removeWithTag #'texts
      \TrackAVoiceAMusic ##t
   }
   \context TabVoice = "TrackAVoiceBMusic" {
      \removeWithTag #'chords
      \removeWithTag #'texts
      \TrackAVoiceBMusic ##t
   }
>>
TrackAStaffGroup = \new StaffGroup <<
   \TrackAStaff
   \TrackATabStaff
>>
\score {
   \TrackAStaffGroup

   \header {
      copyright="CC BY-SA 4.0"
      title = "Donkey Kong Country Theme"
      composer = \markup \left-column {"David Wise" "Eveline Fischer" "Robin Beanland"}
      instrument = "Ukulele (gCEA)"
      poet="Arranged by Julien Siebert"
   }
\layout{}\midi{}
}
