DATASET,LINES,BYTES,WORKERS,STEPS,FUNCTION_CALLS,PRIMITIVE_CALLS,TIME
"amazon_10000.txt",10000,294840,0,10,1838170,1837864,1.079
"amazon_50000.txt",50000,1681225,0,10,9088034,9087768,5.874
"amazon_100000.txt",100000,3470053,0,10,18118220,18117913,12.262
"amazon_150000.txt",150000,5420329,0,10,27089735,27089469,18.972
"amazon_200000.txt",200000,7380644,0,10,36037729,36037457,25.498
"amazon_250000.txt",250000,9300163,0,10,44682722,44682450,32.163
