LINES,JULIA_KB,FILE_BYTES,FILE
10000,1250,294840,../data/amazon_10000.txt
50000,6250,1681225,../data/amazon_50000.txt
100000,12500,3470053,../data/amazon_100000.txt
150000,18750,5420329,../data/amazon_150000.txt
200000,25000,7380644,../data/amazon_200000.txt
250000,31250,9300163,../data/amazon_250000.txt
