DATASET,LINES,BYTES,WORKERS,STEPS,FUNCTION_CALLS,PRIMITIVE_CALLS,TIME
"amazon_100000.txt",100000,3470053,0,10,22103854,22103848,17.838
"amazon_10000.txt",10000,294840,0,10,2221090,2221084,1.328
"amazon_150000.txt",150000,5420329,0,10,33077349,33077343,30.677
"amazon_200000.txt",200000,7380644,0,10,44017931,44017925,54.398
"amazon_50000.txt",50000,1681225,0,10,11075212,11075206,8.005
"amazon_250000.txt",250000,9300163,0,10,54660854,54660848,83.172
"Amazon/adj-map-amazon0302.csv",257570,9592046,0,10,22652120,22652108,92.075
