release,date_month,date_year,nb_loci,nb_bases,nb_sequences
74,12,1992,97084,120242234,97084
75,2,1993,106684,126212259,106684
76,4,1993,111911,129968355,111911
77,6,1993,120134,138904393,120134
78,8,1993,131328,147215633,131328
79,10,1993,143492,157152442,143492
80,12,1993,150744,163802597,150744
81,2,1994,162946,173261500,162946
82,4,1994,169896,180589455,169896
83,6,1994,182753,191393939,182753
84,8,1994,196703,201815802,196703
85,10,1994,215273,217102462,215273
86,12,1994,237775,230485928,237775
87,2,1995,269478,248499214,269478
88,4,1995,352414,286094556,352414
89,6,1995,425211,318624568,425211
90,8,1995,492483,353713490,492483
91,10,1995,555694,384939485,555694
92,12,1995,620765,425860958,620765
93,2,1996,685693,463758833,685693
94,4,1996,744295,499127741,744295
95,6,1996,835487,551750920,835487
96,8,1996,920588,602072354,920588
97,10,1996,1021211,651972984,1021211
98,12,1996,1114581,730552938,1114581
99,2,1997,1192505,786898138,1192505
100,4,1997,1274747,842864309,1274747
101,6,1997,1491069,966993087,1491069
102,8,1997,1610848,1053474516,1610848
103,10,1997,1765847,1160300687,1765847
104,12,1997,1891953,1258290513,1891953
105,2,1998,2042325,1372368913,2042325
106,4,1998,2209232,1502542306,2209232
107,6,1998,2355928,1622041465,2355928
108,8,1998,2532359,1797137713,2532359
109,10,1998,2837897,2008761784,2837897
110,12,1998,3043729,2162067871,3043729
111,4,1999,3525418,2569578208,3525418
112,6,1999,4028171,2974791993,4028171
113,8,1999,4610118,3400237391,4610118
114,10,1999,4864570,3841163011,4864570
115,12,1999,5354511,4653932745,5354511
116,2,2000,5691170,5805414935,5691170
117,4,2000,6215002,7376080723,6215002
118,6,2000,7077491,8604221980,7077491
119,8,2000,8214339,9545724824,8214339
120,10,2000,9102634,10335692655,9102634
121,12,2000,10095711,11096777808,10095711
122,2,2001,10896781,11720120326,10896781
123,4,2001,11545572,12418544023,11545572
124,6,2001,12243766,12973707065,12243766
125,,2001,12813516,13543364296,12813516
126,10,2001,13602262,14396883064,13602262
127,12,2001,14976310,15849921438,14976310
128,2,2002,15465325,17089143893,15465325
129,4,2002,16769983,19072679701,16769983
130,6,2002,17471130,20648748345,17471130
131,8,2002,18197119,22616937182,18197119
132,10,2002,19808101,26525934656,19808101
133,12,2002,22318883,28507990166,22318883
134,2,2003,23035823,29358082791,23035823
135,4,2003,24027936,31099264455,24027936
136,6,2003,25592865,32528249295,25592865
137,8,2003,27213748,33865022251,27213748
138,10,2003,29819397,35599621471,29819397
139,12,2003,30968418,36553368485,30968418
140,2,2004,32549400,37893844733,32549400
141,4,2004,33676218,38989342565,33676218
142,6,2004,35532003,40325321348,35532003
143,8,2004,37343937,41808045653,37343937
144,10,2004,38941263,43194602655,38941263
145,12,2004,40604319,44575745176,40604319
146,2,2005,42734478,46849831226,42734478
147,4,2005,44202133,48235738567,44202133
148,6,2005,45236251,49398852122,45236251
149,8,2005,46947388,51674486881,46947388
150,10,2005,49152445,53655236500,49152445
151,12,2005,52016762,56037734462,52016762
152,2,2006,54584635,59750386305,54584635
153,4,2006,56620500,61582143971,56620500
154,6,2006,58890345,63412609711,58890345
155,8,2006,61132599,65369091950,61132599
156,10,2006,62765195,66925938907,62765195
157,12,2006,64893747,69019290705,64893747
158,2,2007,67218344,71292211453,67218344
159,4,2007,71802595,75742041056,71802595
160,6,2007,73078143,77248690945,73078143
161,8,2007,76146236,79525559650,76146236
162,10,2007,77632813,81563399765,77632813
163,12,2007,80388382,83874179730,80388382
164,2,2008,82853685,85759586764,82853685
165,4,2008,85500730,89172350468,85500730
166,6,2008,88554578,92008611867,88554578
167,8,2008,92748599,95033791652,92748599
168,10,2008,96400790,97381682336,96400790
169,12,2008,98868465,99116431942,98868465
170,2,2009,101815678,101467270308,101815678
171,4,2009,103335421,102980268709,103335421
172,6,2009,106073709,105277306080,106073709
173,8,2009,108431692,106533156756,108431692
174,10,2009,110946879,108560236506,110946879
175,12,2009,112910950,110118557163,112910950
176,2,2010,116461672,112326229652,116461672
177,4,2010,119112251,114348888771,119112251
178,6,2010,120604423,115624497715,120604423
179,8,2010,122941883,117476523128,122941883
180,10,2010,125764384,118551641086,125764384
181,12,2010,129902276,122082812719,129902276
182,2,2011,132015054,124277818310,132015054
183,4,2011,135440924,126551501141,135440924
184,6,2011,140482268,129178292958,140482268
185,8,2011,142284608,130671233801,142284608
186,10,2011,144458648,132067413372,144458648
187,12,2011,146413798,135117731375,146413798
188,2,2012,149819246,137384889783,149819246
189,4,2012,151824421,139266481398,151824421
190,6,2012,154130210,141343240755,154130210
191,8,2012,156424033,143081765233,156424033
192,10,2012,157889737,145430961262,157889737
193,12,2012,161140325,148390863904,161140325
194,2,2013,162886727,150141354858,162886727
195,4,2013,164136731,151178979155,164136731
196,6,2013,165740164,152599230112,165740164
197,8,2013,167295840,154192921011,167295840
198,10,2013,168335396,155176494699,168335396
199,12,2013,169331407,156230531562,169331407
200,2,2014,171123749,157943793171,171123749
201,4,2014,171744486,159813411760,171744486
202,6,2014,173353076,161822845643,173353076
203,8,2014,174108750,165722980375,174108750
204,10,2014,178322253,181563676918,178322253
205,12,2014,179295769,184938063614,179295769
206,2,2015,181336445,187893826750,181336445
207,4,2015,182188746,189739230107,182188746
208,6,2015,185019352,193921042946,185019352
209,8,2015,187066846,199823644287,187066846
210,10,2015,188372017,202237081559,188372017
211,12,2015,189232925,203939111071,189232925
212,2,2016,190250235,207018196067,190250235
213,4,2016,193739511,211423912047,193739511
214,6,2016,194463572,213200907819,194463572
215,8,2016,196120831,217971437647,196120831
216,10,2016,197390691,220731315250,197390691
217,12,2016,198565475,224973060433,198565475
218,2,2017,199341377,228719437638,199341377
219,4,2017,200877884,231824951552,200877884
220,6,2017,201663568,234997362623,201663568
221,8,2017,203180606,240343378258,203180606
222,10,2017,203953682,244914705468,203953682
223,12,2017,206293625,249722163594,206293625
224,2,2018,207040555,253630708098,207040555
225,4,2018,208452303,260189141631,208452303
226,6,2018,209775348,263957884539,209775348
227,8,2018,208831050,260806936411,208831050
228,10,2018,209656636,279668290132,209656636
229,12,2018,211281415,285688542186,211281415
230,2,2019,212260377,303709510632,212260377
231,4,2019,212775414,321680566570,212775414
232,6,2019,213383758,329835282370,213383758
233,8,2019,213865349,366733917629,213865349
234,10,2019,216763706,386197018538,216763706
235,12,2019,,388417258009,215333020
236,2,2020,,399376854872,216214215
237,4,2020,,415770027949,216531829
238,6,2020,,427823258901,217122233
239,8,2020,,654057069549,218642238
