<svg width="50" height="50" viewBox="0 0 50 50" fill="none" xmlns="http://www.w3.org/2000/svg">
    <path d="M38.75 1.667h-1.667V.833A.833.833 0 0 0 36.25 0H22.083c-2.932 0-5.36 2.178-5.766 5h-2.799a1.661 1.661 0 0 0-1.435-.833c-.919 0-1.666.747-1.666 1.666 0 .92.747 1.667 1.666 1.667.614 0 1.146-.338 1.435-.833h2.799c.406 2.822 2.834 5 5.766 5h2.205a22.276 22.276 0 0 0-5.538 14.67v17.83c0 .46.372.833.833.833v1.667c0 .46.373.833.834.833h.951a3.33 3.33 0 0 0 3.215 2.5 3.337 3.337 0 0 0 3.334-3.333c0-.92.747-1.667 1.666-1.667.92 0 1.667.748 1.667 1.667v2.5a.833.833 0 1 0 1.667 0v-2.5a3.337 3.337 0 0 0-3.334-3.334 3.337 3.337 0 0 0-3.333 3.334 1.661 1.661 0 1 1-3.102.833h.602c.46 0 .833-.373.833-.833V45c.461 0 .834-.373.834-.833V28.225a20.408 20.408 0 0 1 6.018-14.528l2.028-2.03h2.787c.46 0 .833-.374.833-.834V10h1.667c.46 0 .833-.373.833-.833V2.5a.833.833 0 0 0-.833-.833zM17.917 5.833a4.171 4.171 0 0 1 4.166-4.166V10a4.171 4.171 0 0 1-4.166-4.167zm5.833 37.5h-3.333v-3.688l3.333-1.948v5.636zm0-7.566l-3.333 1.948v-3.033l3.333-1.666v2.752zm0-7.542v2.927l-3.333 1.666v-3.136l3.338-1.67c0 .071-.005.141-.005.213zm-.833 17.608H21.25V45h1.667v.833zm7.34-33.316c-3.691 3.691-5.922 8.452-6.405 13.583l-3.435 1.718v-1.48c0-5.516 2.244-10.857 6.161-14.671h4.53l-.851.85zM35.417 10h-5V8.333a.833.833 0 1 0-1.667 0V10h-5V1.667h5v1.666a.833.833 0 1 0 1.667 0V1.667h5V10zm2.5-1.667h-.834v-5h.834v5z" fill="#fff"/>
</svg>
