Place,Name,Division,Equipment,Event,BirthDate,BirthYear,Sex,BodyweightKg,WeightClassKg,Squat1Kg,Squat2Kg,Squat3Kg,Best3SquatKg,Bench1Kg,Bench2Kg,Bench3Kg,Best3BenchKg,Deadlift1Kg,Deadlift2Kg,Deadlift3Kg,Best3DeadliftKg,TotalKg
1,Océane Borca,Sub-Juniors,Raw,SBD,,2004,F,50.6,52,95,-105,105,105,42.5,-47.5,-47.5,42.5,-120,125,130,130,277.5
2,Marion Balestra,Sub-Juniors,Raw,SBD,,2004,F,50.7,52,70,77.5,85,85,40,-45,-45,40,90,100,-110,100,225
1,Sonia Gratte,Sub-Juniors,Raw,SBD,,2004,F,54.3,57,95,105,-107.5,105,50,52.5,-55,52.5,130,-142.5,-142.5,130,287.5
1,Quitterie Tastet,Sub-Juniors,Raw,SBD,,2005,F,64.7,69,92.5,-97.5,-97.5,92.5,-57.5,-57.5,57.5,57.5,-112.5,-112.5,112.5,112.5,262.5
1,Camille Brahami,Sub-Juniors,Raw,SBD,,2007,F,71.2,76,100,-105,107.5,107.5,30,37.5,40,40,100,105,110,110,257.5
1,Alix Gourgue,Juniors,Raw,SBD,,2001,F,45.6,47,65,72.5,77.5,77.5,45,47.5,52.5,52.5,85,90,95,95,225
1,Célia Nauroy,Juniors,Raw,SBD,,2002,F,51,52,105,115,120,120,50,55,-57.5,55,120,135,-145,135,310
1,Léa Lambert #1,Juniors,Raw,SBD,,2000,F,61.2,63,105,110,115,115,62.5,-67.5,-67.5,62.5,130,140,147.5,147.5,325
2,Lucine Ou-Rabah,Juniors,Raw,SBD,,1999,F,61.6,63,105,112.5,117.5,117.5,50,55,-60,55,110,117.5,125,125,297.5
3,Ines Decleve,Juniors,Raw,SBD,,2002,F,61.4,63,105,-110,-112.5,105,55,-57.5,-57.5,55,127.5,132.5,-137.5,132.5,292.5
4,Maeva Dezon,Juniors,Raw,SBD,,2003,F,59.1,63,-92.5,97.5,-100,97.5,47.5,52.5,-55,52.5,-127.5,127.5,135,135,285
1,Cindy Lefevre,Juniors,Raw,SBD,,1999,F,76.7,84,100,-110,-110,100,-50,55,-60,55,115,122.5,125,125,280
1,Marie Duprat,Seniors,Raw,SBD,,1983,F,45.9,47,75,80,85,85,37.5,40,-42.5,40,-115,115,117.5,117.5,242.5
1,Maylis De Barros,Seniors,Raw,SBD,,1998,F,60.8,63,92.5,97.5,-100,97.5,50,52.5,55,55,110,115,120,120,272.5
2,Amandine Hureaux,Seniors,Raw,SBD,,1993,F,62.26,63,92.5,95,-100,95,55,57.5,-60,57.5,105,110,115,115,267.5
3,Laure Deloi,Seniors,Raw,SBD,,1989,F,60.9,63,90,95,100,100,50,52.5,-55,52.5,105,110,-115,110,262.5
1,Lucille Gerhardt,Seniors,Raw,SBD,,1994,F,68.4,69,117.5,127.5,132.5,132.5,72.5,75,-77.5,75,150,162.5,170,170,377.5
2,Sarah Collery,Seniors,Raw,SBD,,1998,F,65.2,69,100,110,117.5,117.5,55,62.5,65,65,105,115,-117.5,115,297.5
1,Zachary Al-Attiya,Sub-Juniors,Raw,SBD,,2006,M,65.36,66,160,167.5,175,175,95,97.5,-105,97.5,207.5,220,230,230,502.5
2,Hugues Cazelles,Sub-Juniors,Raw,SBD,,2005,M,63.96,66,120,130,140,140,-95,100,-110,100,185,-195,195,195,435
1,Kevan Bataille,Sub-Juniors,Raw,SBD,,2006,M,72.65,74,160,165,-170,165,105,110,115,115,210,220,227.5,227.5,507.5
2,Téo Brown,Sub-Juniors,Raw,SBD,,2004,M,72.99,74,130,140,147.5,147.5,110,117.5,-122.5,117.5,195,205,-215,205,470
3,Lylian Putcrabey,Sub-Juniors,Raw,SBD,,2006,M,72.92,74,135,137.5,145,145,87.5,92.5,-97.5,92.5,160,167.5,175,175,412.5
4,Romain Duprat,Sub-Juniors,Raw,SBD,,2005,M,71.19,74,140,142.5,-160,142.5,105,110,-115,110,150,-160,-170,150,402.5
5,Nathan Bobille,Sub-Juniors,Raw,SBD,,2005,M,71.01,74,110,120,130,130,70,75,-80,75,170,180,-190,180,385
6,Timéo Laborde,Sub-Juniors,Raw,SBD,,2005,M,69.59,74,102.5,110,117.5,117.5,65,70,75,75,150,157.5,167.5,167.5,360
1,Matthieu Dupuy,Sub-Juniors,Raw,SBD,,2004,M,81.9,83,150,160,-170,160,130,-135,135,135,200,-210,210,210,505
2,Lucas Rousselle,Sub-Juniors,Raw,SBD,,2005,M,82.11,83,170,177.5,182.5,182.5,95,100,-105,100,190,197.5,205,205,487.5
3,Youness Atik,Sub-Juniors,Raw,SBD,,2006,M,81.21,83,155,160,162.5,162.5,100,-107.5,110,110,170,177.5,185,185,457.5
4,Maximilien Guillaume,Sub-Juniors,Raw,SBD,,2005,M,81.02,83,145,147.5,157.5,157.5,82.5,87.5,90,90,190,200,202.5,202.5,450
5,Luca Brochon,Sub-Juniors,Raw,SBD,,2004,M,80.79,83,150,155,-160,155,105,107.5,-112.5,107.5,170,180,182.5,182.5,445
6,Pierre Brand,Sub-Juniors,Raw,SBD,,2005,M,80.93,83,140,150,160,160,90,95,-100,95,180,190,-200,190,445
1,Ethan Gloagen,Sub-Juniors,Raw,SBD,,2005,M,90.94,93,172.5,177.5,182.5,182.5,140,-145,145,145,202.5,210,215,215,542.5
1,Jonathan Jaffres,Juniors,Raw,SBD,,2003,M,58.5,59,135,137.5,-145,137.5,95,100,-105,100,177.5,187.5,-192.5,187.5,425
1,Jules Guillaume,Juniors,Raw,SBD,,2000,M,65.84,66,192.5,200,205,205,125,130,135,135,225,235,240,240,580
2,Yoann Demy,Juniors,Raw,SBD,,2000,M,65.74,66,155,165,167.5,167.5,102.5,107.5,110,110,200,210,215,215,492.5
3,Colum Hamon,Juniors,Raw,SBD,,2000,M,65.01,66,160,-172.5,172.5,172.5,105,-115,-120,105,180,195,197.5,197.5,475
4,Nicolas Couderc,Juniors,Raw,SBD,,1999,M,65.03,66,150,160,170,170,90,95,-100,95,165,175,185,185,450
1,Thomas Bouyer,Juniors,Raw,SBD,,2001,M,74,74,232.5,235,242.5,242.5,157.5,165,-170,165,267.5,280,292.5,292.5,700
2,Arthur Bris,Juniors,Raw,SBD,,2002,M,72.9,74,205,215,222.5,222.5,140,152.5,-155,152.5,225,235,-245,235,610
3,Nathan Lalande,Juniors,Raw,SBD,,1999,M,72.2,74,-175,180,190,190,117.5,-125,125,125,207.5,217.5,-225,217.5,532.5
4,Léon Guichard,Juniors,Raw,SBD,,2001,M,73.48,74,182.5,-192.5,192.5,192.5,110,115,-122.5,115,225,-235,-235,225,532.5
5,Loic Laborde,Juniors,Raw,SBD,,1999,M,71.97,74,175,180,190,190,125,130,135,135,190,200,-210,200,525
6,Maxime Lecourt,Juniors,Raw,SBD,,2002,M,71.8,74,-180,187.5,-192.5,187.5,97.5,102.5,-107.5,102.5,220,-230,230,230,520
7,Lucas Valety,Juniors,Raw,SBD,,2001,M,71.17,74,157.5,167.5,172.5,172.5,110,117.5,-120,117.5,220,-230,-230,220,510
8,Axel Ramos,Juniors,Raw,SBD,,2003,M,72.68,74,-160,160,-170,160,107.5,-110,110,110,195,210,-225,210,480
9,Lucas Zimmermann,Juniors,Raw,SBD,,2002,M,73.26,74,130,140,150,150,95,102.5,112.5,112.5,160,170,180,180,442.5
10,Romain Ballare,Juniors,Raw,SBD,,1999,M,72.18,74,-140,145,-152.5,145,105,110,-115,110,175,180,-190,180,435
DQ,Paul Grenier,Juniors,Raw,SBD,,1999,M,73.84,74,155,157.5,170,170,-110,-110,-110,,170,185,200,200,
1,Hugo Fleury,Juniors,Raw,SBD,,1999,M,81.07,83,200,202.5,212.5,212.5,135,142.5,-145,142.5,225,-245,-245,225,580
2,Iker Dufour,Juniors,Raw,SBD,,2002,M,82.2,83,-180,185,187.5,187.5,110,-115,-117.5,110,230,245,255,255,552.5
3,Mathieu Poitevin,Juniors,Raw,SBD,,2001,M,81.51,83,180,-190,190,190,117.5,125,-132.5,125,200,207.5,-212.5,207.5,522.5
4,Peio Etcheverry,Juniors,Raw,SBD,,1999,M,82,83,162.5,165,175,175,112.5,-117.5,117.5,117.5,210,225.5,-237.5,225.5,518
5,Tino Bourcereau,Juniors,Raw,SBD,,2002,M,77.22,83,137.5,145,152.5,152.5,90,95,100,100,182.5,192.5,205,205,457.5
1,Thibault Le Page,Juniors,Raw,SBD,,1999,M,92.01,93,205,220,235,235,145,155,160,160,230,250,265,265,660
2,Kevin Laurent,Juniors,Raw,SBD,,2002,M,88.85,93,190,197.5,-202.5,197.5,127.5,135,-140,135,240,257.5,267.5,267.5,600
3,Timothee Lapierre,Juniors,Raw,SBD,,2002,M,89.2,93,190,-200,200,200,102.5,107.5,115,115,200,212.5,220,220,535
4,Louison Boursier,Juniors,Raw,SBD,,2001,M,88.47,93,147.5,155,165,165,102.5,107.5,-112.5,107.5,200,210,220,220,492.5
5,Jean Lou Labat,Juniors,Raw,SBD,,2003,M,86.79,93,160,167.5,172.5,172.5,105,112.5,117.5,117.5,180,192.5,200,200,490
1,Rodrigue Sellier,Juniors,Raw,SBD,,2000,M,104.14,105,205,-215,-215,205,135,140,-150,140,235,245,-255,245,590
2,Justin Rousseau,Juniors,Raw,SBD,,2001,M,104.72,105,190,-195,-195,190,110,115,120,120,200,210,220,220,530
1,Fabien Boucher,Juniors,Raw,SBD,,1999,M,132.45,120+,210,220,230,230,145,-155,-155,145,230,245,255,255,630
1,Brent Filippi,Seniors,Raw,SBD,,1997,M,57.2,59,110,115,-120,115,72.5,-77.5,-77.5,72.5,160,167.5,175,175,362.5
1,Maxime Lecea,Seniors,Raw,SBD,,1996,M,62.8,66,-157.5,157.5,-162.5,157.5,110,-115,-115,110,180,187.5,-192.5,187.5,455
1,Anthony Liño Chauteau,Seniors,Raw,SBD,,1994,M,73.7,74,225,232.5,-235,232.5,115,-120,-120,115,260,-270,,260,607.5
2,Xavier Cabiro,Seniors,Raw,SBD,,1984,M,67.4,74,120,127.5,135,135,90,-100,-100,90,140,150,160,160,385
1,Maxime Sourbets,Seniors,Raw,SBD,,1994,M,81.3,83,217.5,225,232.5,232.5,-140,140,,140,240,250,260,260,632.5
2,Simon Langlois,Seniors,Raw,SBD,,1998,M,82.1,83,152.5,157.5,165,165,80,-90,90,90,180,-200,-200,180,435
3,Romain Delort,Seniors,Raw,SBD,,1984,M,81.8,83,125,130,135,135,105,-107.5,107.5,107.5,170,180,-190,180,422.5
DQ,Guillaume Dupuy,Seniors,Raw,SBD,,1998,M,79.9,83,180,190,-200,190,-130,-130,-130,,-240,240,-260,240,
1,Antoine Touraquet,Seniors,Raw,SBD,,1995,M,86.3,93,225,-235,245,245,130,-140,-140,130,285,-305,-305,285,660
2,Marceau Cotraud,Seniors,Raw,SBD,,1994,M,92.3,93,212.5,-220,-220,212.5,160,-165,-165,160,240,-250,250,250,622.5
3,Bahi Qandil,Seniors,Raw,SBD,,1993,M,87.7,93,170,182.5,192.5,192.5,122.5,127.5,132.5,132.5,230,240,-247.5,240,565
4,Corentin Lemaire,Seniors,Raw,SBD,,1995,M,88.5,93,165,172.5,180,180,115,125,-135,125,215,227.5,240,240,545
5,Pierre Pein,Seniors,Raw,SBD,,1993,M,92.4,93,-185,185,-195,185,135,140,-145,140,205,215,-220,215,540
1,Thomas Lafon,Seniors,Raw,SBD,,1993,M,103,105,190,200,,200,145,-150,,145,240,255,-270,255,600
2,Nataniel Bahs,Seniors,Raw,SBD,,1990,M,98.5,105,-180,185,190,190,120,125,-130,125,200,215,-225,215,530
1,Christophe Bello,Masters 1,Raw,SBD,,1982,M,66,66,130,,,130,110,,,110,150,,,150,390
1,Julien Idier,Masters 1,Raw,SBD,,1982,M,93,93,230,-250,250,250,165,175,-182.5,175,240,260,-270,260,685
1,Philippe Courtois,Masters 2,Single-ply,SBD,,1964,M,74,74,182.5,-190,,182.5,120,,,120,200,210,,210,512.5
1,Marie Thibaud,Sub-Juniors,Raw,B,,2005,F,51.69,52,,,,,52.5,57.5,-60,57.5,,,,,57.5
DQ,Marine Celse,Seniors,Raw,B,,1995,F,61.77,63,,,,,-60,-62.5,-62.5,,,,,,
1,Mélisa Meunier,Masters 1,Raw,B,,1975,F,61.05,63,,,,,67.5,70,-72.5,70,,,,,70
2,Christelle Musseau,Masters 1,Raw,B,,1974,F,59.94,63,,,,,57.5,60,-62.5,60,,,,,60
1,Nadine Langlais,Masters 2,Raw,B,,1964,F,55.21,57,,,,,50,-52.5,-52.5,50,,,,,50
1,Florence Leccese,Masters 2,Raw,B,,1969,F,66.73,69,,,,,67.5,70,-72.5,70,,,,,70
1,Joelle Lemarchand,Masters 3,Raw,B,,1956,F,84,84,,,,,-52.5,52.5,-55,52.5,,,,,52.5
1,Andrea Falcucci,Sub-Juniors,Raw,B,,2005,M,100.59,105,,,,,135,142.5,-145,142.5,,,,,142.5
1,Arthur Hauet,Juniors,Raw,B,,2001,M,69.62,74,,,,,140,147.5,-152.5,147.5,,,,,147.5
DQ,Paco Castillo,Juniors,Raw,B,,2002,M,93,93,,,,,-185,-185,-185,,,,,,
1,Nicolas Thely,Seniors,Raw,B,,1995,M,74,74,,,,,140,-147.5,147.5,147.5,,,,,147.5
1,Romain Delort,Seniors,Raw,B,,1984,M,81.74,83,,,,,-105,105,107.5,107.5,,,,,107.5
DQ,Hervé Ahmady,Seniors,Raw,B,,1998,M,82.74,83,,,,,-157.5,-162.5,-162.5,,,,,,
1,Christophe Bello,Masters 1,Raw,B,,1982,M,65.09,66,,,,,115,,,115,,,,,115
1,Samuel Dreux,Masters 1,Raw,B,,1981,M,73.89,74,,,,,-117.5,125,,125,,,,,125
2,Laurent Gautier,Masters 1,Raw,B,,1976,M,72.65,74,,,,,117.5,-125,-125,117.5,,,,,117.5
3,Thierry Sivadier,Masters 1,Raw,B,,1975,M,73.53,74,,,,,95,102.5,-107.5,102.5,,,,,102.5
1,Olivier Lagardere,Masters 2,Raw,B,,1967,M,81.64,83,,,,,110,-117.5,,110,,,,,110
1,Philippe Delapille,Masters 3,Raw,B,,1960,M,115.09,120,,,,,140,150,160,160,,,,,160
