﻿email;order_ref;order_date;delay;lastname;firstname;id_product;name_product;url_product;url_image_product 
munschdaniel@wanadoo.fr;18763-65181;2020-01-10 15:05:29;5;MUNSCH;Daniel;8625;Barrette Dixmude Protection Militaire du Territoire + Agrafe de Campagne Reduction;https://generalarmystore.fr/gas/1-les-activites/32-associations-et-amicales/108-legion-etrangere/8625-barrette-dixmude-protection-militaire-du-territoire-agrafe-de-campagne-reduction.html;https://www.generalarmystore.fr/gas/images/products_pictures/normale/954-BARRETTE-DIXMUDE-PROTECTION-TERR-V1_TG.jpg
munschdaniel@wanadoo.fr;18763-65181;2020-01-10 15:05:29;5;MUNSCH;Daniel;8096;Polo Noir brode Gendarmerie Criminalistique Numerique;https://generalarmystore.fr/gas/1-les-activites/2-gendarmerie/323-chemises-et-polos-gendarmerie/8096-polo-noir-brode-gendarmerie-criminalistique-numerique.html;https://www.generalarmystore.fr/gas/images/products_pictures/normale/10-0707-V1_TG.jpg
valentin.rgd@gmail.com;52358-65186;2020-01-11 03:53:46;5;REGNARD;Valentin;1626;Plateforme tactique de cuisse Tactiknight GK Pro;https://generalarmystore.fr/gas/1-les-activites/3-police-nationale/62-holsters-police-nationale/1626-plateforme-tactique-de-cuisse-tactiknight-gk-pro.html;https://www.generalarmystore.fr/gas/images/products_pictures/normale/97000KT-V1_TG.jpg
patmag.brays@wanadoo.fr;52360-65188;2020-01-11 06:18:01;5;BRAYS;Patrice;6144;Lampe QuiqLiteX rechargeable Blanc / Rouge QuiqLite;https://generalarmystore.fr/gas/3-le-matos-le-materiel/124-lampes/198-diverses/6144-lampe-quiqlitex-rechargeable-blanc--rouge-quiqlite.html;https://www.generalarmystore.fr/gas/images/products_pictures/normale/201818-V1_TG.jpg
patmag.brays@wanadoo.fr;52360-65188;2020-01-11 06:18:01;5;BRAYS;Patrice;9099;Grades Police Nationale basse visibilite Noir Gomme 3D;https://generalarmystore.fr/gas/3-le-matos-le-materiel/469-identifiants-grades-fourreaux-ecussons/473-police-nationale/9099-grades-police-nationale-basse-visibilite-noir-gomme-3d.html;https://www.generalarmystore.fr/gas/images/products_pictures/normale/GBVN-V1_TG.jpg
patmag.brays@wanadoo.fr;52360-65188;2020-01-11 06:18:01;5;BRAYS;Patrice;3217;Insigne de Groupe Sanguin;https://generalarmystore.fr/gas/3-le-matos-le-materiel/469-identifiants-grades-fourreaux-ecussons/473-police-nationale/3217-insigne-de-groupe-sanguin.html;https://www.generalarmystore.fr/gas/images/products_pictures/normale/GSNOIR-V1_TG.jpg
aurelientt60@gmail.com;28880-65203;2020-01-12 03:56:02;5;ROBINET;Aurelien;7868;Polo Noir brode Gendarmerie Mobile;https://generalarmystore.fr/gas/2-les-tenues-les-vetements/176-chemises-et-polos/178-polos/7868-polo-noir-brode-gendarmerie-mobile.html;https://www.generalarmystore.fr/gas/images/products_pictures/normale/10-0706-V1_TG.jpg
corentin-sanchez@hotmail.com;46091-65204;2020-01-12 11:41:09;5;SANCHEZ;Corentin;3663;Gilet Modulable 5.11 LBE Noir;https://generalarmystore.fr/gas/1-les-activites/281-airsoft-et-paintball/286-gilets-pulls-sweats-airsoft-paintball/3663-gilet-modulable-511-lbe-noir.html;https://www.generalarmystore.fr/gas/images/products_pictures/normale/511-58631-019_TG.jpg
martialmartial2003@yahoo.se;12579-65205;2020-01-12 14:00:29;5;GAILLARD GRENADIER;Martial;3630;Lunettes de protection oculaire Contour Metal Bolle verres fumes;https://generalarmystore.fr/gas/3-le-matos-le-materiel/129-optique/191-lunettes--masques/3630-lunettes-de-protection-oculaire-contour-metal-bolle-verres-fumes.html;https://www.generalarmystore.fr/gas/images/products_pictures/normale/BO_CONTMPSF_TG.jpg
beu126@hotmail.com;52376-65208;2020-01-12 17:24:15;5;FRESNE;Benoit;9555;Crosse d'epaule CTR Commercial Spec Magpul pour AR15/M4/M16;https://generalarmystore.fr/gas/3-le-matos-le-materiel/231-univers-du-tir/276-autres/9555-crosse-d-epaule-ctr-commercial-spec-magpul-pour-ar15m4m16.html;https://www.generalarmystore.fr/gas/images/products_pictures/normale/civmag311black-V1_TG.jpg
beu126@hotmail.com;52376-65208;2020-01-12 17:24:15;5;FRESNE;Benoit;4874;Visee Point Rouge CROSSFIRE Red Dot Waterproof Vortex;https://generalarmystore.fr/gas/1-les-activites/501-tir-sportif/537-visee-tir-sportif/4874-visee-point-rouge-crossfire-red-dot-waterproof-vortex.html;https://www.generalarmystore.fr/gas/images/products_pictures/normale/vt-cf-rd1-V5_TG.jpg
bastien1273@gmail.com;52380-65214;2020-01-12 19:23:03;5;HUESO;Sebastien;8151;Sac de Frappe GK Professional;https://generalarmystore.fr/gas/1-les-activites/2-gendarmerie/94-materiel-de-defense-gendarmerie/8151-sac-de-frappe-gk-professional.html;https://www.generalarmystore.fr/gas/images/products_pictures/normale/5569_TG.jpg
