﻿email;order_ref;order_date;delay;lastname;firstname;id_product;name_product;url_product;url_image_product 
rvp65@free.fr;52289-65070;2020-01-01 21:55:22;5;PRIGENT;Herve;1144;Medaille Gendarmerie;https://generalarmystore.fr/gas/1-les-activites/2-gendarmerie/130-identifiants-gendarmerie/1144-medaille-gendarmerie.html;https://www.generalarmystore.fr/gas/images/products_pictures/normale/INSGEND_TG.jpg
rvp65@free.fr;52289-65070;2020-01-01 21:55:22;5;PRIGENT;Herve;5908;Porte-carte mini  cuir 2 volets GK Pro Format carte de credit Horizontal;https://generalarmystore.fr/gas/1-les-activites/22-securite-privee/67-accessoires-et-materiels-divers-securite-privee-ssiap/5908-porte-carte-mini-cuir-2-volets-gk-pro-format-carte-de-credit-horizontal.html;https://www.generalarmystore.fr/gas/images/products_pictures/normale/4185-ferme_TG.jpg
rvp65@free.fr;52289-65070;2020-01-01 21:55:22;5;PRIGENT;Herve;1988;Barrette brodee Gendarmerie de type bande patronymique;https://generalarmystore.fr/gas/3-le-matos-le-materiel/469-identifiants-grades-fourreaux-ecussons/472-gendarmerie/1988-barrette-brodee-gendarmerie-de-type-bande-patronymique.html;https://www.generalarmystore.fr/gas/images/products_pictures/normale/BARRETTE-GEND-MONT_TG.jpg
rvp65@free.fr;52289-65070;2020-01-01 21:55:22;5;PRIGENT;Herve;9429;Gants de Ceremonie/Parade Cuir Noir DMB;https://generalarmystore.fr/gas/2-les-tenues-les-vetements/251-gants-et-mitaines/204-gants/9429-gants-de-ceremonieparade-cuir-noir-dmb.html;https://www.generalarmystore.fr/gas/images/products_pictures/normale/938-CEREMONIE-BOST-V1_TG.jpg
