﻿email;order_ref;order_date;delay;lastname;firstname;id_product;name_product;url_product;url_image_product 
thomas.estienne25@orange.fr;39026-65596;2020-02-02 18:37:45;5;ESTIENNE;Thomas;6704;Sac etanche EVENT Tasmanian Tiger Vert OD;https://generalarmystore.fr/gas/1-les-activites/2-gendarmerie/95-sacs-gendarmerie/6704-sac-etanche-event-tasmanian-tiger-vert-od.html;https://www.generalarmystore.fr/gas/images/products_pictures/normale/7870036-V1_TG.jpg
thomas.estienne25@orange.fr;39026-65596;2020-02-02 18:37:45;5;ESTIENNE;Thomas;705;Bache de terrain camouflee C.E.;https://generalarmystore.fr/gas/1-les-activites/2-gendarmerie/330-couchage-bivouac-gendarmerie/705-bache-de-terrain-camouflee-ce.html;https://www.generalarmystore.fr/gas/images/products_pictures/normale/88790_TG.jpg
thomas.estienne25@orange.fr;39026-65596;2020-02-02 18:37:45;5;ESTIENNE;Thomas;710;Tapis de sol en mousse;https://generalarmystore.fr/gas/1-les-activites/2-gendarmerie/330-couchage-bivouac-gendarmerie/710-tapis-de-sol-en-mousse.html;https://www.generalarmystore.fr/gas/images/products_pictures/normale/71690-V1_TG.jpg
ludovicperruchon@outlook.fr;52631-65646;2020-02-05 13:02:52;5;PERRUCHON;Ludovic;6893;Lampe Tactique Compacte PD35 Fenix 1000 Lumens;https://generalarmystore.fr/gas/3-le-matos-le-materiel/124-lampes/196-tactiques/6893-lampe-tactique-compacte-pd35-fenix-1000-lumens.html;https://www.generalarmystore.fr/gas/images/products_pictures/normale/PD35-V1_TG.jpg
ludovicperruchon@outlook.fr;52631-65646;2020-02-05 13:02:52;5;PERRUCHON;Ludovic;1726;Ceinturon d'intervention Timecop GK Pro;https://generalarmystore.fr/gas/1-les-activites/281-airsoft-et-paintball/291-ceintures-et-ceinturons-airsoft-paintball/1726-ceinturon-d-intervention-timecop-gk-pro.html;https://www.generalarmystore.fr/gas/images/products_pictures/normale/9305_TG.jpg
