﻿email;order_ref;order_date;delay;lastname;firstname;id_product;name_product;url_product;url_image_product 
mobfp@neuf.fr;52787-65851;2020-02-20 18:36:16;5;POULIN;Francis;2473;T-shirt imprime Gendarmerie Bleu Marine (Marquage Blanc);https://generalarmystore.fr/gas/2-les-tenues-les-vetements/179-t-shirts-et-debardeurs/180-t-shirts/2473-t-shirt-imprime-gendarmerie-bleu-marine-marquage-blanc.html;https://www.generalarmystore.fr/gas/images/products_pictures/normale/TSSERIMG_TG.jpg
christian.cazala@gmail.com;51531-65856;2020-02-21 10:00:46;5;CAZA ;Christian ;1129;Dragonne kevlar;https://generalarmystore.fr/gas/3-le-matos-le-materiel/242-accessoires-materiel/33-accessoires-materiel/1129-dragonne-kevlar.html;https://www.generalarmystore.fr/gas/images/products_pictures/normale/97700_TG.jpg
christian.cazala@gmail.com;51531-65856;2020-02-21 10:00:46;5;CAZA ;Christian ;2274;Pantalon F2 Satin CCE Modele Long;https://generalarmystore.fr/gas/2-les-tenues-les-vetements/183-pantalons-bermudas-shorts/184-pantalons/2274-pantalon-f2-satin-cce-modele-long.html;https://www.generalarmystore.fr/gas/images/products_pictures/normale/52075-V1_TG.jpg
christian.cazala@gmail.com;51531-65856;2020-02-21 10:00:46;5;CAZA ;Christian ;8803;Porte-mousqueton pour ceinturon;https://generalarmystore.fr/gas/1-les-activites/24-camping-randonnee/77-les-accessoires/8803-porte-mousqueton-pour-ceinturon.html;https://www.generalarmystore.fr/gas/images/products_pictures/normale/13505001-V1_TG.jpg
potier.ame@orange.fr;52792-65862;2020-02-21 11:39:38;5;POTIER;Amelie;751;Chaussures militaire Rangers cuir semelle Goodyear;https://generalarmystore.fr/gas/1-les-activites/25-activites-de-plein-air-outdoor/46-chaussures-chaussettes/751-chaussures-militaire-rangers-cuir-semelle-goodyear.html;https://www.generalarmystore.fr/gas/images/products_pictures/normale/RGFR_TG.jpg
mathieu.francois927@gmail.com;26974-65875;2020-02-22 11:36:28;5;FRANCOIS;Mathieu;1125;Pantalon d'intervention Gendarmerie agree D.G.G.N. Homme (Moyen);https://generalarmystore.fr/gas/2-les-tenues-les-vetements/183-pantalons-bermudas-shorts/184-pantalons/1125-pantalon-d-intervention-gendarmerie-agree-dggn-homme-moyen.html;https://www.generalarmystore.fr/gas/images/products_pictures/normale/86600-V1_TG.jpg
mathieu.francois927@gmail.com;26974-65875;2020-02-22 11:36:28;5;FRANCOIS;Mathieu;1657;Pantalon BDU Cityguard Bleu;https://generalarmystore.fr/gas/2-les-tenues-les-vetements/183-pantalons-bermudas-shorts/184-pantalons/1657-pantalon-bdu-cityguard-bleu.html;https://www.generalarmystore.fr/gas/images/products_pictures/normale/1004M-V1_TG.jpg
wlad.kola@gmail.com;48930-65877;2020-02-22 13:05:45;5;KOLASINSKI;Wladimir;2450;Fourreaux d'epaules Gendarmerie Departementale Souples Brodes Homme;https://generalarmystore.fr/gas/1-les-activites/2-gendarmerie/130-identifiants-gendarmerie/2450-fourreaux-d-epaules-gendarmerie-departementale-souples-brodes-homme.html;https://www.generalarmystore.fr/gas/images/products_pictures/normale/FE-S-105_TG.jpg
wlad.kola@gmail.com;48930-65877;2020-02-22 13:05:45;5;KOLASINSKI;Wladimir;2473;T-shirt imprime Gendarmerie Bleu Marine (Marquage Blanc);https://generalarmystore.fr/gas/2-les-tenues-les-vetements/179-t-shirts-et-debardeurs/180-t-shirts/2473-t-shirt-imprime-gendarmerie-bleu-marine-marquage-blanc.html;https://www.generalarmystore.fr/gas/images/products_pictures/normale/TSSERIMG_TG.jpg
wlad.kola@gmail.com;48930-65877;2020-02-22 13:05:45;5;KOLASINSKI;Wladimir;1032;Grades Gendarmerie Departementale Souples Brodes;https://generalarmystore.fr/gas/1-les-activites/2-gendarmerie/130-identifiants-gendarmerie/1032-grades-gendarmerie-departementale-souples-brodes.html;https://www.generalarmystore.fr/gas/images/products_pictures/normale/Grades-Gendarmerie-Departementale_TG.jpg
matitecaro@hotmail.com;52821-65902;2020-02-24 13:21:28;5;LAUTREY;Caroline;5781;Chaussures Rangers Megatech CityGuard Side Zip;https://generalarmystore.fr/gas/2-les-tenues-les-vetements/153-chaussures-et-chaussettes/154-chaussures-intervention/5781-chaussures-rangers-megatech-cityguard-side-zip.html;https://www.generalarmystore.fr/gas/images/products_pictures/normale/1737-V1_TG.jpg
huijean@ymail.com;32974-65910;2020-02-24 18:01:50;5;HUIBONHOA;Jean;8296;Pantalon Platinium Performance PATROL Bleu Marine;https://generalarmystore.fr/gas/1-les-activites/2-gendarmerie/55-pantalons-bermudas-shorts-gendarmerie/8296-pantalon-platinium-performance-patrol-bleu-marine.html;https://www.generalarmystore.fr/gas/images/products_pictures/normale/PANPERB-V1_TG.jpg
