﻿email;order_ref;order_date;delay;lastname;firstname;id_product;name_product;url_product;url_image_product 
alves.nicole@sfr.fr;52793-65858;2020-02-21 11:07:34;5;MEYER;Jean marie;3648;Chants des TDM;https://generalarmystore.fr/gas/3-le-matos-le-materiel/234-livres-cds-videos/460-disques-cd/3648-chants-des-tdm.html;https://www.generalarmystore.fr/gas/images/products_pictures/normale/51012_TG.jpg
armand.obadia24@gmail.com;52794-65859;2020-02-21 11:17:30;5;OBADIA;Armand;1012;Poing americain BASIC dore;https://generalarmystore.fr/gas/3-le-matos-le-materiel/237-shurikens-et-poings-americains/127-poings-americains/1012-poing-americain-basic-dore.html;https://www.generalarmystore.fr/gas/images/products_pictures/normale/03610109_TG.jpg
