﻿email;order_ref;order_date;delay;lastname;firstname;id_product;name_product;url_product;url_image_product 
audreygiroux@laposte.net;52488-65390;2020-01-22 11:37:07;5; GIROUX;Audrey;8612;Patch Velcro Femelle a coudre 4 cm x 9 cm Noir;https://generalarmystore.fr/gas/3-le-matos-le-materiel/469-identifiants-grades-fourreaux-ecussons/475-crs/8612-patch-velcro-femelle-a-coudre-4-cm-x-9-cm-noir.html;https://www.generalarmystore.fr/gas/images/products_pictures/normale/SUPAREC-V1_TG.jpg
audreygiroux@laposte.net;52488-65390;2020-01-22 11:37:07;5; GIROUX;Audrey;7119;Patch Velcro Femelle Rond de 8 cm de diametre;https://generalarmystore.fr/gas/1-les-activites/29-fashion-mode/92-les-accessoires/7119-patch-velcro-femelle-rond-de-8-cm-de-diametre.html;https://www.generalarmystore.fr/gas/images/products_pictures/normale/SUPARO-V1_TG.jpg
