﻿email;order_ref;order_date;delay;lastname;firstname;id_product;name_product;url_product;url_image_product 
valentindetoulon@gmail.com;52313-65105;2020-01-05 21:20:29;5;LEBRIEZ;Valentin;8774;Porte cles tactique Groupe Sanguin Miltec Noir;https://generalarmystore.fr/gas/3-le-matos-le-materiel/469-identifiants-grades-fourreaux-ecussons/472-gendarmerie/8774-porte-cles-tactique-groupe-sanguin-miltec-noir.html;https://www.generalarmystore.fr/gas/images/products_pictures/normale/15917402-V1_TG.jpg
valentindetoulon@gmail.com;52313-65105;2020-01-05 21:20:29;5;LEBRIEZ;Valentin;9499;Bande basse visibilite brodee PSIG 10 x 30 cm;https://generalarmystore.fr/gas/1-les-activites/2-gendarmerie/130-identifiants-gendarmerie/9499-bande-basse-visibilite-brodee-psig-10-x-30-cm.html;https://www.generalarmystore.fr/gas/images/products_pictures/normale/1493GM-V1_TG.jpg
evan.azevedo1@gmail.com;40895-65107;2020-01-05 22:02:14;5;AZEVEDO;Evan;1988;Barrette brodee Gendarmerie de type bande patronymique;https://generalarmystore.fr/gas/1-les-activites/2-gendarmerie/130-identifiants-gendarmerie/1988-barrette-brodee-gendarmerie-de-type-bande-patronymique.html;https://www.generalarmystore.fr/gas/images/products_pictures/normale/BARRETTE-GEND-MONT_TG.jpg
evan.azevedo1@gmail.com;40895-65107;2020-01-05 22:02:14;5;AZEVEDO;Evan;6774;Barrette brodee PSIG de type bande patronymique;https://generalarmystore.fr/gas/1-les-activites/2-gendarmerie/130-identifiants-gendarmerie/6774-barrette-brodee-psig-de-type-bande-patronymique.html;https://www.generalarmystore.fr/gas/images/products_pictures/normale/BARPSIG_TG.jpg
evan.azevedo1@gmail.com;40895-65107;2020-01-05 22:02:14;5;AZEVEDO;Evan;4595;Grades Gendarmerie Nationale basse visibilite;https://generalarmystore.fr/gas/1-les-activites/2-gendarmerie/130-identifiants-gendarmerie/4595-grades-gendarmerie-nationale-basse-visibilite.html;https://www.generalarmystore.fr/gas/images/products_pictures/normale/Grades-BV_TG.jpg
evan.azevedo1@gmail.com;40895-65107;2020-01-05 22:02:14;5;AZEVEDO;Evan;3215;Insigne de Groupe Sanguin;https://generalarmystore.fr/gas/1-les-activites/2-gendarmerie/130-identifiants-gendarmerie/3215-insigne-de-groupe-sanguin.html;https://www.generalarmystore.fr/gas/images/products_pictures/normale/GSVERT-V1_TG.jpg
evan.azevedo1@gmail.com;40895-65107;2020-01-05 22:02:14;5;AZEVEDO;Evan;9417;Grades Militaires Camouflage Desert Francais;https://generalarmystore.fr/gas/1-les-activites/2-gendarmerie/130-identifiants-gendarmerie/9417-grades-militaires-camouflage-desert-francais.html;https://www.generalarmystore.fr/gas/images/products_pictures/normale/Grades-cam-desert__TG.jpg
evan.azevedo1@gmail.com;40895-65107;2020-01-05 22:02:14;5;AZEVEDO;Evan;1144;Medaille Gendarmerie;https://generalarmystore.fr/gas/1-les-activites/2-gendarmerie/130-identifiants-gendarmerie/1144-medaille-gendarmerie.html;https://www.generalarmystore.fr/gas/images/products_pictures/normale/INSGEND_TG.jpg
kevin_02600@hotmail.fr;28071-65110;2020-01-06 08:25:16;5;FORESTIER;Kevin;2408;Pince a cravate Gendarmerie Homme;https://generalarmystore.fr/gas/1-les-activites/2-gendarmerie/130-identifiants-gendarmerie/2408-pince-a-cravate-gendarmerie-homme.html;https://www.generalarmystore.fr/gas/images/products_pictures/normale/974-PINCE-CRAVATE-Mont_TG.jpg
kevin_02600@hotmail.fr;28071-65110;2020-01-06 08:25:16;5;FORESTIER;Kevin;1210;Cravate a clip;https://generalarmystore.fr/gas/1-les-activites/2-gendarmerie/320-cheches-echarpes-cravates-gendarmerie/1210-cravate-a-clip.html;https://www.generalarmystore.fr/gas/images/products_pictures/normale/CRACLIP_TG.jpg
christelle.dujour@orange.fr;24951-65120;2020-01-06 20:39:09;5;DUJOUR;Christelle;4437;Bandeau amovible brode SECURITE Petit Modele;https://generalarmystore.fr/gas/1-les-activites/22-securite-privee/132-identifiants-securite-privee-ssiap/4437-bandeau-amovible-brode-securite-petit-modele.html;https://www.generalarmystore.fr/gas/images/products_pictures/normale/FLAPBGM_TG.jpg
christelle.dujour@orange.fr;24951-65120;2020-01-06 20:39:09;5;DUJOUR;Christelle;9287;Porte-Gants Cordura Patrol;https://generalarmystore.fr/gas/2-les-tenues-les-vetements/251-gants-et-mitaines/265-accessoires/9287-porte-gants-cordura-patrol.html;https://www.generalarmystore.fr/gas/images/products_pictures/normale/PG1-V1_TG.jpg
christelle.dujour@orange.fr;24951-65120;2020-01-06 20:39:09;5;DUJOUR;Christelle;1203;Porte-medaille/insigne de ceinture cuir PATROL;https://generalarmystore.fr/gas/1-les-activites/22-securite-privee/132-identifiants-securite-privee-ssiap/1203-porte-medailleinsigne-de-ceinture-cuir-patrol.html;https://www.generalarmystore.fr/gas/images/products_pictures/normale/PIC1_TG.jpg
christelle.dujour@orange.fr;24951-65120;2020-01-06 20:39:09;5;DUJOUR;Christelle;6447;Medaille Securite GK Pro;https://generalarmystore.fr/gas/1-les-activites/22-securite-privee/132-identifiants-securite-privee-ssiap/6447-medaille-securite-gk-pro.html;https://www.generalarmystore.fr/gas/images/products_pictures/normale/603S_TG.jpg
pub@hopla1x.net;52320-65125;2020-01-07 09:49:04;5;HAAS;Laurent;8684;Kit Porte-Barrettes Brevete;https://generalarmystore.fr/gas/1-les-activites/1-armee/52-accessoires-et-materiels-divers-armee/8684-kit-porte-barrettes-brevete.html;https://www.generalarmystore.fr/gas/images/products_pictures/normale/17381-V1_TG.jpg
yana.aubry@wanadoo.fr;42222-65126;2020-01-07 09:52:20;5;PINAEVA AUBRY;Yana;6504;Fourreaux d'epaules Gendarmerie Departementale Souples Brodes Femme;https://generalarmystore.fr/gas/1-les-activites/2-gendarmerie/130-identifiants-gendarmerie/6504-fourreaux-d-epaules-gendarmerie-departementale-souples-brodes-femme.html;https://www.generalarmystore.fr/gas/images/products_pictures/normale/FE-S-105_TG.jpg
yana.aubry@wanadoo.fr;42222-65126;2020-01-07 09:52:20;5;PINAEVA AUBRY;Yana;1032;Grades Gendarmerie Departementale Souples Brodes;https://generalarmystore.fr/gas/1-les-activites/2-gendarmerie/130-identifiants-gendarmerie/1032-grades-gendarmerie-departementale-souples-brodes.html;https://www.generalarmystore.fr/gas/images/products_pictures/normale/Grades-Gendarmerie-Departementale_TG.jpg
