﻿email;order_ref;order_date;delay;lastname;firstname;id_product;name_product;url_product;url_image_product 
patrick.becharias.2610@orange.fr;52397-65518;2020-01-28 21:10:34;5;BECHARIAS;Patrick;8654;Veste Vert OD Softshell Storm 2.0 TOE;https://generalarmystore.fr/gas/2-les-tenues-les-vetements/170-blousons-et-vestes/190-vestes/8654-veste-vert-od-softshell-storm-20-toe.html;https://www.generalarmystore.fr/gas/images/products_pictures/normale/201854-V1_TG.jpg
patrick.becharias.2610@orange.fr;52397-65518;2020-01-28 21:10:34;5;BECHARIAS;Patrick;8579;Maillot Thermo Performer niv-3 TOE noir;https://generalarmystore.fr/gas/2-les-tenues-les-vetements/249-ensembles/268-sous-vetement/8579-maillot-thermo-performer-niv-3-toe-noir.html;https://www.generalarmystore.fr/gas/images/products_pictures/normale/97241-V1_TG.jpg
militr29@hotmail.fr;52569-65537;2020-01-29 18:05:54;5;LIPP;Jean michel;9506;Chaussures MAGNUM Centurion 8.0 Cuir S3 Double Zip CT CP coquees;https://generalarmystore.fr/gas/1-les-activites/29-fashion-mode/91-chaussures-chaussettes/9506-chaussures-magnum-centurion-80-cuir-s3-double-zip-ct-cp-coquees.html;https://www.generalarmystore.fr/gas/images/products_pictures/normale/96399-V1_TG.jpg
suongadal@yahoo.com;39230-65540;2020-01-29 21:05:06;5;LADAGNOUS;Alain;5051;Plaque d'attache Molle MLS standard pour Holster Safariland;https://generalarmystore.fr/gas/1-les-activites/2-gendarmerie/57-holsters-gendarmerie/5051-plaque-d-attache-molle-mls-standard-pour-holster-safariland.html;https://www.generalarmystore.fr/gas/images/products_pictures/normale/6004-17-V1_TG.jpg
suongadal@yahoo.com;39230-65540;2020-01-29 21:05:06;5;LADAGNOUS;Alain;1162;Bande retroreflechissante Gendarmerie 2 x 10 cm;https://generalarmystore.fr/gas/1-les-activites/2-gendarmerie/130-identifiants-gendarmerie/1162-bande-retroreflechissante-gendarmerie-2-x-10-cm.html;https://www.generalarmystore.fr/gas/images/products_pictures/normale/IMP1G_IMPINV1G_TG.jpg
suongadal@yahoo.com;39230-65540;2020-01-29 21:05:06;5;LADAGNOUS;Alain;6740;Pochette TAC POUCH 4 horizontale Tasmanian Tiger Noire;https://generalarmystore.fr/gas/3-le-matos-le-materiel/125-sacs-musettes-etuis/208-sacoches--musettes/6740-pochette-tac-pouch-4-horizontale-tasmanian-tiger-noire.html;https://www.generalarmystore.fr/gas/images/products_pictures/normale/7650040-V1_TG.jpg
suongadal@yahoo.com;39230-65540;2020-01-29 21:05:06;5;LADAGNOUS;Alain;8648;Patch Velcro Femelle a coudre 10 cm x 30 cm;https://generalarmystore.fr/gas/1-les-activites/29-fashion-mode/92-les-accessoires/8648-patch-velcro-femelle-a-coudre-10-cm-x-30-cm.html;https://www.generalarmystore.fr/gas/images/products_pictures/normale/SUPABANRET-V1_TG.jpg
suongadal@yahoo.com;39230-65540;2020-01-29 21:05:06;5;LADAGNOUS;Alain;9098;Grades Gendarmerie Nationale basse visibilite Noir Gomme 3D;https://generalarmystore.fr/gas/1-les-activites/2-gendarmerie/130-identifiants-gendarmerie/9098-grades-gendarmerie-nationale-basse-visibilite-noir-gomme-3d.html;https://www.generalarmystore.fr/gas/images/products_pictures/normale/GBVN-V1_TG.jpg
suongadal@yahoo.com;39230-65540;2020-01-29 21:05:06;5;LADAGNOUS;Alain;9569;Systeme de fixation retractable Super Force "FIRE" Gear Keeper;https://generalarmystore.fr/gas/1-les-activites/25-activites-de-plein-air-outdoor/47-les-accessoires/9569-systeme-de-fixation-retractable-super-force-fire-gear-keeper.html;https://www.generalarmystore.fr/gas/images/products_pictures/normale/RT3-4493-V1_TG.jpg
suongadal@yahoo.com;39230-65540;2020-01-29 21:05:06;5;LADAGNOUS;Alain;6028;Patch 3D Groupe Sanguin Noir;https://generalarmystore.fr/gas/1-les-activites/2-gendarmerie/130-identifiants-gendarmerie/6028-patch-3d-groupe-sanguin-noir.html;https://www.generalarmystore.fr/gas/images/products_pictures/normale/Patch-Groupe-Sanguin-3D-V1_TG.jpg
suongadal@yahoo.com;39230-65540;2020-01-29 21:05:06;5;LADAGNOUS;Alain;822;Lampe frontale Hybrid Eclairage 2 Couleurs PETZL Tactikka Plus 250 Lumens;https://generalarmystore.fr/gas/1-les-activites/24-camping-randonnee/389-lampes/822-lampe-frontale-hybrid-eclairage-2-couleurs-petzl-tactikka-plus-250-lumens.html;https://www.generalarmystore.fr/gas/images/products_pictures/normale/27314-15-V1_TG.jpg
starskyhz3@gmail.com;52329-65563;2020-01-31 10:47:17;5;SCHMITT;Didier;2820;Ecusson France Tricolore Brode;https://generalarmystore.fr/gas/1-les-activites/1-armee/423-identifiants-armee/2820-ecusson-france-tricolore-brode.html;https://www.generalarmystore.fr/gas/images/products_pictures/normale/BADFR-V1_TG.jpg
starskyhz3@gmail.com;52329-65563;2020-01-31 10:47:17;5;SCHMITT;Didier;8592;Bonnet Thermo Performer niv-3 TOE;https://generalarmystore.fr/gas/1-les-activites/1-armee/48-couvre-chefs-militaires/8592-bonnet-thermo-performer-niv-3-toe.html;https://www.generalarmystore.fr/gas/images/products_pictures/normale/97265-V0_TG.jpg
starskyhz3@gmail.com;52329-65563;2020-01-31 10:47:17;5;SCHMITT;Didier;5038;Tour de cou polaire avec plastron Camoufle;https://generalarmystore.fr/gas/1-les-activites/1-armee/309-cheches-echarpes-cravates-armee/5038-tour-de-cou-polaire-avec-plastron-camoufle.html;https://www.generalarmystore.fr/gas/images/products_pictures/normale/TC184-CE-Face_TG.jpg
starskyhz3@gmail.com;52329-65563;2020-01-31 10:47:17;5;SCHMITT;Didier;7254;Drisse Para 15 metres Cam C.E. de 5 mm de diametre;https://generalarmystore.fr/gas/1-les-activites/1-armee/52-accessoires-et-materiels-divers-armee/7254-drisse-para-15-metres-cam-ce-de-5-mm-de-diametre.html;https://www.generalarmystore.fr/gas/images/products_pictures/normale/50020-V1_TG.jpg
joliette.mercier@orange.fr;22711-65610;2020-02-03 17:29:13;5;MERCIER;Philippe;2274;Pantalon F2 Satin CCE Modele Long;https://generalarmystore.fr/gas/2-les-tenues-les-vetements/183-pantalons-bermudas-shorts/184-pantalons/2274-pantalon-f2-satin-cce-modele-long.html;https://www.generalarmystore.fr/gas/images/products_pictures/normale/52075-V1_TG.jpg
