﻿email;order_ref;order_date;delay;lastname;firstname;id_product;name_product;url_product;url_image_product 
mazeriem@gmail.com;50185-65158;2020-01-09 11:52:16;5;REYNIER;Christophe;2123;Pantalon Airborne Vintage Kaki;https://generalarmystore.fr/gas/1-les-activites/25-activites-de-plein-air-outdoor/45-pantalons-bermudas-shorts/2123-pantalon-airborne-vintage-kaki.html;https://www.generalarmystore.fr/gas/images/products_pictures/normale/05-3598-61_vorne_TG.gif
mazeriem@gmail.com;50185-65158;2020-01-09 11:52:16;5;REYNIER;Christophe;7808;Pantalon Airborne Vintage Beige;https://generalarmystore.fr/gas/1-les-activites/25-activites-de-plein-air-outdoor/45-pantalons-bermudas-shorts/7808-pantalon-airborne-vintage-beige.html;https://www.generalarmystore.fr/gas/images/products_pictures/normale/05-3598-74-V1_TG.jpg
