﻿email;order_ref;order_date;delay;lastname;firstname;id_product;name_product;url_product;url_image_product 
rst@hotmail.fr;52342-65154;2020-01-09 08:52:18;5;REUNIF;Stephane;6151;Pantalon Intervention Mat BLUESTAR DMB;https://generalarmystore.fr/gas/1-les-activites/2-gendarmerie/55-pantalons-bermudas-shorts-gendarmerie/6151-pantalon-intervention-mat-bluestar-dmb.html;https://www.generalarmystore.fr/gas/images/products_pictures/normale/752-V1_TG.jpg
cedric.guilloux@live.fr;52364-65193;2020-01-11 13:24:23;5;GUILLOUX;Cedric;6402;Agrafes de Campagnes Reduction;https://generalarmystore.fr/gas/3-le-matos-le-materiel/469-identifiants-grades-fourreaux-ecussons/472-gendarmerie/6402-agrafes-de-campagnes-reduction.html;https://www.generalarmystore.fr/gas/images/products_pictures/normale/914-AGRAFE-DE-CAMPAGNE_TG.jpg
cedric.guilloux@live.fr;52364-65193;2020-01-11 13:24:23;5;GUILLOUX;Cedric;7852;Agrafes de Campagnes Ordonnance;https://generalarmystore.fr/gas/3-le-matos-le-materiel/469-identifiants-grades-fourreaux-ecussons/472-gendarmerie/7852-agrafes-de-campagnes-ordonnance.html;https://www.generalarmystore.fr/gas/images/products_pictures/normale/AGRAFES-ORDO-REDUCT-BAR-4_TG.jpg
cedric.guilloux@live.fr;52364-65193;2020-01-11 13:24:23;5;GUILLOUX;Cedric;8691;Barrette Dixmude Outre-Mer;https://generalarmystore.fr/gas/3-le-matos-le-materiel/469-identifiants-grades-fourreaux-ecussons/472-gendarmerie/8691-barrette-dixmude-outre-mer.html;https://www.generalarmystore.fr/gas/images/products_pictures/normale/DIXOUTRE-MER_TG.jpg
cedric.guilloux@live.fr;52364-65193;2020-01-11 13:24:23;5;GUILLOUX;Cedric;8854;Ecusson France Tricolore Silicone;https://generalarmystore.fr/gas/3-le-matos-le-materiel/469-identifiants-grades-fourreaux-ecussons/472-gendarmerie/8854-ecusson-france-tricolore-silicone.html;https://www.generalarmystore.fr/gas/images/products_pictures/normale/BADFRS-V0_TG.jpg
cedric.guilloux@live.fr;52364-65193;2020-01-11 13:24:23;5;GUILLOUX;Cedric;6805;Porte-carte Professionnel avec enrouleur Gendarmerie Nationale;https://generalarmystore.fr/gas/3-le-matos-le-materiel/469-identifiants-grades-fourreaux-ecussons/472-gendarmerie/6805-porte-carte-professionnel-avec-enrouleur-gendarmerie-nationale.html;https://www.generalarmystore.fr/gas/images/products_pictures/normale/BPCGN_TG.jpg
cedric.guilloux@live.fr;52364-65193;2020-01-11 13:24:23;5;GUILLOUX;Cedric;6028;Patch 3D Groupe Sanguin Noir;https://generalarmystore.fr/gas/3-le-matos-le-materiel/469-identifiants-grades-fourreaux-ecussons/472-gendarmerie/6028-patch-3d-groupe-sanguin-noir.html;https://www.generalarmystore.fr/gas/images/products_pictures/normale/Patch-Groupe-Sanguin-3D-V1_TG.jpg
cedric.guilloux@live.fr;52364-65193;2020-01-11 13:24:23;5;GUILLOUX;Cedric;8826;Patch 3D Medical 2,5 x 2,5 cm;https://generalarmystore.fr/gas/3-le-matos-le-materiel/469-identifiants-grades-fourreaux-ecussons/472-gendarmerie/8826-patch-3d-medical-2-5-x-2-5-cm.html;https://www.generalarmystore.fr/gas/images/products_pictures/normale/16830302-V1_TG.jpg
cedric.guilloux@live.fr;52364-65193;2020-01-11 13:24:23;5;GUILLOUX;Cedric;5126;Baton lumineux ChemLight Cyalume 15 cm Militaire;https://generalarmystore.fr/gas/1-les-activites/23-sapeurs-pompiers-jsp/115-lampes-sapeur-pompier-jsp/5126-baton-lumineux-chemlight-cyalume-15-cm-militaire.html;https://www.generalarmystore.fr/gas/images/products_pictures/normale/Chemlight_Montage_TG.jpg
cedric.guilloux@live.fr;52364-65193;2020-01-11 13:24:23;5;GUILLOUX;Cedric;9480;Kit Plastron Velours Noir Brevete Martineau;https://generalarmystore.fr/gas/3-le-matos-le-materiel/469-identifiants-grades-fourreaux-ecussons/472-gendarmerie/9480-kit-plastron-velours-noir-brevete-martineau.html;https://www.generalarmystore.fr/gas/images/products_pictures/normale/85264-V1_TG.jpg
cedric.guilloux@live.fr;52364-65193;2020-01-11 13:24:23;5;GUILLOUX;Cedric;5126;Baton lumineux ChemLight Cyalume 15 cm Militaire;https://generalarmystore.fr/gas/1-les-activites/23-sapeurs-pompiers-jsp/115-lampes-sapeur-pompier-jsp/5126-baton-lumineux-chemlight-cyalume-15-cm-militaire.html;https://www.generalarmystore.fr/gas/images/products_pictures/normale/Chemlight_Montage_TG.jpg
cedric.guilloux@live.fr;52364-65193;2020-01-11 13:24:23;5;GUILLOUX;Cedric;5820;Bonnet Bleu Marine brode Gendarmerie Mobile;https://generalarmystore.fr/gas/2-les-tenues-les-vetements/147-couvre-chefs/151-bonnets/5820-bonnet-bleu-marine-brode-gendarmerie-mobile.html;https://www.generalarmystore.fr/gas/images/products_pictures/normale/BOL2GM-V4_TG.jpg
cedric.guilloux@live.fr;52364-65193;2020-01-11 13:24:23;5;GUILLOUX;Cedric;5126;Baton lumineux ChemLight Cyalume 15 cm Militaire;https://generalarmystore.fr/gas/1-les-activites/23-sapeurs-pompiers-jsp/115-lampes-sapeur-pompier-jsp/5126-baton-lumineux-chemlight-cyalume-15-cm-militaire.html;https://www.generalarmystore.fr/gas/images/products_pictures/normale/Chemlight_Montage_TG.jpg
cedric.guilloux@live.fr;52364-65193;2020-01-11 13:24:23;5;GUILLOUX;Cedric;8634;Barrette Dixmude Defense Nationale Or + Agrafe de Campagne Reduction;https://generalarmystore.fr/gas/3-le-matos-le-materiel/469-identifiants-grades-fourreaux-ecussons/472-gendarmerie/8634-barrette-dixmude-defense-nationale-or-agrafe-de-campagne-reduction.html;https://www.generalarmystore.fr/gas/images/products_pictures/normale/DIXDEFNAT-OR-V1_TG.jpg
cedric.guilloux@live.fr;52364-65193;2020-01-11 13:24:23;5;GUILLOUX;Cedric;6402;Agrafes de Campagnes Reduction;https://generalarmystore.fr/gas/3-le-matos-le-materiel/469-identifiants-grades-fourreaux-ecussons/472-gendarmerie/6402-agrafes-de-campagnes-reduction.html;https://www.generalarmystore.fr/gas/images/products_pictures/normale/914-AGRAFE-DE-CAMPAGNE_TG.jpg
