﻿email;order_ref;order_date;delay;lastname;firstname;id_product;name_product;url_product;url_image_product 
tof7.0@free.fr;20092-65737;2020-02-11 19:14:49;5;NOSTRY;Christophe;8766;Insigne de Groupe Sanguin Rigide Plastifie Cam C.E.;https://generalarmystore.fr/gas/1-les-activites/25-activites-de-plein-air-outdoor/47-les-accessoires/8766-insigne-de-groupe-sanguin-rigide-plastifie-cam-ce.html;https://www.generalarmystore.fr/gas/images/products_pictures/normale/Groupe-Sanguin-Cam-CE-V1_TG.jpg
tof7.0@free.fr;20092-65737;2020-02-11 19:14:49;5;NOSTRY;Christophe;8936;Bande basse visibilite brodee Gendarmerie 2,5 x 10 cm;https://generalarmystore.fr/gas/1-les-activites/32-associations-et-amicales/112-gendarmerie/8936-bande-basse-visibilite-brodee-gendarmerie-2-5-x-10-cm.html;https://www.generalarmystore.fr/gas/images/products_pictures/normale/1488PM-V1_TG.jpg
tof7.0@free.fr;20092-65737;2020-02-11 19:14:49;5;NOSTRY;Christophe;6754;Ecussons de Regions Brodes Basse Visibilite Vert;https://generalarmystore.fr/gas/1-les-activites/32-associations-et-amicales/112-gendarmerie/6754-ecussons-de-regions-brodes-basse-visibilite-vert.html;https://www.generalarmystore.fr/gas/images/products_pictures/normale/Region-BV-Vert_TG.jpg
tof7.0@free.fr;20092-65737;2020-02-11 19:14:49;5;NOSTRY;Christophe;4595;Grades Gendarmerie Nationale basse visibilite;https://generalarmystore.fr/gas/1-les-activites/2-gendarmerie/130-identifiants-gendarmerie/4595-grades-gendarmerie-nationale-basse-visibilite.html;https://www.generalarmystore.fr/gas/images/products_pictures/normale/Grades-BV_TG.jpg
tof7.0@free.fr;20092-65737;2020-02-11 19:14:49;5;NOSTRY;Christophe;8218;Ecussons de Specialites Officier Police Judiciaire Brodes;https://generalarmystore.fr/gas/1-les-activites/2-gendarmerie/130-identifiants-gendarmerie/8218-ecussons-de-specialites-officier-police-judiciaire-brodes.html;https://www.generalarmystore.fr/gas/images/products_pictures/normale/OPJ-V0_TG.jpg
steven.meneghel@laposte.net;52711-65738;2020-02-11 21:43:21;5;MENEGHEL;Steven;5152;Passant de ceinture Port Haut pour Holster Safariland;https://generalarmystore.fr/gas/1-les-activites/2-gendarmerie/57-holsters-gendarmerie/5152-passant-de-ceinture-port-haut-pour-holster-safariland.html;https://www.generalarmystore.fr/gas/images/products_pictures/normale/SFK18-V1_TG.jpg
parisrodolphe@msn.com;30532-65741;2020-02-12 08:27:49;5;GAY;Rodolphe;1203;Porte-medaille/insigne de ceinture cuir PATROL;https://generalarmystore.fr/gas/1-les-activites/2-gendarmerie/130-identifiants-gendarmerie/1203-porte-medailleinsigne-de-ceinture-cuir-patrol.html;https://www.generalarmystore.fr/gas/images/products_pictures/normale/PIC1_TG.jpg
parisrodolphe@msn.com;30532-65741;2020-02-12 08:27:49;5;GAY;Rodolphe;1144;Medaille Gendarmerie;https://generalarmystore.fr/gas/1-les-activites/2-gendarmerie/130-identifiants-gendarmerie/1144-medaille-gendarmerie.html;https://www.generalarmystore.fr/gas/images/products_pictures/normale/INSGEND_TG.jpg
