﻿email;order_ref;order_date;delay;lastname;firstname;id_product;name_product;url_product;url_image_product 
thomas.cognat@gendarmerie.interieur.gouv.fr;52861-65968;2020-02-27 15:43:02;5;COGNAT;Thomas;4803;Cuirasse Metal Bayard Argent avec Ecu et Support Cuir pour Gendarmerie Departementale;https://generalarmystore.fr/gas/3-le-matos-le-materiel/469-identifiants-grades-fourreaux-ecussons/472-gendarmerie/4803-cuirasse-metal-bayard-argent-avec-ecu-et-support-cuir-pour-gendarmerie-departementale.html;https://www.generalarmystore.fr/gas/images/products_pictures/normale/1600-CUIRASSE-ARGENT_TG.jpg
nico92190@hotmail.fr;7333-65971;2020-02-27 20:29:02;5;CHOLLET;Nicolas;3349;Grades Militaires basse visibilite;https://generalarmystore.fr/gas/1-les-activites/1-armee/423-identifiants-armee/3349-grades-militaires-basse-visibilite.html;https://www.generalarmystore.fr/gas/images/products_pictures/normale/Grades-BV_TG.jpg
