﻿email;order_ref;order_date;delay;lastname;firstname;id_product;name_product;url_product;url_image_product 
asvp@ville-salindres.fr;50193-64920;2019-12-19 14:23:39;5;BASTIEN;Yohan;5881;Ecusson A.S.V.P. brode DMB Grand Modele;https://generalarmystore.fr/gas/1-les-activites/499-police-municipale/502-identifiants-police-municipale-asvp/5881-ecusson-asvp-brode-dmb-grand-modele.html;https://www.generalarmystore.fr/gas/images/products_pictures/normale/944-ECU-BR-GRAND-MOD_TG.jpg
asvp@ville-salindres.fr;50193-64920;2019-12-19 14:23:39;5;BASTIEN;Yohan;5817;Chaussures Salomon Toundra Forces CSWP Noir;https://generalarmystore.fr/gas/2-les-tenues-les-vetements/153-chaussures-et-chaussettes/154-chaussures-intervention/5817-chaussures-salomon-toundra-forces-cswp-noir.html;https://www.generalarmystore.fr/gas/images/products_pictures/normale/toundra-forces-cswp__L40165000-V1_TG.jpg
asvp@ville-salindres.fr;50193-64920;2019-12-19 14:23:39;5;BASTIEN;Yohan;7588;Pull polaire ASVP;https://generalarmystore.fr/gas/2-les-tenues-les-vetements/171-gilets-pulls-sweats/174-pulls/7588-pull-polaire-asvp.html;https://www.generalarmystore.fr/gas/images/products_pictures/normale/303-V1_TG.jpg
asvp@ville-salindres.fr;50193-64920;2019-12-19 14:23:39;5;BASTIEN;Yohan;7824;Pantalon ASVP Hiver Mat;https://generalarmystore.fr/gas/2-les-tenues-les-vetements/183-pantalons-bermudas-shorts/184-pantalons/7824-pantalon-asvp-hiver-mat.html;https://www.generalarmystore.fr/gas/images/products_pictures/normale/6W50-3031-V1_TG.jpg
asvp@ville-salindres.fr;50193-64920;2019-12-19 14:23:39;5;BASTIEN;Yohan;9206;Bonnet Bleu Marine ASVP PM ONE;https://generalarmystore.fr/gas/2-les-tenues-les-vetements/147-couvre-chefs/151-bonnets/9206-bonnet-bleu-marine-asvp-pm-one.html;https://www.generalarmystore.fr/gas/images/products_pictures/normale/54423-V1_TG.jpg
asvp@ville-salindres.fr;50193-64920;2019-12-19 14:23:39;5;BASTIEN;Yohan;9208;Blouson matelasse ASVP PM ONE;https://generalarmystore.fr/gas/2-les-tenues-les-vetements/170-blousons-et-vestes/189-blousons/9208-blouson-matelasse-asvp-pm-one.html;https://www.generalarmystore.fr/gas/images/products_pictures/normale/202325-V1_TG.jpg
asvp@ville-salindres.fr;50193-64920;2019-12-19 14:23:39;5;BASTIEN;Yohan;7919;Gants Intervention New M-PACT3 Noir Mechanix;https://generalarmystore.fr/gas/2-les-tenues-les-vetements/251-gants-et-mitaines/204-gants/7919-gants-intervention-new-m-pact3-noir-mechanix.html;https://www.generalarmystore.fr/gas/images/products_pictures/normale/M-PACT3-MECHANIX-V1_TG.jpg
