﻿email;order_ref;order_date;delay;lastname;firstname;id_product;name_product;url_product;url_image_product 
louis.desrousseaux-de-medrano@intradef.gouv.fr;52395-65239;2020-01-13 18:34:01;12;DESROUSSEAUX;Louis charles;8563;Fourchette QLS pour Holster Safariland;https://generalarmystore.fr/gas/1-les-activites/2-gendarmerie/57-holsters-gendarmerie/8563-fourchette-qls-pour-holster-safariland.html;https://www.generalarmystore.fr/gas/images/products_pictures/normale/6004-19-2-V1_TG.jpg
louis.desrousseaux-de-medrano@intradef.gouv.fr;52395-65239;2020-01-13 18:34:01;12;DESROUSSEAUX;Louis charles;8077;Kit systeme d'attache rapide QLS pour Holster Safariland avec deux receveurs;https://generalarmystore.fr/gas/1-les-activites/2-gendarmerie/57-holsters-gendarmerie/8077-kit-systeme-d-attache-rapide-qls-pour-holster-safariland-avec-deux-receveurs.html;https://www.generalarmystore.fr/gas/images/products_pictures/normale/SFQLSKIT3-V1_TG.jpg
louis.desrousseaux-de-medrano@intradef.gouv.fr;52395-65239;2020-01-13 18:34:01;12;DESROUSSEAUX;Louis charles;9334;Sangle ouverture rapide horizontale pour plaque tactique Safariland;https://generalarmystore.fr/gas/1-les-activites/2-gendarmerie/96-accessoires-et-materiels-divers-gendarmerie/9334-sangle-ouverture-rapide-horizontale-pour-plaque-tactique-safariland.html;https://www.generalarmystore.fr/gas/images/products_pictures/normale/3004-V1_TG.jpg
louis.desrousseaux-de-medrano@intradef.gouv.fr;52395-65239;2020-01-13 18:34:01;12;DESROUSSEAUX;Louis charles;8824;Passant de ceinture UBL port Moyen pour Holster Safariland;https://generalarmystore.fr/gas/1-les-activites/2-gendarmerie/96-accessoires-et-materiels-divers-gendarmerie/8824-passant-de-ceinture-ubl-port-moyen-pour-holster-safariland.html;https://www.generalarmystore.fr/gas/images/products_pictures/normale/SFK3-V1_TG.jpg
