﻿email;order_ref;order_date;delay;lastname;firstname;id_product;name_product;url_product;url_image_product 
plongeur80@gmail.com;33824-65131;2020-01-07 17:21:21;12;LAURENT;Bruno;7957;Grades Gendarmerie Mobile Rigides en Resine;https://generalarmystore.fr/gas/1-les-activites/2-gendarmerie/130-identifiants-gendarmerie/7957-grades-gendarmerie-mobile-rigides-en-resine.html;https://www.generalarmystore.fr/gas/images/products_pictures/normale/GV-R-Mobile_TG.jpg
plongeur80@gmail.com;33824-65131;2020-01-07 17:21:21;12;LAURENT;Bruno;8396;Combinaison Intervention Swat Antistatique TOE Mat Noir;https://generalarmystore.fr/gas/1-les-activites/2-gendarmerie/325-ensembles-tenues-gendarmerie/8396-combinaison-intervention-swat-antistatique-toe-mat-noir.html;https://www.generalarmystore.fr/gas/images/products_pictures/normale/201873-V1_TG.jpg
