﻿email;order_ref;order_date;delay;lastname;firstname;id_product;name_product;url_product;url_image_product 
vincentlegall4@gmail.com;52468-65351;2020-01-20 15:42:14;5;LE GALL;Vincent;8747;Baton de defense telescopique Talon Airweight ASP 53 cm;https://generalarmystore.fr/gas/1-les-activites/1-armee/52-accessoires-et-materiels-divers-armee/8747-baton-de-defense-telescopique-talon-airweight-asp-53-cm.html;https://www.generalarmystore.fr/gas/images/products_pictures/normale/22411-V1_TG.jpg
laurent.ruse@sfr.fr;52484-65370;2020-01-21 17:32:34;5;RUSE;Laurent;9251;Pochette Telephone GM Patrol Noir;https://generalarmystore.fr/gas/1-les-activites/2-gendarmerie/95-sacs-gendarmerie/9251-pochette-telephone-gm-patrol-noir.html;https://www.generalarmystore.fr/gas/images/products_pictures/normale/PCPHONE3-V1_TG.jpg
alaindouilliez@gmail.com;43045-65371;2020-01-21 18:02:11;5;DOUILLIEZ;Alain;9477;Chemisette de Ceremonie Blanche Homme avec Supports Velcro;https://generalarmystore.fr/gas/1-les-activites/2-gendarmerie/323-chemises-et-polos-gendarmerie/9477-chemisette-de-ceremonie-blanche-homme-avec-supports-velcro.html;https://www.generalarmystore.fr/gas/images/products_pictures/normale/552V-V1_TG.jpg
ted98@outlook.fr;51785-65385;2020-01-22 01:03:29;5;SUCHARSKI;Teddy;9747;Grades Sapeurs Pompiers Souples Brodes;https://generalarmystore.fr/gas/1-les-activites/32-associations-et-amicales/113-sapeurs-pompiers/9747-grades-sapeurs-pompiers-souples-brodes.html;https://www.generalarmystore.fr/gas/images/products_pictures/normale/GV-SPP-V1_TG.jpg
ted98@outlook.fr;51785-65385;2020-01-22 01:03:29;5;SUCHARSKI;Teddy;9430;Fourreaux d'epaules Sapeurs Pompiers de Paris Souples Brodes (x2);https://generalarmystore.fr/gas/1-les-activites/23-sapeurs-pompiers-jsp/133-identifiants-sapeur-pompier-jsp/9430-fourreaux-d-epaules-sapeurs-pompiers-de-paris-souples-brodes-x2.html;https://www.generalarmystore.fr/gas/images/products_pictures/normale/fourreaux-epaules-sapeurs-pompiers-de-Paris_TG.jpg
ted98@outlook.fr;51785-65385;2020-01-22 01:03:29;5;SUCHARSKI;Teddy;9747;Grades Sapeurs Pompiers Souples Brodes;https://generalarmystore.fr/gas/1-les-activites/32-associations-et-amicales/113-sapeurs-pompiers/9747-grades-sapeurs-pompiers-souples-brodes.html;https://www.generalarmystore.fr/gas/images/products_pictures/normale/GV-SPP-V1_TG.jpg
ted98@outlook.fr;51785-65385;2020-01-22 01:03:29;5;SUCHARSKI;Teddy;9430;Fourreaux d'epaules Sapeurs Pompiers de Paris Souples Brodes (x2);https://generalarmystore.fr/gas/1-les-activites/23-sapeurs-pompiers-jsp/133-identifiants-sapeur-pompier-jsp/9430-fourreaux-d-epaules-sapeurs-pompiers-de-paris-souples-brodes-x2.html;https://www.generalarmystore.fr/gas/images/products_pictures/normale/fourreaux-epaules-sapeurs-pompiers-de-Paris_TG.jpg
ted98@outlook.fr;51785-65385;2020-01-22 01:03:29;5;SUCHARSKI;Teddy;9747;Grades Sapeurs Pompiers Souples Brodes;https://generalarmystore.fr/gas/1-les-activites/32-associations-et-amicales/113-sapeurs-pompiers/9747-grades-sapeurs-pompiers-souples-brodes.html;https://www.generalarmystore.fr/gas/images/products_pictures/normale/GV-SPP-V1_TG.jpg
ted98@outlook.fr;51785-65385;2020-01-22 01:03:29;5;SUCHARSKI;Teddy;9430;Fourreaux d'epaules Sapeurs Pompiers de Paris Souples Brodes (x2);https://generalarmystore.fr/gas/1-les-activites/23-sapeurs-pompiers-jsp/133-identifiants-sapeur-pompier-jsp/9430-fourreaux-d-epaules-sapeurs-pompiers-de-paris-souples-brodes-x2.html;https://www.generalarmystore.fr/gas/images/products_pictures/normale/fourreaux-epaules-sapeurs-pompiers-de-Paris_TG.jpg
ted98@outlook.fr;51785-65385;2020-01-22 01:03:29;5;SUCHARSKI;Teddy;9747;Grades Sapeurs Pompiers Souples Brodes;https://generalarmystore.fr/gas/1-les-activites/32-associations-et-amicales/113-sapeurs-pompiers/9747-grades-sapeurs-pompiers-souples-brodes.html;https://www.generalarmystore.fr/gas/images/products_pictures/normale/GV-SPP-V1_TG.jpg
ted98@outlook.fr;51785-65385;2020-01-22 01:03:29;5;SUCHARSKI;Teddy;9430;Fourreaux d'epaules Sapeurs Pompiers de Paris Souples Brodes (x2);https://generalarmystore.fr/gas/1-les-activites/23-sapeurs-pompiers-jsp/133-identifiants-sapeur-pompier-jsp/9430-fourreaux-d-epaules-sapeurs-pompiers-de-paris-souples-brodes-x2.html;https://www.generalarmystore.fr/gas/images/products_pictures/normale/fourreaux-epaules-sapeurs-pompiers-de-Paris_TG.jpg
ted98@outlook.fr;51785-65385;2020-01-22 01:03:29;5;SUCHARSKI;Teddy;9747;Grades Sapeurs Pompiers Souples Brodes;https://generalarmystore.fr/gas/1-les-activites/32-associations-et-amicales/113-sapeurs-pompiers/9747-grades-sapeurs-pompiers-souples-brodes.html;https://www.generalarmystore.fr/gas/images/products_pictures/normale/GV-SPP-V1_TG.jpg
ted98@outlook.fr;51785-65385;2020-01-22 01:03:29;5;SUCHARSKI;Teddy;9430;Fourreaux d'epaules Sapeurs Pompiers de Paris Souples Brodes (x2);https://generalarmystore.fr/gas/1-les-activites/23-sapeurs-pompiers-jsp/133-identifiants-sapeur-pompier-jsp/9430-fourreaux-d-epaules-sapeurs-pompiers-de-paris-souples-brodes-x2.html;https://www.generalarmystore.fr/gas/images/products_pictures/normale/fourreaux-epaules-sapeurs-pompiers-de-Paris_TG.jpg
ted98@outlook.fr;51785-65385;2020-01-22 01:03:29;5;SUCHARSKI;Teddy;9747;Grades Sapeurs Pompiers Souples Brodes;https://generalarmystore.fr/gas/1-les-activites/32-associations-et-amicales/113-sapeurs-pompiers/9747-grades-sapeurs-pompiers-souples-brodes.html;https://www.generalarmystore.fr/gas/images/products_pictures/normale/GV-SPP-V1_TG.jpg
ted98@outlook.fr;51785-65385;2020-01-22 01:03:29;5;SUCHARSKI;Teddy;9430;Fourreaux d'epaules Sapeurs Pompiers de Paris Souples Brodes (x2);https://generalarmystore.fr/gas/1-les-activites/23-sapeurs-pompiers-jsp/133-identifiants-sapeur-pompier-jsp/9430-fourreaux-d-epaules-sapeurs-pompiers-de-paris-souples-brodes-x2.html;https://www.generalarmystore.fr/gas/images/products_pictures/normale/fourreaux-epaules-sapeurs-pompiers-de-Paris_TG.jpg
ted98@outlook.fr;51785-65385;2020-01-22 01:03:29;5;SUCHARSKI;Teddy;9747;Grades Sapeurs Pompiers Souples Brodes;https://generalarmystore.fr/gas/1-les-activites/32-associations-et-amicales/113-sapeurs-pompiers/9747-grades-sapeurs-pompiers-souples-brodes.html;https://www.generalarmystore.fr/gas/images/products_pictures/normale/GV-SPP-V1_TG.jpg
ted98@outlook.fr;51785-65385;2020-01-22 01:03:29;5;SUCHARSKI;Teddy;9747;Grades Sapeurs Pompiers Souples Brodes;https://generalarmystore.fr/gas/1-les-activites/32-associations-et-amicales/113-sapeurs-pompiers/9747-grades-sapeurs-pompiers-souples-brodes.html;https://www.generalarmystore.fr/gas/images/products_pictures/normale/GV-SPP-V1_TG.jpg
ted98@outlook.fr;51785-65385;2020-01-22 01:03:29;5;SUCHARSKI;Teddy;9747;Grades Sapeurs Pompiers Souples Brodes;https://generalarmystore.fr/gas/1-les-activites/32-associations-et-amicales/113-sapeurs-pompiers/9747-grades-sapeurs-pompiers-souples-brodes.html;https://www.generalarmystore.fr/gas/images/products_pictures/normale/GV-SPP-V1_TG.jpg
ted98@outlook.fr;51785-65385;2020-01-22 01:03:29;5;SUCHARSKI;Teddy;9747;Grades Sapeurs Pompiers Souples Brodes;https://generalarmystore.fr/gas/1-les-activites/32-associations-et-amicales/113-sapeurs-pompiers/9747-grades-sapeurs-pompiers-souples-brodes.html;https://www.generalarmystore.fr/gas/images/products_pictures/normale/GV-SPP-V1_TG.jpg
ted98@outlook.fr;51785-65385;2020-01-22 01:03:29;5;SUCHARSKI;Teddy;9747;Grades Sapeurs Pompiers Souples Brodes;https://generalarmystore.fr/gas/1-les-activites/32-associations-et-amicales/113-sapeurs-pompiers/9747-grades-sapeurs-pompiers-souples-brodes.html;https://www.generalarmystore.fr/gas/images/products_pictures/normale/GV-SPP-V1_TG.jpg
ted98@outlook.fr;51785-65385;2020-01-22 01:03:29;5;SUCHARSKI;Teddy;9747;Grades Sapeurs Pompiers Souples Brodes;https://generalarmystore.fr/gas/1-les-activites/32-associations-et-amicales/113-sapeurs-pompiers/9747-grades-sapeurs-pompiers-souples-brodes.html;https://www.generalarmystore.fr/gas/images/products_pictures/normale/GV-SPP-V1_TG.jpg
ted98@outlook.fr;51785-65385;2020-01-22 01:03:29;5;SUCHARSKI;Teddy;9430;Fourreaux d'epaules Sapeurs Pompiers de Paris Souples Brodes (x2);https://generalarmystore.fr/gas/1-les-activites/23-sapeurs-pompiers-jsp/133-identifiants-sapeur-pompier-jsp/9430-fourreaux-d-epaules-sapeurs-pompiers-de-paris-souples-brodes-x2.html;https://www.generalarmystore.fr/gas/images/products_pictures/normale/fourreaux-epaules-sapeurs-pompiers-de-Paris_TG.jpg
ted98@outlook.fr;51785-65385;2020-01-22 01:03:29;5;SUCHARSKI;Teddy;9430;Fourreaux d'epaules Sapeurs Pompiers de Paris Souples Brodes (x2);https://generalarmystore.fr/gas/1-les-activites/23-sapeurs-pompiers-jsp/133-identifiants-sapeur-pompier-jsp/9430-fourreaux-d-epaules-sapeurs-pompiers-de-paris-souples-brodes-x2.html;https://www.generalarmystore.fr/gas/images/products_pictures/normale/fourreaux-epaules-sapeurs-pompiers-de-Paris_TG.jpg
ted98@outlook.fr;51785-65385;2020-01-22 01:03:29;5;SUCHARSKI;Teddy;9747;Grades Sapeurs Pompiers Souples Brodes;https://generalarmystore.fr/gas/1-les-activites/32-associations-et-amicales/113-sapeurs-pompiers/9747-grades-sapeurs-pompiers-souples-brodes.html;https://www.generalarmystore.fr/gas/images/products_pictures/normale/GV-SPP-V1_TG.jpg
ted98@outlook.fr;51785-65385;2020-01-22 01:03:29;5;SUCHARSKI;Teddy;9430;Fourreaux d'epaules Sapeurs Pompiers de Paris Souples Brodes (x2);https://generalarmystore.fr/gas/1-les-activites/23-sapeurs-pompiers-jsp/133-identifiants-sapeur-pompier-jsp/9430-fourreaux-d-epaules-sapeurs-pompiers-de-paris-souples-brodes-x2.html;https://www.generalarmystore.fr/gas/images/products_pictures/normale/fourreaux-epaules-sapeurs-pompiers-de-Paris_TG.jpg
ted98@outlook.fr;51785-65385;2020-01-22 01:03:29;5;SUCHARSKI;Teddy;9747;Grades Sapeurs Pompiers Souples Brodes;https://generalarmystore.fr/gas/1-les-activites/32-associations-et-amicales/113-sapeurs-pompiers/9747-grades-sapeurs-pompiers-souples-brodes.html;https://www.generalarmystore.fr/gas/images/products_pictures/normale/GV-SPP-V1_TG.jpg
ted98@outlook.fr;51785-65385;2020-01-22 01:03:29;5;SUCHARSKI;Teddy;9747;Grades Sapeurs Pompiers Souples Brodes;https://generalarmystore.fr/gas/1-les-activites/32-associations-et-amicales/113-sapeurs-pompiers/9747-grades-sapeurs-pompiers-souples-brodes.html;https://www.generalarmystore.fr/gas/images/products_pictures/normale/GV-SPP-V1_TG.jpg
ted98@outlook.fr;51785-65385;2020-01-22 01:03:29;5;SUCHARSKI;Teddy;9430;Fourreaux d'epaules Sapeurs Pompiers de Paris Souples Brodes (x2);https://generalarmystore.fr/gas/1-les-activites/23-sapeurs-pompiers-jsp/133-identifiants-sapeur-pompier-jsp/9430-fourreaux-d-epaules-sapeurs-pompiers-de-paris-souples-brodes-x2.html;https://www.generalarmystore.fr/gas/images/products_pictures/normale/fourreaux-epaules-sapeurs-pompiers-de-Paris_TG.jpg
