﻿email;order_ref;order_date;delay;lastname;firstname;id_product;name_product;url_product;url_image_product 
hauss.guillaume@gmail.com;52523-65460;2020-01-26 15:59:08;5;HAUSS;Guillaume;4045;Carnet de sante Survival Credit Card I.C.E. UTAG;https://generalarmystore.fr/gas/1-les-activites/25-activites-de-plein-air-outdoor/47-les-accessoires/4045-carnet-de-sante-survival-credit-card-ice-utag.html;https://www.generalarmystore.fr/gas/images/products_pictures/normale/UTAG-CC_TG.jpg
moi1959@gmail.com;52550-65501;2020-01-28 09:36:36;5;SCHURCH;Jean michel;3210;Porte-monnaie TOE Pro Noir;https://generalarmystore.fr/gas/1-les-activites/499-police-municipale/519-poches-pochettes-trousses-police-municipale-asvp/3210-porte-monnaie-toe-pro-noir.html;https://www.generalarmystore.fr/gas/images/products_pictures/normale/69356_TG.jpg
matthias.salach@gmail.com;13842-65536;2020-01-29 15:24:26;5;SALACH;Matthias;1764;Ecussons de Specialites Plastifies;https://generalarmystore.fr/gas/1-les-activites/2-gendarmerie/130-identifiants-gendarmerie/1764-ecussons-de-specialites-plastifies.html;https://www.generalarmystore.fr/gas/images/products_pictures/normale/Ecusson-plast-spec_TG.jpg
matthias.salach@gmail.com;13842-65536;2020-01-29 15:24:26;5;SALACH;Matthias;1765;Brevets et Diplomes Techniques;https://generalarmystore.fr/gas/1-les-activites/2-gendarmerie/130-identifiants-gendarmerie/1765-brevets-et-diplomes-techniques.html;https://www.generalarmystore.fr/gas/images/products_pictures/normale/BREVET-V1_TG.jpg
matthias.salach@gmail.com;13842-65536;2020-01-29 15:24:26;5;SALACH;Matthias;8218;Ecussons de Specialites Officier Police Judiciaire Brodes;https://generalarmystore.fr/gas/1-les-activites/2-gendarmerie/130-identifiants-gendarmerie/8218-ecussons-de-specialites-officier-police-judiciaire-brodes.html;https://www.generalarmystore.fr/gas/images/products_pictures/normale/OPJ-V0_TG.jpg
francois-rouillat@hotmail.fr;52570-65538;2020-01-29 18:33:51;5;ROUILLAT;Francois;8218;Ecussons de Specialites Officier Police Judiciaire Brodes;https://generalarmystore.fr/gas/1-les-activites/2-gendarmerie/130-identifiants-gendarmerie/8218-ecussons-de-specialites-officier-police-judiciaire-brodes.html;https://www.generalarmystore.fr/gas/images/products_pictures/normale/OPJ-V0_TG.jpg
