﻿email;order_ref;order_date;delay;lastname;firstname;id_product;name_product;url_product;url_image_product 
lekid34@free.fr;52920-66064;2020-03-03 14:53:54;5;NIVESSE;Marc;9098;Grades Gendarmerie Nationale basse visibilite Noir Gomme 3D;https://generalarmystore.fr/gas/1-les-activites/2-gendarmerie/130-identifiants-gendarmerie/9098-grades-gendarmerie-nationale-basse-visibilite-noir-gomme-3d.html;https://www.generalarmystore.fr/gas/images/products_pictures/normale/GBVN-V1_TG.jpg
maxime.lejeune@yahoo.com;52922-66068;2020-03-03 18:07:21;5;LEJEUNE;Maxime;2240;Ecussons de Regions Plastifies;https://generalarmystore.fr/gas/1-les-activites/2-gendarmerie/130-identifiants-gendarmerie/2240-ecussons-de-regions-plastifies.html;https://www.generalarmystore.fr/gas/images/products_pictures/normale/504-LANGUEDOC-ROUSSILLON_TG.jpg
maxime.lejeune@yahoo.com;52922-66068;2020-03-03 18:07:21;5;LEJEUNE;Maxime;9499;Bande basse visibilite brodee PSIG 10 x 30 cm;https://generalarmystore.fr/gas/1-les-activites/2-gendarmerie/130-identifiants-gendarmerie/9499-bande-basse-visibilite-brodee-psig-10-x-30-cm.html;https://www.generalarmystore.fr/gas/images/products_pictures/normale/1493GM-V1_TG.jpg
maxime.lejeune@yahoo.com;52922-66068;2020-03-03 18:07:21;5;LEJEUNE;Maxime;1764;Ecussons de Specialites Plastifies;https://generalarmystore.fr/gas/1-les-activites/2-gendarmerie/130-identifiants-gendarmerie/1764-ecussons-de-specialites-plastifies.html;https://www.generalarmystore.fr/gas/images/products_pictures/normale/Ecusson-plast-spec_TG.jpg
maxime.lejeune@yahoo.com;52922-66068;2020-03-03 18:07:21;5;LEJEUNE;Maxime;2444;Grades Gendarmerie Departementale Rigides Plastifies;https://generalarmystore.fr/gas/1-les-activites/2-gendarmerie/130-identifiants-gendarmerie/2444-grades-gendarmerie-departementale-rigides-plastifies.html;https://www.generalarmystore.fr/gas/images/products_pictures/normale/GV-P-Departementale_TG.jpg
kael.ho-foui-sang@hotmail.fr;39282-66072;2020-03-03 20:39:00;5;HO FOUI SANG;Kael;8592;Bonnet Thermo Performer niv-3 TOE;https://generalarmystore.fr/gas/1-les-activites/2-gendarmerie/53-couvre-chefs-gendarmerie/8592-bonnet-thermo-performer-niv-3-toe.html;https://www.generalarmystore.fr/gas/images/products_pictures/normale/97265-V0_TG.jpg
kael.ho-foui-sang@hotmail.fr;39282-66072;2020-03-03 20:39:00;5;HO FOUI SANG;Kael;6966;Ceinture TOE en nylon marine fermeture par velcro;https://generalarmystore.fr/gas/1-les-activites/2-gendarmerie/329-ceintures-et-ceinturons-gendarmerie/6966-ceinture-toe-en-nylon-marine-fermeture-par-velcro.html;https://www.generalarmystore.fr/gas/images/products_pictures/normale/201914_TG.jpg
pintainho7@hotmail.fr;52926-66074;2020-03-03 22:27:50;5;FREITAS;Melanie;1695;Holster IA265 Vega pour SigPro2022/Glock/HK;https://generalarmystore.fr/gas/1-les-activites/3-police-nationale/62-holsters-police-nationale/1695-holster-ia265-vega-pour-sigpro2022glockhk.html;https://www.generalarmystore.fr/gas/images/products_pictures/normale/IA265-V1_TG.jpg
eric.p.perso@gmail.com;52928-66075;2020-03-04 09:57:04;5;POILDESSOUS;Eric;8626;Grades Militaires basse visibilite Noir;https://generalarmystore.fr/gas/3-le-matos-le-materiel/469-identifiants-grades-fourreaux-ecussons/473-police-nationale/8626-grades-militaires-basse-visibilite-noir.html;https://www.generalarmystore.fr/gas/images/products_pictures/normale/Grades-BV-Noir_TG.jpg
eric.p.perso@gmail.com;52928-66075;2020-03-04 09:57:04;5;POILDESSOUS;Eric;9811;Sifflet d'Alerte Tactique MOLLE;https://generalarmystore.fr/gas/1-les-activites/281-airsoft-et-paintball/296-accessoires-et-materiels-divers-airsoft-paintball/9811-sifflet-d-alerte-tactique-molle.html;https://www.generalarmystore.fr/gas/images/products_pictures/normale/469113-V0_TG.jpg
eric.p.perso@gmail.com;52928-66075;2020-03-04 09:57:04;5;POILDESSOUS;Eric;9098;Grades Gendarmerie Nationale basse visibilite Noir Gomme 3D;https://generalarmystore.fr/gas/1-les-activites/2-gendarmerie/130-identifiants-gendarmerie/9098-grades-gendarmerie-nationale-basse-visibilite-noir-gomme-3d.html;https://www.generalarmystore.fr/gas/images/products_pictures/normale/GBVN-V1_TG.jpg
