﻿email;order_ref;order_date;delay;lastname;firstname;id_product;name_product;url_product;url_image_product 
amin.bouchaara@yahoo.fr;52909-66051;2020-03-02 21:51:09;5;BOUCHAARA;Amin;1729;Poignee Directionnelle pour Baton lumineux Cyalume;https://generalarmystore.fr/gas/1-les-activites/23-sapeurs-pompiers-jsp/115-lampes-sapeur-pompier-jsp/1729-poignee-directionnelle-pour-baton-lumineux-cyalume.html;https://www.generalarmystore.fr/gas/images/products_pictures/normale/TrafficHandle_TG.jpg
amin.bouchaara@yahoo.fr;52909-66051;2020-03-02 21:51:09;5;BOUCHAARA;Amin;1722;Etui pour baton lumineux Cyalume 15 cm;https://generalarmystore.fr/gas/1-les-activites/23-sapeurs-pompiers-jsp/115-lampes-sapeur-pompier-jsp/1722-etui-pour-baton-lumineux-cyalume-15-cm.html;https://www.generalarmystore.fr/gas/images/products_pictures/normale/Shield_9-06370_TG.jpg
amin.bouchaara@yahoo.fr;52909-66051;2020-03-02 21:51:09;5;BOUCHAARA;Amin;118;Bouchons d'oreilles ULTRAFIT X reutilisables;https://generalarmystore.fr/gas/1-les-activites/25-activites-de-plein-air-outdoor/47-les-accessoires/118-bouchons-d-oreilles-ultrafit-x-reutilisables.html;https://www.generalarmystore.fr/gas/images/products_pictures/normale/Ultrafit-X-V1_TG.jpg
amin.bouchaara@yahoo.fr;52909-66051;2020-03-02 21:51:09;5;BOUCHAARA;Amin;5126;Baton lumineux ChemLight Cyalume 15 cm Militaire;https://generalarmystore.fr/gas/3-le-matos-le-materiel/124-lampes/198-diverses/5126-baton-lumineux-chemlight-cyalume-15-cm-militaire.html;https://www.generalarmystore.fr/gas/images/products_pictures/normale/Chemlight_Montage_TG.jpg
