﻿email;order_ref;order_date;delay;lastname;firstname;id_product;name_product;url_product;url_image_product 
marcadier.s@hotmail.com;52801-65874;2020-02-21 22:05:10;5;MARCADIER;Sylvain;8632;Barrette Dixmude Defense Nationale Bronze + Agrafe de Campagne Reduction;https://generalarmystore.fr/gas/1-les-activites/32-associations-et-amicales/112-gendarmerie/8632-barrette-dixmude-defense-nationale-bronze-agrafe-de-campagne-reduction.html;https://www.generalarmystore.fr/gas/images/products_pictures/normale/DIXDEFNAT-BRONZE-V1_TG.jpg
marcadier.s@hotmail.com;52801-65874;2020-02-21 22:05:10;5;MARCADIER;Sylvain;3753;Medaille Defense Nationale Bronze;https://generalarmystore.fr/gas/1-les-activites/32-associations-et-amicales/108-legion-etrangere/3753-medaille-defense-nationale-bronze.html;https://www.generalarmystore.fr/gas/images/products_pictures/normale/DEFENSE-NAT-BRONZE_TG.jpg
lycos38@hotmail.com;721-65876;2020-02-22 11:44:08;5;OTTAVIANO;Claudian;6461;Bracelet de survie Paracorde 550 Type III 23 mm Noir;https://generalarmystore.fr/gas/3-le-matos-le-materiel/242-accessoires-materiel/33-accessoires-materiel/6461-bracelet-de-survie-paracorde-550-type-iii-23-mm-noir.html;https://www.generalarmystore.fr/gas/images/products_pictures/normale/28173A-V1_TG.jpg
stevy56@gmail.com;50099-65887;2020-02-23 10:34:53;5;LE GUELENNEC;Stevy;8632;Barrette Dixmude Defense Nationale Bronze + Agrafe de Campagne Reduction;https://generalarmystore.fr/gas/1-les-activites/32-associations-et-amicales/112-gendarmerie/8632-barrette-dixmude-defense-nationale-bronze-agrafe-de-campagne-reduction.html;https://www.generalarmystore.fr/gas/images/products_pictures/normale/DIXDEFNAT-BRONZE-V1_TG.jpg
cyrilus.gpsr@hotmail.fr;52812-65888;2020-02-23 18:38:50;5;BOULANGER;Cyril;4595;Grades Gendarmerie Nationale basse visibilite;https://generalarmystore.fr/gas/3-le-matos-le-materiel/469-identifiants-grades-fourreaux-ecussons/472-gendarmerie/4595-grades-gendarmerie-nationale-basse-visibilite.html;https://www.generalarmystore.fr/gas/images/products_pictures/normale/Grades-BV_TG.jpg
cyrilus.gpsr@hotmail.fr;52812-65888;2020-02-23 18:38:50;5;BOULANGER;Cyril;6754;Ecussons de Regions Brodes Basse Visibilite Vert;https://generalarmystore.fr/gas/3-le-matos-le-materiel/469-identifiants-grades-fourreaux-ecussons/472-gendarmerie/6754-ecussons-de-regions-brodes-basse-visibilite-vert.html;https://www.generalarmystore.fr/gas/images/products_pictures/normale/Region-BV-Vert_TG.jpg
cyrilus.gpsr@hotmail.fr;52812-65888;2020-02-23 18:38:50;5;BOULANGER;Cyril;9686;Barrette Dixmude des Reservistes Volontaires de Defense et de Securite Interieure Bronze + Agrafe;https://generalarmystore.fr/gas/3-le-matos-le-materiel/469-identifiants-grades-fourreaux-ecussons/472-gendarmerie/9686-barrette-dixmude-des-reservistes-volontaires-de-defense-et-de-securite-interieure-bronze-agrafe.html;https://www.generalarmystore.fr/gas/images/products_pictures/normale/DIXRVDSI-Br-V1_TG.jpg
cyrilus.gpsr@hotmail.fr;52812-65888;2020-02-23 18:38:50;5;BOULANGER;Cyril;8632;Barrette Dixmude Defense Nationale Bronze + Agrafe de Campagne Reduction;https://generalarmystore.fr/gas/3-le-matos-le-materiel/469-identifiants-grades-fourreaux-ecussons/472-gendarmerie/8632-barrette-dixmude-defense-nationale-bronze-agrafe-de-campagne-reduction.html;https://www.generalarmystore.fr/gas/images/products_pictures/normale/DIXDEFNAT-BRONZE-V1_TG.jpg
cyrilus.gpsr@hotmail.fr;52812-65888;2020-02-23 18:38:50;5;BOULANGER;Cyril;8625;Barrette Dixmude Protection Militaire du Territoire + Agrafe de Campagne Reduction;https://generalarmystore.fr/gas/3-le-matos-le-materiel/469-identifiants-grades-fourreaux-ecussons/472-gendarmerie/8625-barrette-dixmude-protection-militaire-du-territoire-agrafe-de-campagne-reduction.html;https://www.generalarmystore.fr/gas/images/products_pictures/normale/954-BARRETTE-DIXMUDE-PROTECTION-TERR-V1_TG.jpg
cyrilus.gpsr@hotmail.fr;52812-65888;2020-02-23 18:38:50;5;BOULANGER;Cyril;1988;Barrette brodee Gendarmerie de type bande patronymique;https://generalarmystore.fr/gas/3-le-matos-le-materiel/469-identifiants-grades-fourreaux-ecussons/472-gendarmerie/1988-barrette-brodee-gendarmerie-de-type-bande-patronymique.html;https://www.generalarmystore.fr/gas/images/products_pictures/normale/BARRETTE-GEND-MONT_TG.jpg
cyrilus.gpsr@hotmail.fr;52812-65888;2020-02-23 18:38:50;5;BOULANGER;Cyril;9676;Medaille des Reservistes Volontaires de Defense et de Securite Interieure Bronze;https://generalarmystore.fr/gas/3-le-matos-le-materiel/469-identifiants-grades-fourreaux-ecussons/472-gendarmerie/9676-medaille-des-reservistes-volontaires-de-defense-et-de-securite-interieure-bronze.html;https://www.generalarmystore.fr/gas/images/products_pictures/normale/RVDSI-Br-V1_TG.jpg
vdbdidi@hotmail.com;52815-65891;2020-02-23 19:51:22;5;VANDENBROUCK;Didier;5036;Tour de cou polaire avec plastron Noir;https://generalarmystore.fr/gas/2-les-tenues-les-vetements/248-cheches-echarpes-cravates/262-echarpes-tours-de-cou/5036-tour-de-cou-polaire-avec-plastron-noir.html;https://www.generalarmystore.fr/gas/images/products_pictures/normale/TC184-Noir-Face_TG.jpg
zhe973@gmail.com;51662-65892;2020-02-23 19:53:43;5;FAUSTIN;Wisland;8938;Patch Velcro avec Etui Stylo pour Ecusson Gendarmerie ou Police Municipale;https://generalarmystore.fr/gas/3-le-matos-le-materiel/242-accessoires-materiel/33-accessoires-materiel/8938-patch-velcro-avec-etui-stylo-pour-ecusson-gendarmerie-ou-police-municipale.html;https://www.generalarmystore.fr/gas/images/products_pictures/normale/SUPASTYLG-V1_TG.jpg
