﻿email;order_ref;order_date;delay;lastname;firstname;id_product;name_product;url_product;url_image_product 
ilona.prat9@gmail.com;52272-65066;2020-01-01 10:34:25;5;PRAT;Ilona;2239;Ecussons de Regions Brodes;https://generalarmystore.fr/gas/1-les-activites/2-gendarmerie/130-identifiants-gendarmerie/2239-ecussons-de-regions-brodes.html;https://www.generalarmystore.fr/gas/images/products_pictures/normale/12-RHONE-ALPES_TG.jpg
ilona.prat9@gmail.com;52272-65066;2020-01-01 10:34:25;5;PRAT;Ilona;7453;Temoin de chambre vide universel Otis;https://generalarmystore.fr/gas/3-le-matos-le-materiel/231-univers-du-tir/452-entretien/7453-temoin-de-chambre-vide-universel-otis.html;https://www.generalarmystore.fr/gas/images/products_pictures/normale/Bore-Reflector-Flag-Safety_TG.jpg
benjamin.gaze.lbf@gmail.com;49513-65068;2020-01-01 20:43:14;5;GAZE;Benjamin;2239;Ecussons de Regions Brodes;https://generalarmystore.fr/gas/1-les-activites/2-gendarmerie/130-identifiants-gendarmerie/2239-ecussons-de-regions-brodes.html;https://www.generalarmystore.fr/gas/images/products_pictures/normale/12-RHONE-ALPES_TG.jpg
matthieu.bacou@gmail.com;52293-65076;2020-01-02 18:26:38;5;BACOU;Matthieu;2453;Bas de Manches Gendarmerie Departementale Souples Brodes;https://generalarmystore.fr/gas/1-les-activites/2-gendarmerie/130-identifiants-gendarmerie/2453-bas-de-manches-gendarmerie-departementale-souples-brodes.html;https://www.generalarmystore.fr/gas/images/products_pictures/normale/BM-S-305_TG.jpg
ladouce.marie@orange.fr;8289-65079;2020-01-02 20:53:45;5;LADOUCE;Marie;3757;Medaille des Services Militaires Volontaires Bronze;https://generalarmystore.fr/gas/1-les-activites/32-associations-et-amicales/108-legion-etrangere/3757-medaille-des-services-militaires-volontaires-bronze.html;https://www.generalarmystore.fr/gas/images/products_pictures/normale/SERVICE-MILITAIRE-VOL-BRONZE_TG.jpg
ladouce.marie@orange.fr;8289-65079;2020-01-02 20:53:45;5;LADOUCE;Marie;7852;Agrafes de Campagnes Ordonnance;https://generalarmystore.fr/gas/1-les-activites/1-armee/424-medailles-et-attributs-de-decoration-militaires/7852-agrafes-de-campagnes-ordonnance.html;https://www.generalarmystore.fr/gas/images/products_pictures/normale/AGRAFES-ORDO-REDUCT-BAR-4_TG.jpg
grandet.herve@orange.fr;52295-65082;2020-01-03 11:02:06;5;GRANDET;Herve;6622;Bouchons d'oreilles EP7 SONIC Defenders Ultra;https://generalarmystore.fr/gas/1-les-activites/24-camping-randonnee/77-les-accessoires/6622-bouchons-d-oreilles-ep7-sonic-defenders-ultra.html;https://www.generalarmystore.fr/gas/images/products_pictures/normale/SF-EP7-V1_TG.jpg
b.leromanser@gmail.com;52296-65084;2020-01-03 15:21:19;5;LE ROMANSER ;Benjamin ;8164;Cle Ronde Pour Menottes Administratives Rivolier;https://generalarmystore.fr/gas/1-les-activites/1-armee/52-accessoires-et-materiels-divers-armee/8164-cle-ronde-pour-menottes-administratives-rivolier.html;https://www.generalarmystore.fr/gas/images/products_pictures/normale/Menotte-cle-V1_TG.jpg
grumaud@gmail.com;52297-65085;2020-01-03 15:52:44;5;ZYS;Olivier;8563;Fourchette QLS pour Holster Safariland;https://generalarmystore.fr/gas/1-les-activites/2-gendarmerie/57-holsters-gendarmerie/8563-fourchette-qls-pour-holster-safariland.html;https://www.generalarmystore.fr/gas/images/products_pictures/normale/6004-19-2-V1_TG.jpg
arsalexandre13@hotmail.com;37046-65088;2020-01-03 19:28:52;5;ARS;Alexandre;4847;Grades Police Nationale Souples Brodes;https://generalarmystore.fr/gas/1-les-activites/3-police-nationale/131-identifiants-police-nationale/4847-grades-police-nationale-souples-brodes.html;https://www.generalarmystore.fr/gas/images/products_pictures/normale/Grade-Police-Nationale_TG.jpg
arsalexandre13@hotmail.com;37046-65088;2020-01-03 19:28:52;5;ARS;Alexandre;1146;Porte-cles Metal Flamme Gendarmerie;https://generalarmystore.fr/gas/1-les-activites/2-gendarmerie/96-accessoires-et-materiels-divers-gendarmerie/1146-porte-cles-metal-flamme-gendarmerie.html;https://www.generalarmystore.fr/gas/images/products_pictures/normale/CLG_TG.jpg
kirikou.prunelle@outlook.fr;48509-65089;2020-01-03 20:01:37;5;TOURNEMEULE;Isabelle;8610;Patch Velcro Femelle a coudre 2 cm x 10 cm Noir;https://generalarmystore.fr/gas/1-les-activites/2-gendarmerie/130-identifiants-gendarmerie/8610-patch-velcro-femelle-a-coudre-2-cm-x-10-cm-noir.html;https://www.generalarmystore.fr/gas/images/products_pictures/normale/SUPABA-V1_TG.jpg
kirikou.prunelle@outlook.fr;48509-65089;2020-01-03 20:01:37;5;TOURNEMEULE;Isabelle;6599;Patch Velcro Femelle Forme Ecusson de 80 mm x 63 mm;https://generalarmystore.fr/gas/1-les-activites/2-gendarmerie/130-identifiants-gendarmerie/6599-patch-velcro-femelle-forme-ecusson-de-80-mm-x-63-mm.html;https://www.generalarmystore.fr/gas/images/products_pictures/normale/SUPAGEC-V1_TG.jpg
kirikou.prunelle@outlook.fr;48509-65089;2020-01-03 20:01:37;5;TOURNEMEULE;Isabelle;7126;Patch Velcro Femelle 5 cm x 5 cm;https://generalarmystore.fr/gas/1-les-activites/2-gendarmerie/130-identifiants-gendarmerie/7126-patch-velcro-femelle-5-cm-x-5-cm.html;https://www.generalarmystore.fr/gas/images/products_pictures/normale/SUPACA-V1_TG.jpg
kirikou.prunelle@outlook.fr;48509-65089;2020-01-03 20:01:37;5;TOURNEMEULE;Isabelle;7119;Patch Velcro Femelle Rond de 8 cm de diametre;https://generalarmystore.fr/gas/1-les-activites/2-gendarmerie/130-identifiants-gendarmerie/7119-patch-velcro-femelle-rond-de-8-cm-de-diametre.html;https://www.generalarmystore.fr/gas/images/products_pictures/normale/SUPARO-V1_TG.jpg
kirikou.prunelle@outlook.fr;48509-65089;2020-01-03 20:01:37;5;TOURNEMEULE;Isabelle;8648;Patch Velcro Femelle a coudre 10 cm x 30 cm;https://generalarmystore.fr/gas/1-les-activites/2-gendarmerie/130-identifiants-gendarmerie/8648-patch-velcro-femelle-a-coudre-10-cm-x-30-cm.html;https://www.generalarmystore.fr/gas/images/products_pictures/normale/SUPABANRET-V1_TG.jpg
vincentbonaventure67@gmail.com;50120-65092;2020-01-03 23:56:43;5;BONAVENTURE;Vincent;4599;Grades Militaires TDM;https://generalarmystore.fr/gas/1-les-activites/1-armee/423-identifiants-armee/4599-grades-militaires-tdm.html;https://www.generalarmystore.fr/gas/images/products_pictures/normale/Grades-TDM-V1_TG.jpg
vincentbonaventure67@gmail.com;50120-65092;2020-01-03 23:56:43;5;BONAVENTURE;Vincent;9430;Fourreaux d'epaules Sapeurs Pompiers de Paris Souples Brodes (x2);https://generalarmystore.fr/gas/1-les-activites/23-sapeurs-pompiers-jsp/133-identifiants-sapeur-pompier-jsp/9430-fourreaux-d-epaules-sapeurs-pompiers-de-paris-souples-brodes-x2.html;https://www.generalarmystore.fr/gas/images/products_pictures/normale/fourreaux-d epaules-sapeurs-pompiers-de-Paris_TG.jpg
adidi.rolland@gmail.com;49612-65098;2020-01-04 15:16:01;5;ROLLAND;Adrien;2449;Fourreaux d'epaules Gendarmerie Departementale Rigides Plastifies Homme;https://generalarmystore.fr/gas/1-les-activites/2-gendarmerie/130-identifiants-gendarmerie/2449-fourreaux-d-epaules-gendarmerie-departementale-rigides-plastifies-homme.html;https://www.generalarmystore.fr/gas/images/products_pictures/normale/FE-P-106_TG.jpg
adidi.rolland@gmail.com;49612-65098;2020-01-04 15:16:01;5;ROLLAND;Adrien;7956;Grades Gendarmerie Departementale Rigides en Resine;https://generalarmystore.fr/gas/1-les-activites/2-gendarmerie/130-identifiants-gendarmerie/7956-grades-gendarmerie-departementale-rigides-en-resine.html;https://www.generalarmystore.fr/gas/images/products_pictures/normale/GV-R-Departementale_TG.jpg
