﻿email;order_ref;order_date;delay;lastname;firstname;id_product;name_product;url_product;url_image_product 
mathieudoniga@gmail.com;52490-65394;2020-01-22 15:17:10;5;DONIGA;Mathieu;8623;Chargeur K1 pour Accus Li-ion Klarus;https://generalarmystore.fr/gas/1-les-activites/25-activites-de-plein-air-outdoor/47-les-accessoires/8623-chargeur-k1-pour-accus-li-ion-klarus.html;https://www.generalarmystore.fr/gas/images/products_pictures/normale/Chargeur-Klarus-V1_TG.jpg
mathieudoniga@gmail.com;52490-65394;2020-01-22 15:17:10;5;DONIGA;Mathieu;4505;Porte-radio Tactical 5.11 Noir;https://generalarmystore.fr/gas/1-les-activites/281-airsoft-et-paintball/299-communication-airsoft-paintball/4505-porte-radio-tactical-511-noir.html;https://www.generalarmystore.fr/gas/images/products_pictures/normale/58718-019-V1_TG.jpg
mathieudoniga@gmail.com;52490-65394;2020-01-22 15:17:10;5;DONIGA;Mathieu;8935;Bande basse visibilite brodee Gendarmerie 10 x 30 cm;https://generalarmystore.fr/gas/1-les-activites/2-gendarmerie/130-identifiants-gendarmerie/8935-bande-basse-visibilite-brodee-gendarmerie-10-x-30-cm.html;https://www.generalarmystore.fr/gas/images/products_pictures/normale/1488GM-V1_TG.jpg
mathieudoniga@gmail.com;52490-65394;2020-01-22 15:17:10;5;DONIGA;Mathieu;9479;Bande basse visibilite brodee Gendarmerie 4,5 x 10 cm;https://generalarmystore.fr/gas/1-les-activites/2-gendarmerie/130-identifiants-gendarmerie/9479-bande-basse-visibilite-brodee-gendarmerie-4-5-x-10-cm.html;https://www.generalarmystore.fr/gas/images/products_pictures/normale/1488MM-V1_TG.jpg
mathieudoniga@gmail.com;52490-65394;2020-01-22 15:17:10;5;DONIGA;Mathieu;7567;T-shirt Respirant Gendarmerie Departementale Noir avec support Velcro;https://generalarmystore.fr/gas/1-les-activites/32-associations-et-amicales/112-gendarmerie/7567-t-shirt-respirant-gendarmerie-departementale-noir-avec-support-velcro.html;https://www.generalarmystore.fr/gas/images/products_pictures/normale/32T-0185-V1_TG.jpg
mathieudoniga@gmail.com;52490-65394;2020-01-22 15:17:10;5;DONIGA;Mathieu;9701;Plateforme tactique de hanche Tactiknight GK Pro;https://generalarmystore.fr/gas/1-les-activites/2-gendarmerie/57-holsters-gendarmerie/9701-plateforme-tactique-de-hanche-tactiknight-gk-pro.html;https://www.generalarmystore.fr/gas/images/products_pictures/normale/97005KT-V1_TG.jpg
mathieudoniga@gmail.com;52490-65394;2020-01-22 15:17:10;5;DONIGA;Mathieu;3663;Gilet Modulable 5.11 LBE Noir;https://generalarmystore.fr/gas/1-les-activites/281-airsoft-et-paintball/286-gilets-pulls-sweats-airsoft-paintball/3663-gilet-modulable-511-lbe-noir.html;https://www.generalarmystore.fr/gas/images/products_pictures/normale/511-58631-019_TG.jpg
