﻿email;order_ref;order_date;delay;lastname;firstname;id_product;name_product;url_product;url_image_product 
kevin.mesnage21@orange.fr;34415-65950;2020-02-26 17:12:27;5;MESNAGE;Kevin;8683;Kit porte-medailles Ordonnance Martineau;https://generalarmystore.fr/gas/1-les-activites/1-armee/52-accessoires-et-materiels-divers-armee/8683-kit-porte-medailles-ordonnance-martineau.html;https://www.generalarmystore.fr/gas/images/products_pictures/normale/17382-V1_TG.jpg
kevin.mesnage21@orange.fr;34415-65950;2020-02-26 17:12:27;5;MESNAGE;Kevin;8634;Barrette Dixmude Defense Nationale Or + Agrafe de Campagne Reduction;https://generalarmystore.fr/gas/1-les-activites/2-gendarmerie/130-identifiants-gendarmerie/8634-barrette-dixmude-defense-nationale-or-agrafe-de-campagne-reduction.html;https://www.generalarmystore.fr/gas/images/products_pictures/normale/DIXDEFNAT-OR-V1_TG.jpg
