﻿email;order_ref;order_date;delay;lastname;firstname;id_product;name_product;url_product;url_image_product 
fabmon834@gmail.com;52567-65534;2020-01-29 14:52:34;5;MONNIER;Fabien;6599;Patch Velcro Femelle Forme Ecusson de 80 mm x 63 mm;https://generalarmystore.fr/gas/1-les-activites/29-fashion-mode/92-les-accessoires/6599-patch-velcro-femelle-forme-ecusson-de-80-mm-x-63-mm.html;https://www.generalarmystore.fr/gas/images/products_pictures/normale/SUPAGEC-V1_TG.jpg
fabmon834@gmail.com;52567-65534;2020-01-29 14:52:34;5;MONNIER;Fabien;8771;Porte cles tactique Groupe Sanguin Miltec Coyote;https://generalarmystore.fr/gas/1-les-activites/29-fashion-mode/92-les-accessoires/8771-porte-cles-tactique-groupe-sanguin-miltec-coyote.html;https://www.generalarmystore.fr/gas/images/products_pictures/normale/15917505-V1_TG.jpg
fabmon834@gmail.com;52567-65534;2020-01-29 14:52:34;5;MONNIER;Fabien;7119;Patch Velcro Femelle Rond de 8 cm de diametre;https://generalarmystore.fr/gas/1-les-activites/29-fashion-mode/92-les-accessoires/7119-patch-velcro-femelle-rond-de-8-cm-de-diametre.html;https://www.generalarmystore.fr/gas/images/products_pictures/normale/SUPARO-V1_TG.jpg
fabmon834@gmail.com;52567-65534;2020-01-29 14:52:34;5;MONNIER;Fabien;7126;Patch Velcro Femelle 5 cm x 5 cm;https://generalarmystore.fr/gas/1-les-activites/29-fashion-mode/92-les-accessoires/7126-patch-velcro-femelle-5-cm-x-5-cm.html;https://www.generalarmystore.fr/gas/images/products_pictures/normale/SUPACA-V1_TG.jpg
