{
  "ssm:account=404967239763:parameterName=/Vpc/VpcId:region=eu-central-1": "vpc-0f352db500ae304f2",
  "vpc-provider:account=404967239763:filter.isDefault=false:filter.vpc-id=vpc-0f352db500ae304f2:region=eu-central-1:returnAsymmetricSubnets=true": {
    "vpcId": "vpc-0f352db500ae304f2",
    "vpcCidrBlock": "10.10.0.0/16",
    "availabilityZones": [],
    "vpnGatewayId": "vgw-0a0df1aff72d3fa03",
    "subnetGroups": [
      {
        "name": "Private",
        "type": "Private",
        "subnets": [
          {
            "subnetId": "subnet-079f99996d283013f",
            "cidr": "10.10.3.0/24",
            "availabilityZone": "eu-central-1a",
            "routeTableId": "rtb-09d4948742f552774"
          },
          {
            "subnetId": "subnet-0f98003a813f6a329",
            "cidr": "10.10.4.0/24",
            "availabilityZone": "eu-central-1b",
            "routeTableId": "rtb-0598646cd5f6f2f21"
          },
          {
            "subnetId": "subnet-0a48f162e30a7d99d",
            "cidr": "10.10.5.0/24",
            "availabilityZone": "eu-central-1c",
            "routeTableId": "rtb-029001cc032fa7b4d"
          }
        ]
      },
      {
        "name": "Public",
        "type": "Public",
        "subnets": [
          {
            "subnetId": "subnet-0ab7634a0f3149c8b",
            "cidr": "10.10.0.0/24",
            "availabilityZone": "eu-central-1a",
            "routeTableId": "rtb-0e37dd017719873b1"
          },
          {
            "subnetId": "subnet-09b7cc60da6814d36",
            "cidr": "10.10.1.0/24",
            "availabilityZone": "eu-central-1b",
            "routeTableId": "rtb-06cc6a062065f8367"
          },
          {
            "subnetId": "subnet-02716adf530e271c6",
            "cidr": "10.10.2.0/24",
            "availabilityZone": "eu-central-1c",
            "routeTableId": "rtb-0376b91383c2eee9a"
          }
        ]
      },
      {
        "name": "Isolated",
        "type": "Isolated",
        "subnets": [
          {
            "subnetId": "subnet-0069cf66cc9c281ce",
            "cidr": "10.10.6.0/24",
            "availabilityZone": "eu-central-1a",
            "routeTableId": "rtb-0e9e5e8fad3f6b2ee"
          },
          {
            "subnetId": "subnet-08cb630970feffedb",
            "cidr": "10.10.7.0/24",
            "availabilityZone": "eu-central-1b",
            "routeTableId": "rtb-030411b4f277e0184"
          },
          {
            "subnetId": "subnet-0ce834d5ad4d1bcf0",
            "cidr": "10.10.8.0/24",
            "availabilityZone": "eu-central-1c",
            "routeTableId": "rtb-01757b1bbf85c9c50"
          }
        ]
      }
    ]
  }
}
