<svg width="48" height="48" viewBox="0 0 48 48" fill="none" xmlns="http://www.w3.org/2000/svg">
<path fill-rule="evenodd" clip-rule="evenodd" d="M7.09265 30.3933C3.71275 21.791 11.0618 12.878 12.5334 11.394C14.0049 9.90991 16.5823 7.68597 22.8729 7.72259C29.1636 7.75921 34.4655 9.29143 38.7279 14.3274C42.9903 19.3634 40.755 25.7494 36.3344 32.0562C31.9138 38.363 27.8752 40.9627 24.7334 42.6308C21.5917 44.2988 18.4848 44.2192 16.0447 42.7596C13.6045 41.3 10.4726 38.9956 7.09265 30.3933Z" fill="#007AFF"/>
<path fill-rule="evenodd" clip-rule="evenodd" d="M3.01952 22.8809C3.17261 14.1108 5.95516 8.67477 9.34662 5.80973C12.7381 2.94469 18.8491 3.50516 25.095 7.26948C31.3409 11.0338 36.142 18.3416 37.5245 24.2142C38.9071 30.0868 34.0119 34.0222 27.2736 37.1943C20.5354 40.3665 15.6975 41.0131 12.3571 40.9548C9.01668 40.8965 7.13299 39.3867 5.68663 37.1682C4.24026 34.9498 2.86644 31.6509 3.01952 22.8809Z" fill="#A63090"/>
<path fill-rule="evenodd" clip-rule="evenodd" d="M18.2031 39.3918C10.4383 37.7414 6.37219 36.19 4.41276 32.6815C2.45334 29.173 3.57123 23.9138 7.99429 19.0135C12.4173 14.1132 19.8919 9.1744 25.3479 8.95988C30.8038 8.74536 33.3458 14.4646 35 21.0002C36.6541 27.5358 36.5014 31.2568 35.8726 34.2152C35.2438 37.1735 33.1371 39.1306 30.9164 40.0328C28.6958 40.935 25.9678 41.0423 18.2031 39.3918Z" fill="#EA435E"/>
<path fill-rule="evenodd" clip-rule="evenodd" d="M6.05316 23.235C6.05316 14.4452 6.80001 9.68407 10.1608 6.75415C13.5217 3.82423 19.4965 3.82423 25.8447 7.48663C32.193 11.149 39.2881 18.1076 40.7818 23.9674C42.2755 29.8273 37.4209 33.8559 30.6993 37.1521C23.9776 40.4482 19.1231 41.1807 15.7622 41.1807C12.4014 41.1807 9.78742 39.3495 8.29372 37.1521C6.80001 34.9546 6.05316 32.0247 6.05316 23.235Z" fill="#7721FF"/>
<path fill-rule="evenodd" clip-rule="evenodd" d="M35.0987 16.1974C35.7055 16.1974 36.1974 15.7055 36.1974 15.0987C36.1974 14.4919 35.7055 14 35.0987 14C34.4919 14 34 14.4919 34 15.0987C34 15.7055 34.4919 16.1974 35.0987 16.1974Z" fill="#A63090"/>
<path fill-rule="evenodd" clip-rule="evenodd" d="M12.3205 19.5724C12.9273 19.5724 13.4192 19.0805 13.4192 18.4737C13.4192 17.8669 12.9273 17.375 12.3205 17.375C11.7137 17.375 11.2218 17.8669 11.2218 18.4737C11.2218 19.0805 11.7137 19.5724 12.3205 19.5724Z" fill="#EA435E"/>
<path fill-rule="evenodd" clip-rule="evenodd" d="M11.9543 37.5182C12.5611 37.5182 13.053 37.0263 13.053 36.4195C13.053 35.8127 12.5611 35.3208 11.9543 35.3208C11.3475 35.3208 10.8556 35.8127 10.8556 36.4195C10.8556 37.0263 11.3475 37.5182 11.9543 37.5182Z" fill="#007AFF"/>
<path fill-rule="evenodd" clip-rule="evenodd" d="M32.0975 28.7286C32.502 28.7286 32.83 28.4007 32.83 27.9962C32.83 27.5916 32.502 27.2637 32.0975 27.2637C31.6929 27.2637 31.365 27.5916 31.365 27.9962C31.365 28.4007 31.6929 28.7286 32.0975 28.7286Z" fill="#EA435E"/>
<path fill-rule="evenodd" clip-rule="evenodd" d="M21.1103 8.58532C21.5148 8.58532 21.8428 8.25738 21.8428 7.85284C21.8428 7.4483 21.5148 7.12036 21.1103 7.12036C20.7058 7.12036 20.3778 7.4483 20.3778 7.85284C20.3778 8.25738 20.7058 8.58532 21.1103 8.58532Z" fill="#A63090"/>
<path d="M20.1528 13C19.7281 13 19.3837 13.3406 19.3837 13.7607C19.3837 17.6073 14 20.6065 14 25.9311C14 29.9761 18.4327 32.5913 19.9936 32.7606C20.046 32.7715 20.0993 32.777 20.1528 32.777C20.5776 32.777 20.9219 32.4364 20.9219 32.0163C20.9218 31.7875 20.8175 31.5709 20.638 31.4265C19.9381 30.8637 18.6146 29.2351 18.6146 27.748C18.6146 25.3071 20.9219 24.4098 20.9219 24.4098C19.606 28.0913 23.9179 28.5362 24.7855 32.1812C24.865 32.5288 25.1765 32.7764 25.5366 32.777C25.6985 32.7766 25.8562 32.7256 25.9872 32.6314C26.0011 32.6214 26.0146 32.611 26.0278 32.6002C26.1529 32.5198 29.3821 30.4075 29.3821 25.9311C29.3821 24.1035 28.4579 20.9644 27.7928 19.574C27.7922 19.5728 27.7918 19.5707 27.7913 19.5695C27.7908 19.5685 27.7903 19.5676 27.7898 19.5666C27.6739 19.2762 27.3904 19.0854 27.0748 19.0852C26.7042 19.0856 26.3865 19.3473 26.3192 19.7077C26.3173 19.719 25.964 21.2706 24.7675 22.1278C24.7675 18.5439 22.1512 14.842 20.7717 13.3105C20.751 13.2828 20.7284 13.2565 20.7041 13.2318C20.5596 13.084 20.3607 13.0004 20.1528 13Z" fill="white"/>
</svg>
