<svg width="127" height="46.98387" viewBox="0 0 141 53" fill="none" xmlns="http://www.w3.org/2000/svg">
<rect x="0.394531" y="0.931152" width="139.93" height="51.1373" rx="9" fill="#DEDC00"/>
<path d="M19.8703 33.4995V16.2195H25.4143C31.1503 16.2195 33.9103 20.0835 33.9103 24.8595C33.9103 29.6355 31.1503 33.4995 25.4143 33.4995H19.8703ZM21.7663 31.7715H25.4143C29.9503 31.7715 31.9423 28.7475 31.9423 24.8595C31.9423 20.9715 29.9503 17.9475 25.4143 17.9475H21.7663V31.7715ZM36.32 33.4995V21.0195H38.048V23.2275C39.056 21.3555 40.592 20.8755 42.128 20.8755H43.064V22.6275H42.056C39.944 22.6275 38.144 23.6355 38.12 26.8035V33.4995H36.32ZM53.0508 33.4995V31.7475C51.9708 33.2595 50.4588 33.7875 48.8988 33.7875C46.1148 33.7875 44.4588 32.4435 44.4588 30.1395C44.4588 27.9555 46.1148 26.8275 48.9708 26.2755L52.9788 25.4835V24.4995C52.9788 22.9155 51.9228 22.3395 50.0748 22.3395C48.4908 22.3395 46.8108 22.8675 46.7148 24.8595H44.9148C44.9868 21.8835 47.4348 20.7315 50.0748 20.7315C53.2428 20.7315 54.7308 22.1235 54.7308 24.3315V33.4995H53.0508ZM46.3308 30.0915C46.3308 31.3155 47.1228 32.1795 48.9708 32.1795C50.9628 32.1795 52.9788 31.0515 52.9788 28.4595V27.0195L49.2108 27.8115C47.4348 28.1955 46.3308 28.6275 46.3308 30.0915ZM62.8155 38.5875C59.5035 38.5875 57.7515 37.0515 57.4635 34.5315H59.2395C59.5275 36.3075 60.7995 37.0275 62.8155 37.0275C64.8795 37.0275 66.7755 36.1875 66.7755 33.1875V31.5555C65.8875 32.9475 64.4715 33.7875 62.5515 33.7875C58.8315 33.7875 56.7915 30.9795 56.7915 27.2595C56.7915 23.5395 58.8315 20.7315 62.5515 20.7315C64.5195 20.7315 65.9595 21.6195 66.8475 23.0835V21.0195H68.5755V33.1875C68.5755 36.8835 66.1515 38.5875 62.8155 38.5875ZM58.6875 27.2595C58.6875 30.0675 60.0315 32.1555 62.7435 32.1555C65.4795 32.1555 66.8235 30.0675 66.8235 27.2595C66.8235 24.4515 65.4795 22.3635 62.7435 22.3635C60.0315 22.3635 58.6875 24.4515 58.6875 27.2595Z" fill="#292728"/>
<path fill-rule="evenodd" clip-rule="evenodd" d="M118.165 25.792V25.2087H121.509L117.527 18.6453L117.524 18.6501L117.184 18.0877L117.527 17.5215L122.367 25.4999L117.527 33.4775L117.187 32.9173L117.753 31.9838L121.509 25.792H118.165Z" fill="#292728"/>
<path d="M118.165 25.2087V24.3215H117.278V25.2087H118.165ZM118.165 25.792H117.278V26.6793H118.165V25.792ZM121.509 25.2087V26.096H123.085L122.267 24.7485L121.509 25.2087ZM117.527 18.6453L118.286 18.1851L117.527 16.9346L116.768 18.1851L117.527 18.6453ZM117.524 18.6501L116.765 19.1097L117.524 20.3618L118.283 19.1102L117.524 18.6501ZM117.184 18.0877L116.425 17.6275L116.146 18.0873L116.425 18.5473L117.184 18.0877ZM117.527 17.5215L118.286 17.0613L117.527 15.8109L116.769 17.0613L117.527 17.5215ZM122.367 25.4999L123.126 25.9602L123.405 25.5L123.126 25.0398L122.367 25.4999ZM117.527 33.4775L116.769 33.9377L117.527 35.1881L118.286 33.9377L117.527 33.4775ZM117.187 32.9173L116.428 32.4577L116.15 32.9177L116.429 33.3775L117.187 32.9173ZM117.753 31.9838L116.994 31.5236L116.994 31.5242L117.753 31.9838ZM121.509 25.792L122.267 26.2522L123.085 24.9048H121.509V25.792ZM117.278 25.2087V25.792H119.053V25.2087H117.278ZM121.509 24.3215H118.165V26.096H121.509V24.3215ZM116.769 19.1055L120.75 25.6689L122.267 24.7485L118.286 18.1851L116.769 19.1055ZM118.283 19.1102L118.286 19.1054L116.768 18.1851L116.766 18.1899L118.283 19.1102ZM116.425 18.5473L116.765 19.1097L118.283 18.1905L117.943 17.6281L116.425 18.5473ZM116.769 17.0613L116.425 17.6275L117.942 18.5479L118.286 17.9817L116.769 17.0613ZM123.126 25.0398L118.286 17.0613L116.769 17.9817L121.609 25.9601L123.126 25.0398ZM118.286 33.9377L123.126 25.9602L121.609 25.0397L116.769 33.0173L118.286 33.9377ZM116.429 33.3775L116.769 33.9377L118.286 33.0173L117.946 32.4572L116.429 33.3775ZM116.994 31.5242L116.428 32.4577L117.946 33.3769L118.511 32.4434L116.994 31.5242ZM120.75 25.3318L116.994 31.5236L118.511 32.444L122.267 26.2522L120.75 25.3318ZM118.165 26.6793H121.509V24.9048H118.165V26.6793Z" fill="#292728"/>
<rect x="92.7928" y="24.8845" width="28.1588" height="1.2315" fill="#292728" stroke="#292728" stroke-width="1.10905"/>
</svg>
