<svg width="16" height="15" viewBox="0 0 16 15" fill="none" xmlns="http://www.w3.org/2000/svg">
<path d="M1.28125 0.407227L15.4873 14.6133" stroke="black"/>
<path d="M15.4922 0.410156L1.28611 14.6162" stroke="black"/>
</svg>
