br\com\testapi\repositories\LivrosRepository.class
br\com\testapi\domain\Livros.class
br\com\testapi\config\SecurityConfig.class
br\com\testapi\resources\LivrosResource.class
br\com\testapi\BaseAPIApplication.class
br\com\testapi\model\Imagens.class
br\com\testapi\services\exceptions\ObjectNotFoundException.class
br\com\testapi\services\LivrosService.class
br\com\testapi\model\Livraria.class
br\com\testapi\model\Livraria$Volumes.class
br\com\testapi\model\Livro.class
