

	SME7			QBME7			HME7
rho 	0.010886831791475   	0.009107255898219   	0.016536699421836
u 	0.001993631068004   	0.001947752502232   	0.003246708078409
p 	0.005871737239332   	0.005810642676347   	0.009691523783553
Q 	0.140307832071013   	0.122607229019824   	0.162202414015319