{
  "type": "service_account",
  "project_id": "react-quiz-af5d6",
  "private_key_id": "b41a56f97ea5b6f8f58a2025eb9779184bbf0f0a",
  "private_key": "-----BEGIN PRIVATE KEY-----\nMIIEvAIBADANBgkqhkiG9w0BAQEFAASCBKYwggSiAgEAAoIBAQCEGoVqUstN3ZT+\nJAjGv0V1YlVieU8PLFD/y1EGVg7PXpYUGo//GvWv3Nhyh57AUncxfagq13RMfAQl\nDYQhTfRDwysUCqWRdXIl6susDG93omd57n4B0PKEPPl+IE2ztP3lknvZo7xrrjAN\nFIrKLDiMRtSGb/I2WwE5oDllu2UtSz8G/hm/UTSiwAKjALE5+yZB85PGY15jTXo5\n7ToXua4j7FOZBgRWS8JBuc9Uwm+jsvdIEOc/FYdc1jmXOQLdCJ4DGRQMpN/GUrOI\nGfj/qqKrVyXzHtM9/ox6W/cWErBhk4snkChbGc9Q9hvhUK35x2sHabXTDUwV17BB\nUxzX3qZ/AgMBAAECggEAAcS5HytB6CZHOv+7KQNL0r52QNM5k7fBfdXNnTVvDVJJ\ngAtlp2yc+AsPerkGDwe2QMYF3PegFEYKEtTo0pP7PnemY/uggR9UCoiSIW4pL9jP\nZHp6MAa0DcEjNeUIz+xkWbu+8ghBxXns0BVY+6E2leonfi/my4N8XgvJuOrr99Hn\nzDwwImZ3H4dqmErlBc/fmWeIFo4x9vtjcgZxJEXOvNY1dLRrrMFiYocJqjvbrjI2\nqnQ/mxUdZIxIuJLXo5gBpyPuoMfeX2X6Y2XkBqMnIYmPaO7gyXPPzjpBB1pxdyf2\npzHeVmkmKklTdvylxMf8yimD85uLjOZ07zl1QU2hQQKBgQC5qeyR2Sf1IB+IlKqT\n+hvQ8gxY/kZyghJcHx0zvFeMO2n8viNWO61mIxuoQiIuVSwJeT/pkCxQZF8yW2nC\nD7rHzizOyybPv0pSljPzaJwAy07IC72wvpHsC63lFCrXljyH6aWBqGgKzSL32z7i\nTzI3wxbujYCvhQTJkHallk7qDQKBgQC2JjcpYYMQoWZGyQndPOMzevQFpmB3NUL3\n9CJb74go6vTU1nKFTH98b+eg3ailFY+gMMljCJK0ikLpzdVqf5iPpa0dwMOP2jBR\nwlohDyBm7Q8X7Iw1E3sLN5xkBMh7u1xSE78ExL2pDnpQSPRlUPnlmzBQSAfMrc55\npzb586+ruwKBgFSz5DzJ0IPxatF52bR293fE5cM4BlW5Z7zlaQIwW9SbSohHCoIN\n6dbeD4Ec4tE2hEeyLGlXIBBxKkkkEUS6vmDne+PAJO3EfJje88aJpBpspn13dcwL\ntTD2Rxhqsfz3CpiLDLnxZb3/xoNDYBYJQYTVGUIuBlaNHhkDMk3rHAeFAoGASWb5\nD7n2ATupZZkaWodw34wKzkQP17ok9JrzRa0vZ53Xb/XDTKhZL6JA63inv28C5AEF\nBt2rkQmukV2bRUGKD0kqjDTkGhJJKolxnKTl39RkIrX2gmUJTqnoYf3zdLk6KPFA\nJwHJlFj7PWNI6ZNKQRbaz19XlUntTOTvqKZlAoUCgYBrf/Aftal9qZP9AJklj++R\naIwawGmvblJPc+HGNWUyHs9KHh5tt5xoCtT5jHzDlNoRRhNjSuhO1JpC8MtCTbpZ\ni+GXmce5ujEPTKd1fvhkMeLnFFv8RpAJZwIV9P0PET45oc+Gv/qB3ebyzVWdnRxs\nTx6jbpeEl7Td0nbrEvclUA==\n-----END PRIVATE KEY-----\n",
  "client_email": "firebase-adminsdk-m7y8c@react-quiz-af5d6.iam.gserviceaccount.com",
  "client_id": "102255550963264751247",
  "auth_uri": "https://accounts.google.com/o/oauth2/auth",
  "token_uri": "https://oauth2.googleapis.com/token",
  "auth_provider_x509_cert_url": "https://www.googleapis.com/oauth2/v1/certs",
  "client_x509_cert_url": "https://www.googleapis.com/robot/v1/metadata/x509/firebase-adminsdk-m7y8c%40react-quiz-af5d6.iam.gserviceaccount.com"
}
