[
    {
        "id":1,
        "title": "Дерев'яні рамки для фото",
        "price": 399.99,
        "image": "http://surl.li/snyhi",
        "article": "123456",
        "color": "Коричневий"
    },
    {
        "id": 2,
        "title": "Настінна декорація",
        "price": 829.29,
        "image": "https://m.media-amazon.com/images/I/6123mViRHpL._SS400_.jpg",
        "article": "234567",
        "color": "Коричневий"
    },
    {
        "id": 3,
        "title": "Колекція картин Нотки Природи",
        "price": 376.59,
        "image": "https://i.pinimg.com/474x/f2/86/46/f286467e58f0356810097c5a092e66a4.jpg",
        "article": "345678",
        "color": "Чорний"
    },
    {
        "id": 4,
        "title": "Модульна картина Будда",
        "price": 799.99,
        "image": " https://m.media-amazon.com/images/I/71hrzmzydkL._AC_UL400_.jpg",
        "article": "456789",
        "color": "Коричневий"
    },
    {
        "id": 5,
        "title": "Настінна декорація Сакура",
        "price": 479.77,
        "image": "https://images-cdn.ubuy.co.in/634f879b65ebc84fd273a5c5-3d-large-couple-tree-wall-sticker.jpg",
        "article": "567890",
        "color": "Рожевий"
    },
    {
        "id": 6,
        "title": "Красивий килим Нові мотиви",
        "price": 999.99,
        "image": "https://www.dhresource.com/webp/m/0x0/f2/albu/g18/M01/AB/D3/rBVapGFhHUaAV6CLAACvSZAurqI103.jpg",
        "article": "678901",
        "color": "Синій"
    },
    {
        "id": 7,
        "title": "Настінна декорація Родина",
        "price": 477.66,
        "image": "https://katycraft.com/wp-content/uploads/2023/07/1613976943058.jpg",
        "article": "789012",
        "color": "Чорний"
    },
    {
        "id": 8,
        "title": "Велике настінне дзеркало",
        "price": 655.88,
        "image": "https://i.pinimg.com/474x/6a/41/d3/6a41d33209e90a8cf3ccf65eba786393.jpg",
        "article": "890123",
        "color": "Білий"
    },
    {
        "id": 9,
        "title": "Неймовірний набір тумб",
        "price": 976.99,
        "image": "https://i.pinimg.com/474x/2f/88/d2/2f88d2dffbb3aebf7f73151bb2893c5e.jpg",
        "article": "901234",
        "color": "Чорний"
    },
    {
        "id": 10,
        "title": "Стильний журнальний столик",
        "price": 845.99,
        "image": "https://i.pinimg.com/474x/1a/68/99/1a68994992f5ddc29070edf1d2237096.jpg",
        "article": "012345",
        "color": "Бежевий"
    }
]
