C:\Users\Администратор\IdeaProjects\HomeWork5\src\test\java\ru\pochta\hooks\Hooks.java
C:\Users\Администратор\IdeaProjects\HomeWork5\src\test\java\ru\pochta\RunnerTest.java
C:\Users\Администратор\IdeaProjects\HomeWork5\src\test\java\ru\pochta\steps\PochtaMainPageSteps.java
