Fluent 17.1 Exported Ensight Model Geometry File
Ensight 7.6
node id assign
element id assign
part
         9
fluid
coordinates
       100
 1.11111e-01
 1.11111e-01
 0.00000e+00
 0.00000e+00
 1.11111e-01
 0.00000e+00
 1.11111e-01
 0.00000e+00
 1.11111e-01
 0.00000e+00
 1.11111e-01
 0.00000e+00
 1.11111e-01
 0.00000e+00
 1.11111e-01
 0.00000e+00
 1.11111e-01
 0.00000e+00
 1.11111e-01
 0.00000e+00
 2.22222e-01
 2.22222e-01
 2.22222e-01
 2.22222e-01
 2.22222e-01
 2.22222e-01
 2.22222e-01
 2.22222e-01
 2.22222e-01
 2.22222e-01
 3.33333e-01
 3.33333e-01
 3.33333e-01
 3.33333e-01
 3.33333e-01
 3.33333e-01
 3.33333e-01
 3.33333e-01
 3.33333e-01
 3.33333e-01
 4.44444e-01
 4.44444e-01
 4.44444e-01
 4.44444e-01
 4.44444e-01
 4.44444e-01
 4.44444e-01
 4.44444e-01
 4.44444e-01
 4.44444e-01
 5.55556e-01
 5.55556e-01
 5.55556e-01
 5.55556e-01
 5.55556e-01
 5.55556e-01
 5.55556e-01
 5.55556e-01
 5.55556e-01
 5.55556e-01
 6.66667e-01
 6.66667e-01
 6.66667e-01
 6.66667e-01
 6.66667e-01
 6.66667e-01
 6.66667e-01
 6.66667e-01
 6.66667e-01
 6.66667e-01
 7.77778e-01
 7.77778e-01
 7.77778e-01
 7.77778e-01
 7.77778e-01
 7.77778e-01
 7.77778e-01
 7.77778e-01
 7.77778e-01
 7.77778e-01
 8.88889e-01
 8.88889e-01
 8.88889e-01
 8.88889e-01
 8.88889e-01
 8.88889e-01
 8.88889e-01
 8.88889e-01
 8.88889e-01
 8.88889e-01
 1.00000e+00
 1.00000e+00
 1.00000e+00
 1.00000e+00
 1.00000e+00
 1.00000e+00
 1.00000e+00
 1.00000e+00
 1.00000e+00
 1.00000e+00
 0.00000e+00
 1.11111e-01
 1.11111e-01
 0.00000e+00
 2.22222e-01
 2.22222e-01
 3.33333e-01
 3.33333e-01
 4.44444e-01
 4.44444e-01
 5.55556e-01
 5.55556e-01
 6.66667e-01
 6.66667e-01
 7.77778e-01
 7.77778e-01
 8.88889e-01
 8.88889e-01
 1.00000e+00
 1.00000e+00
 0.00000e+00
 1.11111e-01
 2.22222e-01
 3.33333e-01
 4.44444e-01
 5.55556e-01
 6.66667e-01
 7.77778e-01
 8.88889e-01
 1.00000e+00
 0.00000e+00
 1.11111e-01
 2.22222e-01
 3.33333e-01
 4.44444e-01
 5.55556e-01
 6.66667e-01
 7.77778e-01
 8.88889e-01
 1.00000e+00
 0.00000e+00
 1.11111e-01
 2.22222e-01
 3.33333e-01
 4.44444e-01
 5.55556e-01
 6.66667e-01
 7.77778e-01
 8.88889e-01
 1.00000e+00
 0.00000e+00
 1.11111e-01
 2.22222e-01
 3.33333e-01
 4.44444e-01
 5.55556e-01
 6.66667e-01
 7.77778e-01
 8.88889e-01
 1.00000e+00
 0.00000e+00
 1.11111e-01
 2.22222e-01
 3.33333e-01
 4.44444e-01
 5.55556e-01
 6.66667e-01
 7.77778e-01
 8.88889e-01
 1.00000e+00
 0.00000e+00
 1.11111e-01
 2.22222e-01
 3.33333e-01
 4.44444e-01
 5.55556e-01
 6.66667e-01
 7.77778e-01
 8.88889e-01
 1.00000e+00
 0.00000e+00
 1.11111e-01
 2.22222e-01
 3.33333e-01
 4.44444e-01
 5.55556e-01
 6.66667e-01
 7.77778e-01
 8.88889e-01
 1.00000e+00
 1.11111e-01
 0.00000e+00
 2.22222e-01
 3.33333e-01
 4.44444e-01
 5.55556e-01
 6.66667e-01
 7.77778e-01
 8.88889e-01
 1.00000e+00
 0.00000e+00
 0.00000e+00
 0.00000e+00
 0.00000e+00
 0.00000e+00
 0.00000e+00
 0.00000e+00
 0.00000e+00
 0.00000e+00
 0.00000e+00
 0.00000e+00
 0.00000e+00
 0.00000e+00
 0.00000e+00
 0.00000e+00
 0.00000e+00
 0.00000e+00
 0.00000e+00
 0.00000e+00
 0.00000e+00
 0.00000e+00
 0.00000e+00
 0.00000e+00
 0.00000e+00
 0.00000e+00
 0.00000e+00
 0.00000e+00
 0.00000e+00
 0.00000e+00
 0.00000e+00
 0.00000e+00
 0.00000e+00
 0.00000e+00
 0.00000e+00
 0.00000e+00
 0.00000e+00
 0.00000e+00
 0.00000e+00
 0.00000e+00
 0.00000e+00
 0.00000e+00
 0.00000e+00
 0.00000e+00
 0.00000e+00
 0.00000e+00
 0.00000e+00
 0.00000e+00
 0.00000e+00
 0.00000e+00
 0.00000e+00
 0.00000e+00
 0.00000e+00
 0.00000e+00
 0.00000e+00
 0.00000e+00
 0.00000e+00
 0.00000e+00
 0.00000e+00
 0.00000e+00
 0.00000e+00
 0.00000e+00
 0.00000e+00
 0.00000e+00
 0.00000e+00
 0.00000e+00
 0.00000e+00
 0.00000e+00
 0.00000e+00
 0.00000e+00
 0.00000e+00
 0.00000e+00
 0.00000e+00
 0.00000e+00
 0.00000e+00
 0.00000e+00
 0.00000e+00
 0.00000e+00
 0.00000e+00
 0.00000e+00
 0.00000e+00
 0.00000e+00
 0.00000e+00
 0.00000e+00
 0.00000e+00
 0.00000e+00
 0.00000e+00
 0.00000e+00
 0.00000e+00
 0.00000e+00
 0.00000e+00
 0.00000e+00
 0.00000e+00
 0.00000e+00
 0.00000e+00
 0.00000e+00
 0.00000e+00
 0.00000e+00
 0.00000e+00
 0.00000e+00
 0.00000e+00
quad4
        81
         1         2         3         4
         2         5         6         3
         5         7         8         6
         7         9        10         8
         9        11        12        10
        11        13        14        12
        13        15        16        14
        15        17        18        16
        17        19        20        18
        21        22         2         1
        22        23         5         2
        23        24         7         5
        24        25         9         7
        25        26        11         9
        26        27        13        11
        27        28        15        13
        28        29        17        15
        29        30        19        17
        31        32        22        21
        32        33        23        22
        33        34        24        23
        34        35        25        24
        35        36        26        25
        36        37        27        26
        37        38        28        27
        38        39        29        28
        39        40        30        29
        41        42        32        31
        42        43        33        32
        43        44        34        33
        44        45        35        34
        45        46        36        35
        46        47        37        36
        47        48        38        37
        48        49        39        38
        49        50        40        39
        51        52        42        41
        52        53        43        42
        53        54        44        43
        54        55        45        44
        55        56        46        45
        56        57        47        46
        57        58        48        47
        58        59        49        48
        59        60        50        49
        61        62        52        51
        62        63        53        52
        63        64        54        53
        64        65        55        54
        65        66        56        55
        66        67        57        56
        67        68        58        57
        68        69        59        58
        69        70        60        59
        71        72        62        61
        72        73        63        62
        73        74        64        63
        74        75        65        64
        75        76        66        65
        76        77        67        66
        77        78        68        67
        78        79        69        68
        79        80        70        69
        81        82        72        71
        82        83        73        72
        83        84        74        73
        84        85        75        74
        85        86        76        75
        86        87        77        76
        87        88        78        77
        88        89        79        78
        89        90        80        79
        91        82        81        92
        93        83        82        91
        94        84        83        93
        95        85        84        94
        96        86        85        95
        97        87        86        96
        98        88        87        97
        99        89        88        98
        90        89        99       100
part
        11
inlet
coordinates
        10
 0.00000e+00
 0.00000e+00
 0.00000e+00
 0.00000e+00
 0.00000e+00
 0.00000e+00
 0.00000e+00
 0.00000e+00
 0.00000e+00
 0.00000e+00
 1.11111e-01
 0.00000e+00
 2.22222e-01
 3.33333e-01
 4.44444e-01
 5.55556e-01
 6.66667e-01
 7.77778e-01
 8.88889e-01
 1.00000e+00
 0.00000e+00
 0.00000e+00
 0.00000e+00
 0.00000e+00
 0.00000e+00
 0.00000e+00
 0.00000e+00
 0.00000e+00
 0.00000e+00
 0.00000e+00
bar2
         9
         1         2
         3         1
         4         3
         5         4
         6         5
         7         6
         8         7
         9         8
        10         9
part
        12
outlet
coordinates
        10
 1.00000e+00
 1.00000e+00
 1.00000e+00
 1.00000e+00
 1.00000e+00
 1.00000e+00
 1.00000e+00
 1.00000e+00
 1.00000e+00
 1.00000e+00
 0.00000e+00
 1.11111e-01
 2.22222e-01
 3.33333e-01
 4.44444e-01
 5.55556e-01
 6.66667e-01
 7.77778e-01
 8.88889e-01
 1.00000e+00
 0.00000e+00
 0.00000e+00
 0.00000e+00
 0.00000e+00
 0.00000e+00
 0.00000e+00
 0.00000e+00
 0.00000e+00
 0.00000e+00
 0.00000e+00
bar2
         9
         1         2
         2         3
         3         4
         4         5
         5         6
         6         7
         7         8
         8         9
         9        10
part
        13
top
coordinates
        10
 1.11111e-01
 0.00000e+00
 2.22222e-01
 3.33333e-01
 4.44444e-01
 5.55556e-01
 6.66667e-01
 7.77778e-01
 8.88889e-01
 1.00000e+00
 1.00000e+00
 1.00000e+00
 1.00000e+00
 1.00000e+00
 1.00000e+00
 1.00000e+00
 1.00000e+00
 1.00000e+00
 1.00000e+00
 1.00000e+00
 0.00000e+00
 0.00000e+00
 0.00000e+00
 0.00000e+00
 0.00000e+00
 0.00000e+00
 0.00000e+00
 0.00000e+00
 0.00000e+00
 0.00000e+00
bar2
         9
         1         2
         3         1
         4         3
         5         4
         6         5
         7         6
         8         7
         9         8
        10         9
part
        14
bottom
coordinates
        10
 0.00000e+00
 1.11111e-01
 2.22222e-01
 3.33333e-01
 4.44444e-01
 5.55556e-01
 6.66667e-01
 7.77778e-01
 8.88889e-01
 1.00000e+00
 0.00000e+00
 0.00000e+00
 0.00000e+00
 0.00000e+00
 0.00000e+00
 0.00000e+00
 0.00000e+00
 0.00000e+00
 0.00000e+00
 0.00000e+00
 0.00000e+00
 0.00000e+00
 0.00000e+00
 0.00000e+00
 0.00000e+00
 0.00000e+00
 0.00000e+00
 0.00000e+00
 0.00000e+00
 0.00000e+00
bar2
         9
         1         2
         2         3
         3         4
         4         5
         5         6
         6         7
         7         8
         8         9
         9        10
