$MeshFormat
2.2 0 8
$EndMeshFormat
$PhysicalNames
6
1 1 "left"
1 2 "right"
1 3 "down"
1 4 "up"
2 5 "outer"
2 6 "inner"
$EndPhysicalNames
$Nodes
16
1 0.5 0.5 0
2 -0.5 0.5 0
3 -0.5 -0.5 0
4 0.5 -0.5 0
5 0.1666666666666667 0.5 0
6 -0.1666666666666667 0.5 0
7 0.1666666666666667 0.1666666666666667 0
8 -0.1666666666666667 0.1666666666666667 0
9 0.1666666666666667 -0.1666666666666667 0
10 -0.1666666666666667 -0.1666666666666667 0
11 0.1666666666666667 -0.5 0
12 -0.1666666666666667 -0.5 0
13 0.5 0.1666666666666667 0
14 0.5 -0.1666666666666667 0
15 -0.5 0.1666666666666667 0
16 -0.5 -0.1666666666666667 0
$EndNodes
$Elements
21
1 1 2 4 1 1 5
2 1 2 3 5 11 4
3 1 2 4 7 5 6
4 1 2 3 13 12 11
5 1 2 3 14 12 3
6 1 2 4 16 2 6
7 1 2 1 17 2 15
8 1 2 1 19 15 16
9 1 2 1 21 16 3
10 1 2 2 23 14 4
11 1 2 2 24 14 13
12 1 2 2 26 13 1
13 3 2 5 28 2 6 8 15
14 3 2 5 30 5 6 8 7
15 3 2 5 32 1 5 7 13
16 3 2 5 34 15 8 10 16
17 3 2 5 36 16 10 12 3
18 3 2 5 38 10 9 11 12
19 3 2 5 40 9 11 4 14
20 3 2 5 42 7 13 14 9
21 3 2 6 44 8 7 9 10
$EndElements
