#1:iter	2:compliance	3:duration	4:volume	5:lambda	6:lambda_iters	7:lower	8:upper
0 	5.08163 	0.26 	0.3 	0 	0 	0 	0
1 	2.10647 	0.023 	0.3 	12.0122 	28 	12.0118 	12.0122
2 	1.20099 	0.022 	0.299252 	6.00613 	19 	6.0061 	6.00613
3 	0.793494 	0.021 	0.3 	3.67786 	28 	3.67764 	3.67786
4 	0.665275 	0.021 	0.29515 	1.83895 	18 	1.83893 	1.83895
5 	0.653566 	0.022 	0.3 	0.824589 	27 	0.824452 	0.824589
6 	0.649621 	0.019 	0.3 	0.962491 	11 	0.962491 	0.963095
7 	0.647454 	0.021 	0.3 	0.999383 	11 	0.999383 	1.00009
8 	0.646014 	0.022 	0.3 	1.00159 	15 	1.00155 	1.00159
9 	0.644921 	0.023 	0.300001 	1.00239 	13 	1.00239 	1.00257
10 	0.644016 	0.022 	0.299999 	1.00245 	13 	1.00227 	1.00245
