[Info]
Version 1
Dimension 2
NumNodes 76
Num3DElements 0
Num2DElements 46
Num1DElements 42
NumNodeBC 1
NumSaveNodes 0
NumSaveElements 0
Num 2d-line      : 42
Num 2d-line,quad : 0
Num 3d-line      : 0
Num 3d-line,quad : 0
Num triangle     : 0
Num triangle,quad: 0
Num quadr        : 46
Num quadr,quad   : 0
Num tetra        : 0
Num tetra,quad   : 0
Num brick        : 0
Num brick,quad   : 0
Num pyramid      : 0
Num pyramid,quad : 0
Num wedge        : 0
Num wedge,quad   : 0

[Nodes]
#NodeNr x-coord y-coord z-coord
       1  1.0000000000000e-03 -1.5000000000000e-03  0.0000000000000e+00
       2  2.1000000000000e-02 -1.5000000000000e-03  0.0000000000000e+00
       3  3.0000000000000e-03 -1.5000000000000e-03  0.0000000000000e+00
       4  5.0000000000000e-03 -1.5000000000000e-03  0.0000000000000e+00
       5  7.0000000000000e-03 -1.5000000000000e-03  0.0000000000000e+00
       6  9.0000000000000e-03 -1.5000000000000e-03  0.0000000000000e+00
       7  1.1000000000000e-02 -1.5000000000000e-03  0.0000000000000e+00
       8  1.3000000000000e-02 -1.5000000000000e-03  0.0000000000000e+00
       9  1.5000000000000e-02 -1.5000000000000e-03  0.0000000000000e+00
      10  1.7000000000000e-02 -1.5000000000000e-03  0.0000000000000e+00
      11  1.9000000000000e-02 -1.5000000000000e-03  0.0000000000000e+00
      12  2.1000000000000e-02 -1.0000000000000e-03  0.0000000000000e+00
      13  1.0000000000000e-03 -1.0000000000000e-03  0.0000000000000e+00
      14  1.9000000000000e-02 -1.0000000000000e-03  0.0000000000000e+00
      15  1.7000000000000e-02 -1.0000000000000e-03  0.0000000000000e+00
      16  1.5000000000000e-02 -1.0000000000000e-03  0.0000000000000e+00
      17  1.3000000000000e-02 -1.0000000000000e-03  0.0000000000000e+00
      18  1.1000000000000e-02 -1.0000000000000e-03  0.0000000000000e+00
      19  9.0000000000000e-03 -1.0000000000000e-03  0.0000000000000e+00
      20  7.0000000000000e-03 -1.0000000000000e-03  0.0000000000000e+00
      21  5.0000000000000e-03 -1.0000000000000e-03  0.0000000000000e+00
      22  3.0000000000000e-03 -1.0000000000000e-03  0.0000000000000e+00
      23  1.0000000000000e-03  1.0000000000000e-03  0.0000000000000e+00
      24  2.1000000000000e-02  1.0000000000000e-03  0.0000000000000e+00
      25  3.0000000000000e-03  1.0000000000000e-03  0.0000000000000e+00
      26  5.0000000000000e-03  1.0000000000000e-03  0.0000000000000e+00
      27  7.0000000000000e-03  1.0000000000000e-03  0.0000000000000e+00
      28  9.0000000000000e-03  1.0000000000000e-03  0.0000000000000e+00
      29  1.1000000000000e-02  1.0000000000000e-03  0.0000000000000e+00
      30  1.3000000000000e-02  1.0000000000000e-03  0.0000000000000e+00
      31  1.5000000000000e-02  1.0000000000000e-03  0.0000000000000e+00
      32  1.7000000000000e-02  1.0000000000000e-03  0.0000000000000e+00
      33  1.9000000000000e-02  1.0000000000000e-03  0.0000000000000e+00
      34  2.1000000000000e-02  1.5000000000000e-03  0.0000000000000e+00
      35  1.0000000000000e-03  1.5000000000000e-03  0.0000000000000e+00
      36  1.9000000000000e-02  1.5000000000000e-03  0.0000000000000e+00
      37  1.7000000000000e-02  1.5000000000000e-03  0.0000000000000e+00
      38  1.5000000000000e-02  1.5000000000000e-03  0.0000000000000e+00
      39  1.3000000000000e-02  1.5000000000000e-03  0.0000000000000e+00
      40  1.1000000000000e-02  1.5000000000000e-03  0.0000000000000e+00
      41  9.0000000000000e-03  1.5000000000000e-03  0.0000000000000e+00
      42  7.0000000000000e-03  1.5000000000000e-03  0.0000000000000e+00
      43  5.0000000000000e-03  1.5000000000000e-03  0.0000000000000e+00
      44  3.0000000000000e-03  1.5000000000000e-03  0.0000000000000e+00
      45  0.0000000000000e+00 -1.0000000000000e-03  0.0000000000000e+00
      46  5.0000000000000e-02 -1.0000000000000e-03  0.0000000000000e+00
      47  4.8066666666670e-02 -1.0000000000000e-03  0.0000000000000e+00
      48  4.6133333333330e-02 -1.0000000000000e-03  0.0000000000000e+00
      49  4.4200000000000e-02 -1.0000000000000e-03  0.0000000000000e+00
      50  4.2266666666670e-02 -1.0000000000000e-03  0.0000000000000e+00
      51  4.0333333333330e-02 -1.0000000000000e-03  0.0000000000000e+00
      52  3.8400000000000e-02 -1.0000000000000e-03  0.0000000000000e+00
      53  3.6466666666670e-02 -1.0000000000000e-03  0.0000000000000e+00
      54  3.4533333333330e-02 -1.0000000000000e-03  0.0000000000000e+00
      55  3.2600000000000e-02 -1.0000000000000e-03  0.0000000000000e+00
      56  3.0666666666670e-02 -1.0000000000000e-03  0.0000000000000e+00
      57  2.8733333333330e-02 -1.0000000000000e-03  0.0000000000000e+00
      58  2.6800000000000e-02 -1.0000000000000e-03  0.0000000000000e+00
      59  2.4866666666670e-02 -1.0000000000000e-03  0.0000000000000e+00
      60  2.2933333333330e-02 -1.0000000000000e-03  0.0000000000000e+00
      61  5.0000000000000e-02  1.0000000000000e-03  0.0000000000000e+00
      62  4.8066666666670e-02  1.0000000000000e-03  0.0000000000000e+00
      63  4.6133333333330e-02  1.0000000000000e-03  0.0000000000000e+00
      64  4.4200000000000e-02  1.0000000000000e-03  0.0000000000000e+00
      65  4.2266666666670e-02  1.0000000000000e-03  0.0000000000000e+00
      66  4.0333333333330e-02  1.0000000000000e-03  0.0000000000000e+00
      67  3.8400000000000e-02  1.0000000000000e-03  0.0000000000000e+00
      68  3.6466666666670e-02  1.0000000000000e-03  0.0000000000000e+00
      69  3.4533333333330e-02  1.0000000000000e-03  0.0000000000000e+00
      70  3.2600000000000e-02  1.0000000000000e-03  0.0000000000000e+00
      71  3.0666666666670e-02  1.0000000000000e-03  0.0000000000000e+00
      72  2.8733333333330e-02  1.0000000000000e-03  0.0000000000000e+00
      73  2.6800000000000e-02  1.0000000000000e-03  0.0000000000000e+00
      74  2.4866666666670e-02  1.0000000000000e-03  0.0000000000000e+00
      75  2.2933333333330e-02  1.0000000000000e-03  0.0000000000000e+00
      76  0.0000000000000e+00  1.0000000000000e-03  0.0000000000000e+00

[3D Elements]
#ElemNr  ElemType  NrOfNodes  Level
#Node1 Node2 ... NodeNrOfNodes

[2D Elements]
#ElemNr  ElemType  NrOfNodes  Level
#Node1 Node2 ... NodeNrOfNodes
21 6 4 bar
47 46 61 62
22 6 4 bar
62 63 48 47
23 6 4 bar
63 64 49 48
24 6 4 bar
64 65 50 49
25 6 4 bar
65 66 51 50
26 6 4 bar
66 67 52 51
27 6 4 bar
67 68 53 52
28 6 4 bar
68 69 54 53
29 6 4 bar
69 70 55 54
30 6 4 bar
70 71 56 55
31 6 4 bar
71 72 57 56
32 6 4 bar
72 73 58 57
33 6 4 bar
73 74 59 58
34 6 4 bar
74 75 60 59
35 6 4 bar
75 24 12 60
36 6 4 bar
24 33 14 12
37 6 4 bar
33 32 15 14
38 6 4 bar
32 31 16 15
39 6 4 bar
31 30 17 16
40 6 4 bar
30 29 18 17
41 6 4 bar
29 28 19 18
42 6 4 bar
28 27 20 19
43 6 4 bar
27 26 21 20
44 6 4 bar
26 25 22 21
45 6 4 bar
25 23 13 22
46 6 4 bar
13 23 76 45
11 6 4 piezo-top
23 25 44 35
12 6 4 piezo-top
25 26 43 44
13 6 4 piezo-top
26 27 42 43
14 6 4 piezo-top
27 28 41 42
15 6 4 piezo-top
28 29 40 41
16 6 4 piezo-top
29 30 39 40
17 6 4 piezo-top
30 31 38 39
18 6 4 piezo-top
31 32 37 38
19 6 4 piezo-top
32 33 36 37
20 6 4 piezo-top
33 24 34 36
1 6 4 piezo-bot
1 3 22 13
2 6 4 piezo-bot
3 4 21 22
3 6 4 piezo-bot
4 5 20 21
4 6 4 piezo-bot
5 6 19 20
5 6 4 piezo-bot
6 7 18 19
6 6 4 piezo-bot
7 8 17 18
7 6 4 piezo-bot
8 9 16 17
8 6 4 piezo-bot
9 10 15 16
9 6 4 piezo-bot
10 11 14 15
10 6 4 piezo-bot
11 2 12 14

[1D Elements]
#ElemNr  ElemType  NrOfNodes  Level
#Node1 Node2 ... NodeNrOfNodes
48 100 2 left
76 45
47 100 2 right
46 61
59 100 2 gnd
12 14
60 100 2 gnd
14 15
61 100 2 gnd
15 16
62 100 2 gnd
16 17
63 100 2 gnd
17 18
64 100 2 gnd
18 19
65 100 2 gnd
19 20
66 100 2 gnd
20 21
67 100 2 gnd
21 22
68 100 2 gnd
22 13
69 100 2 gnd
23 25
70 100 2 gnd
25 26
71 100 2 gnd
26 27
72 100 2 gnd
27 28
73 100 2 gnd
28 29
74 100 2 gnd
29 30
75 100 2 gnd
30 31
76 100 2 gnd
31 32
77 100 2 gnd
32 33
78 100 2 gnd
33 24
49 100 2 hot
1 3
50 100 2 hot
3 4
51 100 2 hot
4 5
52 100 2 hot
5 6
53 100 2 hot
6 7
54 100 2 hot
7 8
55 100 2 hot
8 9
56 100 2 hot
9 10
57 100 2 hot
10 11
58 100 2 hot
11 2
79 100 2 hot
34 36
80 100 2 hot
36 37
81 100 2 hot
37 38
82 100 2 hot
38 39
83 100 2 hot
39 40
84 100 2 hot
40 41
85 100 2 hot
41 42
86 100 2 hot
42 43
87 100 2 hot
43 44
88 100 2 hot
44 35

[Node BC]
#NodeNr Level
      61 hist

[Save Nodes]
#NodeNr Level

[Save Elements]
#ElemNr Level

