[Info]
Version 1
Dimension 3
NumNodes 252
Num3DElements 150
Num2DElements 170
Num1DElements 0
NumNodeBC 240
NumSaveNodes 0
NumSaveElements 0
Num 2d-line      : 0
Num 2d-line,quad : 0
Num 3d-line      : 0
Num 3d-line,quad : 0
Num triangle     : 0
Num triangle,quad: 0
Num quadr        : 170
Num quadr,quad   : 0
Num tetra        : 0
Num tetra,quad   : 0
Num brick        : 150
Num brick,quad   : 0
Num pyramid      : 0
Num pyramid,quad : 0
Num wedge        : 0
Num wedge,quad   : 0

[Nodes]
#NodeNr x-coord y-coord z-coord
       1  0.0000000000000e+00  0.0000000000000e+00  0.0000000000000e+00
       2  1.0000000000000e+00  0.0000000000000e+00  0.0000000000000e+00
       3  1.0000000000000e+00  1.0000000000000e+00  0.0000000000000e+00
       4  0.0000000000000e+00  1.0000000000000e+00  0.0000000000000e+00
       5  5.0000000000000e+00  0.0000000000000e+00  0.0000000000000e+00
       6  2.0000000000000e+00  0.0000000000000e+00  0.0000000000000e+00
       7  3.0000000000000e+00  0.0000000000000e+00  0.0000000000000e+00
       8  4.0000000000000e+00  0.0000000000000e+00  0.0000000000000e+00
       9  5.0000000000000e+00  1.0000000000000e+00  0.0000000000000e+00
      10  4.0000000000000e+00  1.0000000000000e+00  0.0000000000000e+00
      11  3.0000000000000e+00  1.0000000000000e+00  0.0000000000000e+00
      12  2.0000000000000e+00  1.0000000000000e+00  0.0000000000000e+00
      13  1.0000000000000e+00  5.0000000000000e+00  0.0000000000000e+00
      14  1.0000000000000e+00  2.0000000000000e+00  0.0000000000000e+00
      15  1.0000000000000e+00  3.0000000000000e+00  0.0000000000000e+00
      16  1.0000000000000e+00  4.0000000000000e+00  0.0000000000000e+00
      17  0.0000000000000e+00  5.0000000000000e+00  0.0000000000000e+00
      18  0.0000000000000e+00  4.0000000000000e+00  0.0000000000000e+00
      19  0.0000000000000e+00  3.0000000000000e+00  0.0000000000000e+00
      20  0.0000000000000e+00  2.0000000000000e+00  0.0000000000000e+00
      21  5.0000000000000e+00  5.0000000000000e+00  0.0000000000000e+00
      22  5.0000000000000e+00  2.0000000000000e+00  0.0000000000000e+00
      23  5.0000000000000e+00  3.0000000000000e+00  0.0000000000000e+00
      24  5.0000000000000e+00  4.0000000000000e+00  0.0000000000000e+00
      25  4.0000000000000e+00  5.0000000000000e+00  0.0000000000000e+00
      26  3.0000000000000e+00  5.0000000000000e+00  0.0000000000000e+00
      27  2.0000000000000e+00  5.0000000000000e+00  0.0000000000000e+00
      28  2.0000000000000e+00  2.0000000000000e+00  0.0000000000000e+00
      29  2.0000000000000e+00  3.0000000000000e+00  0.0000000000000e+00
      30  2.0000000000000e+00  4.0000000000000e+00  0.0000000000000e+00
      31  3.0000000000000e+00  2.0000000000000e+00  0.0000000000000e+00
      32  3.0000000000000e+00  3.0000000000000e+00  0.0000000000000e+00
      33  3.0000000000000e+00  4.0000000000000e+00  0.0000000000000e+00
      34  4.0000000000000e+00  2.0000000000000e+00  0.0000000000000e+00
      35  4.0000000000000e+00  3.0000000000000e+00  0.0000000000000e+00
      36  4.0000000000000e+00  4.0000000000000e+00  0.0000000000000e+00
      37  0.0000000000000e+00  0.0000000000000e+00  3.0000000000000e+00
      38  1.0000000000000e+00  0.0000000000000e+00  3.0000000000000e+00
      39  1.0000000000000e+00  1.0000000000000e+00  3.0000000000000e+00
      40  0.0000000000000e+00  1.0000000000000e+00  3.0000000000000e+00
      41  0.0000000000000e+00  0.0000000000000e+00  1.0000000000000e+00
      42  0.0000000000000e+00  0.0000000000000e+00  2.0000000000000e+00
      43  1.0000000000000e+00  0.0000000000000e+00  1.0000000000000e+00
      44  1.0000000000000e+00  0.0000000000000e+00  2.0000000000000e+00
      45  1.0000000000000e+00  1.0000000000000e+00  1.0000000000000e+00
      46  1.0000000000000e+00  1.0000000000000e+00  2.0000000000000e+00
      47  0.0000000000000e+00  1.0000000000000e+00  1.0000000000000e+00
      48  0.0000000000000e+00  1.0000000000000e+00  2.0000000000000e+00
      49  5.0000000000000e+00  0.0000000000000e+00  3.0000000000000e+00
      50  2.0000000000000e+00  0.0000000000000e+00  3.0000000000000e+00
      51  3.0000000000000e+00  0.0000000000000e+00  3.0000000000000e+00
      52  4.0000000000000e+00  0.0000000000000e+00  3.0000000000000e+00
      53  5.0000000000000e+00  1.0000000000000e+00  3.0000000000000e+00
      54  4.0000000000000e+00  1.0000000000000e+00  3.0000000000000e+00
      55  3.0000000000000e+00  1.0000000000000e+00  3.0000000000000e+00
      56  2.0000000000000e+00  1.0000000000000e+00  3.0000000000000e+00
      57  5.0000000000000e+00  0.0000000000000e+00  1.0000000000000e+00
      58  5.0000000000000e+00  0.0000000000000e+00  2.0000000000000e+00
      59  5.0000000000000e+00  1.0000000000000e+00  1.0000000000000e+00
      60  5.0000000000000e+00  1.0000000000000e+00  2.0000000000000e+00
      61  2.0000000000000e+00  0.0000000000000e+00  1.0000000000000e+00
      62  2.0000000000000e+00  0.0000000000000e+00  2.0000000000000e+00
      63  3.0000000000000e+00  0.0000000000000e+00  1.0000000000000e+00
      64  3.0000000000000e+00  0.0000000000000e+00  2.0000000000000e+00
      65  4.0000000000000e+00  0.0000000000000e+00  1.0000000000000e+00
      66  4.0000000000000e+00  0.0000000000000e+00  2.0000000000000e+00
      67  4.0000000000000e+00  1.0000000000000e+00  1.0000000000000e+00
      68  4.0000000000000e+00  1.0000000000000e+00  2.0000000000000e+00
      69  3.0000000000000e+00  1.0000000000000e+00  1.0000000000000e+00
      70  3.0000000000000e+00  1.0000000000000e+00  2.0000000000000e+00
      71  2.0000000000000e+00  1.0000000000000e+00  1.0000000000000e+00
      72  2.0000000000000e+00  1.0000000000000e+00  2.0000000000000e+00
      73  1.0000000000000e+00  5.0000000000000e+00  3.0000000000000e+00
      74  1.0000000000000e+00  2.0000000000000e+00  3.0000000000000e+00
      75  1.0000000000000e+00  3.0000000000000e+00  3.0000000000000e+00
      76  1.0000000000000e+00  4.0000000000000e+00  3.0000000000000e+00
      77  0.0000000000000e+00  5.0000000000000e+00  3.0000000000000e+00
      78  0.0000000000000e+00  4.0000000000000e+00  3.0000000000000e+00
      79  0.0000000000000e+00  3.0000000000000e+00  3.0000000000000e+00
      80  0.0000000000000e+00  2.0000000000000e+00  3.0000000000000e+00
      81  1.0000000000000e+00  5.0000000000000e+00  1.0000000000000e+00
      82  1.0000000000000e+00  5.0000000000000e+00  2.0000000000000e+00
      83  0.0000000000000e+00  5.0000000000000e+00  1.0000000000000e+00
      84  0.0000000000000e+00  5.0000000000000e+00  2.0000000000000e+00
      85  1.0000000000000e+00  2.0000000000000e+00  1.0000000000000e+00
      86  1.0000000000000e+00  2.0000000000000e+00  2.0000000000000e+00
      87  1.0000000000000e+00  3.0000000000000e+00  1.0000000000000e+00
      88  1.0000000000000e+00  3.0000000000000e+00  2.0000000000000e+00
      89  1.0000000000000e+00  4.0000000000000e+00  1.0000000000000e+00
      90  1.0000000000000e+00  4.0000000000000e+00  2.0000000000000e+00
      91  0.0000000000000e+00  4.0000000000000e+00  1.0000000000000e+00
      92  0.0000000000000e+00  4.0000000000000e+00  2.0000000000000e+00
      93  0.0000000000000e+00  3.0000000000000e+00  1.0000000000000e+00
      94  0.0000000000000e+00  3.0000000000000e+00  2.0000000000000e+00
      95  0.0000000000000e+00  2.0000000000000e+00  1.0000000000000e+00
      96  0.0000000000000e+00  2.0000000000000e+00  2.0000000000000e+00
      97  5.0000000000000e+00  5.0000000000000e+00  3.0000000000000e+00
      98  5.0000000000000e+00  2.0000000000000e+00  3.0000000000000e+00
      99  5.0000000000000e+00  3.0000000000000e+00  3.0000000000000e+00
     100  5.0000000000000e+00  4.0000000000000e+00  3.0000000000000e+00
     101  4.0000000000000e+00  5.0000000000000e+00  3.0000000000000e+00
     102  3.0000000000000e+00  5.0000000000000e+00  3.0000000000000e+00
     103  2.0000000000000e+00  5.0000000000000e+00  3.0000000000000e+00
     104  2.0000000000000e+00  2.0000000000000e+00  3.0000000000000e+00
     105  2.0000000000000e+00  3.0000000000000e+00  3.0000000000000e+00
     106  2.0000000000000e+00  4.0000000000000e+00  3.0000000000000e+00
     107  3.0000000000000e+00  2.0000000000000e+00  3.0000000000000e+00
     108  3.0000000000000e+00  3.0000000000000e+00  3.0000000000000e+00
     109  3.0000000000000e+00  4.0000000000000e+00  3.0000000000000e+00
     110  4.0000000000000e+00  2.0000000000000e+00  3.0000000000000e+00
     111  4.0000000000000e+00  3.0000000000000e+00  3.0000000000000e+00
     112  4.0000000000000e+00  4.0000000000000e+00  3.0000000000000e+00
     113  5.0000000000000e+00  5.0000000000000e+00  1.0000000000000e+00
     114  5.0000000000000e+00  5.0000000000000e+00  2.0000000000000e+00
     115  5.0000000000000e+00  2.0000000000000e+00  1.0000000000000e+00
     116  5.0000000000000e+00  2.0000000000000e+00  2.0000000000000e+00
     117  5.0000000000000e+00  3.0000000000000e+00  1.0000000000000e+00
     118  5.0000000000000e+00  3.0000000000000e+00  2.0000000000000e+00
     119  5.0000000000000e+00  4.0000000000000e+00  1.0000000000000e+00
     120  5.0000000000000e+00  4.0000000000000e+00  2.0000000000000e+00
     121  4.0000000000000e+00  5.0000000000000e+00  1.0000000000000e+00
     122  4.0000000000000e+00  5.0000000000000e+00  2.0000000000000e+00
     123  3.0000000000000e+00  5.0000000000000e+00  1.0000000000000e+00
     124  3.0000000000000e+00  5.0000000000000e+00  2.0000000000000e+00
     125  2.0000000000000e+00  5.0000000000000e+00  1.0000000000000e+00
     126  2.0000000000000e+00  5.0000000000000e+00  2.0000000000000e+00
     127  2.0000000000000e+00  2.0000000000000e+00  1.0000000000000e+00
     128  2.0000000000000e+00  2.0000000000000e+00  2.0000000000000e+00
     129  2.0000000000000e+00  3.0000000000000e+00  1.0000000000000e+00
     130  2.0000000000000e+00  3.0000000000000e+00  2.0000000000000e+00
     131  2.0000000000000e+00  4.0000000000000e+00  1.0000000000000e+00
     132  2.0000000000000e+00  4.0000000000000e+00  2.0000000000000e+00
     133  3.0000000000000e+00  2.0000000000000e+00  1.0000000000000e+00
     134  3.0000000000000e+00  2.0000000000000e+00  2.0000000000000e+00
     135  3.0000000000000e+00  3.0000000000000e+00  1.0000000000000e+00
     136  3.0000000000000e+00  3.0000000000000e+00  2.0000000000000e+00
     137  3.0000000000000e+00  4.0000000000000e+00  1.0000000000000e+00
     138  3.0000000000000e+00  4.0000000000000e+00  2.0000000000000e+00
     139  4.0000000000000e+00  2.0000000000000e+00  1.0000000000000e+00
     140  4.0000000000000e+00  2.0000000000000e+00  2.0000000000000e+00
     141  4.0000000000000e+00  3.0000000000000e+00  1.0000000000000e+00
     142  4.0000000000000e+00  3.0000000000000e+00  2.0000000000000e+00
     143  4.0000000000000e+00  4.0000000000000e+00  1.0000000000000e+00
     144  4.0000000000000e+00  4.0000000000000e+00  2.0000000000000e+00
     145  0.0000000000000e+00  0.0000000000000e+00  6.0000000000000e+00
     146  1.0000000000000e+00  0.0000000000000e+00  6.0000000000000e+00
     147  1.0000000000000e+00  1.0000000000000e+00  6.0000000000000e+00
     148  0.0000000000000e+00  1.0000000000000e+00  6.0000000000000e+00
     149  0.0000000000000e+00  0.0000000000000e+00  4.0000000000000e+00
     150  0.0000000000000e+00  0.0000000000000e+00  5.0000000000000e+00
     151  1.0000000000000e+00  0.0000000000000e+00  4.0000000000000e+00
     152  1.0000000000000e+00  0.0000000000000e+00  5.0000000000000e+00
     153  1.0000000000000e+00  1.0000000000000e+00  4.0000000000000e+00
     154  1.0000000000000e+00  1.0000000000000e+00  5.0000000000000e+00
     155  0.0000000000000e+00  1.0000000000000e+00  4.0000000000000e+00
     156  0.0000000000000e+00  1.0000000000000e+00  5.0000000000000e+00
     157  5.0000000000000e+00  0.0000000000000e+00  6.0000000000000e+00
     158  2.0000000000000e+00  0.0000000000000e+00  6.0000000000000e+00
     159  3.0000000000000e+00  0.0000000000000e+00  6.0000000000000e+00
     160  4.0000000000000e+00  0.0000000000000e+00  6.0000000000000e+00
     161  5.0000000000000e+00  1.0000000000000e+00  6.0000000000000e+00
     162  4.0000000000000e+00  1.0000000000000e+00  6.0000000000000e+00
     163  3.0000000000000e+00  1.0000000000000e+00  6.0000000000000e+00
     164  2.0000000000000e+00  1.0000000000000e+00  6.0000000000000e+00
     165  5.0000000000000e+00  0.0000000000000e+00  4.0000000000000e+00
     166  5.0000000000000e+00  0.0000000000000e+00  5.0000000000000e+00
     167  5.0000000000000e+00  1.0000000000000e+00  4.0000000000000e+00
     168  5.0000000000000e+00  1.0000000000000e+00  5.0000000000000e+00
     169  2.0000000000000e+00  0.0000000000000e+00  4.0000000000000e+00
     170  2.0000000000000e+00  0.0000000000000e+00  5.0000000000000e+00
     171  3.0000000000000e+00  0.0000000000000e+00  4.0000000000000e+00
     172  3.0000000000000e+00  0.0000000000000e+00  5.0000000000000e+00
     173  4.0000000000000e+00  0.0000000000000e+00  4.0000000000000e+00
     174  4.0000000000000e+00  0.0000000000000e+00  5.0000000000000e+00
     175  4.0000000000000e+00  1.0000000000000e+00  4.0000000000000e+00
     176  4.0000000000000e+00  1.0000000000000e+00  5.0000000000000e+00
     177  3.0000000000000e+00  1.0000000000000e+00  4.0000000000000e+00
     178  3.0000000000000e+00  1.0000000000000e+00  5.0000000000000e+00
     179  2.0000000000000e+00  1.0000000000000e+00  4.0000000000000e+00
     180  2.0000000000000e+00  1.0000000000000e+00  5.0000000000000e+00
     181  1.0000000000000e+00  5.0000000000000e+00  6.0000000000000e+00
     182  1.0000000000000e+00  2.0000000000000e+00  6.0000000000000e+00
     183  1.0000000000000e+00  3.0000000000000e+00  6.0000000000000e+00
     184  1.0000000000000e+00  4.0000000000000e+00  6.0000000000000e+00
     185  0.0000000000000e+00  5.0000000000000e+00  6.0000000000000e+00
     186  0.0000000000000e+00  4.0000000000000e+00  6.0000000000000e+00
     187  0.0000000000000e+00  3.0000000000000e+00  6.0000000000000e+00
     188  0.0000000000000e+00  2.0000000000000e+00  6.0000000000000e+00
     189  1.0000000000000e+00  5.0000000000000e+00  4.0000000000000e+00
     190  1.0000000000000e+00  5.0000000000000e+00  5.0000000000000e+00
     191  0.0000000000000e+00  5.0000000000000e+00  4.0000000000000e+00
     192  0.0000000000000e+00  5.0000000000000e+00  5.0000000000000e+00
     193  1.0000000000000e+00  2.0000000000000e+00  4.0000000000000e+00
     194  1.0000000000000e+00  2.0000000000000e+00  5.0000000000000e+00
     195  1.0000000000000e+00  3.0000000000000e+00  4.0000000000000e+00
     196  1.0000000000000e+00  3.0000000000000e+00  5.0000000000000e+00
     197  1.0000000000000e+00  4.0000000000000e+00  4.0000000000000e+00
     198  1.0000000000000e+00  4.0000000000000e+00  5.0000000000000e+00
     199  0.0000000000000e+00  4.0000000000000e+00  4.0000000000000e+00
     200  0.0000000000000e+00  4.0000000000000e+00  5.0000000000000e+00
     201  0.0000000000000e+00  3.0000000000000e+00  4.0000000000000e+00
     202  0.0000000000000e+00  3.0000000000000e+00  5.0000000000000e+00
     203  0.0000000000000e+00  2.0000000000000e+00  4.0000000000000e+00
     204  0.0000000000000e+00  2.0000000000000e+00  5.0000000000000e+00
     205  5.0000000000000e+00  5.0000000000000e+00  6.0000000000000e+00
     206  5.0000000000000e+00  2.0000000000000e+00  6.0000000000000e+00
     207  5.0000000000000e+00  3.0000000000000e+00  6.0000000000000e+00
     208  5.0000000000000e+00  4.0000000000000e+00  6.0000000000000e+00
     209  4.0000000000000e+00  5.0000000000000e+00  6.0000000000000e+00
     210  3.0000000000000e+00  5.0000000000000e+00  6.0000000000000e+00
     211  2.0000000000000e+00  5.0000000000000e+00  6.0000000000000e+00
     212  2.0000000000000e+00  2.0000000000000e+00  6.0000000000000e+00
     213  2.0000000000000e+00  3.0000000000000e+00  6.0000000000000e+00
     214  2.0000000000000e+00  4.0000000000000e+00  6.0000000000000e+00
     215  3.0000000000000e+00  2.0000000000000e+00  6.0000000000000e+00
     216  3.0000000000000e+00  3.0000000000000e+00  6.0000000000000e+00
     217  3.0000000000000e+00  4.0000000000000e+00  6.0000000000000e+00
     218  4.0000000000000e+00  2.0000000000000e+00  6.0000000000000e+00
     219  4.0000000000000e+00  3.0000000000000e+00  6.0000000000000e+00
     220  4.0000000000000e+00  4.0000000000000e+00  6.0000000000000e+00
     221  5.0000000000000e+00  5.0000000000000e+00  4.0000000000000e+00
     222  5.0000000000000e+00  5.0000000000000e+00  5.0000000000000e+00
     223  5.0000000000000e+00  2.0000000000000e+00  4.0000000000000e+00
     224  5.0000000000000e+00  2.0000000000000e+00  5.0000000000000e+00
     225  5.0000000000000e+00  3.0000000000000e+00  4.0000000000000e+00
     226  5.0000000000000e+00  3.0000000000000e+00  5.0000000000000e+00
     227  5.0000000000000e+00  4.0000000000000e+00  4.0000000000000e+00
     228  5.0000000000000e+00  4.0000000000000e+00  5.0000000000000e+00
     229  4.0000000000000e+00  5.0000000000000e+00  4.0000000000000e+00
     230  4.0000000000000e+00  5.0000000000000e+00  5.0000000000000e+00
     231  3.0000000000000e+00  5.0000000000000e+00  4.0000000000000e+00
     232  3.0000000000000e+00  5.0000000000000e+00  5.0000000000000e+00
     233  2.0000000000000e+00  5.0000000000000e+00  4.0000000000000e+00
     234  2.0000000000000e+00  5.0000000000000e+00  5.0000000000000e+00
     235  2.0000000000000e+00  2.0000000000000e+00  4.0000000000000e+00
     236  2.0000000000000e+00  2.0000000000000e+00  5.0000000000000e+00
     237  2.0000000000000e+00  3.0000000000000e+00  4.0000000000000e+00
     238  2.0000000000000e+00  3.0000000000000e+00  5.0000000000000e+00
     239  2.0000000000000e+00  4.0000000000000e+00  4.0000000000000e+00
     240  2.0000000000000e+00  4.0000000000000e+00  5.0000000000000e+00
     241  3.0000000000000e+00  2.0000000000000e+00  4.0000000000000e+00
     242  3.0000000000000e+00  2.0000000000000e+00  5.0000000000000e+00
     243  3.0000000000000e+00  3.0000000000000e+00  4.0000000000000e+00
     244  3.0000000000000e+00  3.0000000000000e+00  5.0000000000000e+00
     245  3.0000000000000e+00  4.0000000000000e+00  4.0000000000000e+00
     246  3.0000000000000e+00  4.0000000000000e+00  5.0000000000000e+00
     247  4.0000000000000e+00  2.0000000000000e+00  4.0000000000000e+00
     248  4.0000000000000e+00  2.0000000000000e+00  5.0000000000000e+00
     249  4.0000000000000e+00  3.0000000000000e+00  4.0000000000000e+00
     250  4.0000000000000e+00  3.0000000000000e+00  5.0000000000000e+00
     251  4.0000000000000e+00  4.0000000000000e+00  4.0000000000000e+00
     252  4.0000000000000e+00  4.0000000000000e+00  5.0000000000000e+00

[3D Elements]
#ElemNr  ElemType  NrOfNodes  Level
#Node1 Node2 ... NodeNrOfNodes
26 10 8 coil
1 2 3 4 41 43 45 47
27 10 8 coil
41 43 45 47 42 44 46 48
28 10 8 coil
42 44 46 48 37 38 39 40
101 10 8 coil
37 38 39 40 149 151 153 155
102 10 8 coil
149 151 153 155 150 152 154 156
103 10 8 coil
150 152 154 156 145 146 147 148
29 10 8 air
2 6 12 3 43 61 71 45
30 10 8 air
43 61 71 45 44 62 72 46
31 10 8 air
44 62 72 46 38 50 56 39
32 10 8 air
6 7 11 12 61 63 69 71
33 10 8 air
61 63 69 71 62 64 70 72
34 10 8 air
62 64 70 72 50 51 55 56
35 10 8 air
7 8 10 11 63 65 67 69
36 10 8 air
63 65 67 69 64 66 68 70
37 10 8 air
64 66 68 70 51 52 54 55
38 10 8 air
8 5 9 10 65 57 59 67
39 10 8 air
65 57 59 67 66 58 60 68
40 10 8 air
66 58 60 68 52 49 53 54
41 10 8 air
4 3 14 20 47 45 85 95
42 10 8 air
47 45 85 95 48 46 86 96
43 10 8 air
48 46 86 96 40 39 74 80
44 10 8 air
20 14 15 19 95 85 87 93
45 10 8 air
95 85 87 93 96 86 88 94
46 10 8 air
96 86 88 94 80 74 75 79
47 10 8 air
19 15 16 18 93 87 89 91
48 10 8 air
93 87 89 91 94 88 90 92
49 10 8 air
94 88 90 92 79 75 76 78
50 10 8 air
18 16 13 17 91 89 81 83
51 10 8 air
91 89 81 83 92 90 82 84
52 10 8 air
92 90 82 84 78 76 73 77
53 10 8 air
3 12 28 14 45 71 127 85
54 10 8 air
45 71 127 85 46 72 128 86
55 10 8 air
46 72 128 86 39 56 104 74
56 10 8 air
12 11 31 28 71 69 133 127
57 10 8 air
71 69 133 127 72 70 134 128
58 10 8 air
72 70 134 128 56 55 107 104
59 10 8 air
11 10 34 31 69 67 139 133
60 10 8 air
69 67 139 133 70 68 140 134
61 10 8 air
70 68 140 134 55 54 110 107
62 10 8 air
10 9 22 34 67 59 115 139
63 10 8 air
67 59 115 139 68 60 116 140
64 10 8 air
68 60 116 140 54 53 98 110
65 10 8 air
14 28 29 15 85 127 129 87
66 10 8 air
85 127 129 87 86 128 130 88
67 10 8 air
86 128 130 88 74 104 105 75
68 10 8 air
28 31 32 29 127 133 135 129
69 10 8 air
127 133 135 129 128 134 136 130
70 10 8 air
128 134 136 130 104 107 108 105
71 10 8 air
31 34 35 32 133 139 141 135
72 10 8 air
133 139 141 135 134 140 142 136
73 10 8 air
134 140 142 136 107 110 111 108
74 10 8 air
34 22 23 35 139 115 117 141
75 10 8 air
139 115 117 141 140 116 118 142
76 10 8 air
140 116 118 142 110 98 99 111
77 10 8 air
15 29 30 16 87 129 131 89
78 10 8 air
87 129 131 89 88 130 132 90
79 10 8 air
88 130 132 90 75 105 106 76
80 10 8 air
29 32 33 30 129 135 137 131
81 10 8 air
129 135 137 131 130 136 138 132
82 10 8 air
130 136 138 132 105 108 109 106
83 10 8 air
32 35 36 33 135 141 143 137
84 10 8 air
135 141 143 137 136 142 144 138
85 10 8 air
136 142 144 138 108 111 112 109
86 10 8 air
35 23 24 36 141 117 119 143
87 10 8 air
141 117 119 143 142 118 120 144
88 10 8 air
142 118 120 144 111 99 100 112
89 10 8 air
16 30 27 13 89 131 125 81
90 10 8 air
89 131 125 81 90 132 126 82
91 10 8 air
90 132 126 82 76 106 103 73
92 10 8 air
30 33 26 27 131 137 123 125
93 10 8 air
131 137 123 125 132 138 124 126
94 10 8 air
132 138 124 126 106 109 102 103
95 10 8 air
33 36 25 26 137 143 121 123
96 10 8 air
137 143 121 123 138 144 122 124
97 10 8 air
138 144 122 124 109 112 101 102
98 10 8 air
36 24 21 25 143 119 113 121
99 10 8 air
143 119 113 121 144 120 114 122
100 10 8 air
144 120 114 122 112 100 97 101
104 10 8 air
38 50 56 39 151 169 179 153
105 10 8 air
151 169 179 153 152 170 180 154
106 10 8 air
152 170 180 154 146 158 164 147
107 10 8 air
50 51 55 56 169 171 177 179
108 10 8 air
169 171 177 179 170 172 178 180
109 10 8 air
170 172 178 180 158 159 163 164
110 10 8 air
51 52 54 55 171 173 175 177
111 10 8 air
171 173 175 177 172 174 176 178
112 10 8 air
172 174 176 178 159 160 162 163
113 10 8 air
52 49 53 54 173 165 167 175
114 10 8 air
173 165 167 175 174 166 168 176
115 10 8 air
174 166 168 176 160 157 161 162
116 10 8 air
40 39 74 80 155 153 193 203
117 10 8 air
155 153 193 203 156 154 194 204
118 10 8 air
156 154 194 204 148 147 182 188
119 10 8 air
80 74 75 79 203 193 195 201
120 10 8 air
203 193 195 201 204 194 196 202
121 10 8 air
204 194 196 202 188 182 183 187
122 10 8 air
79 75 76 78 201 195 197 199
123 10 8 air
201 195 197 199 202 196 198 200
124 10 8 air
202 196 198 200 187 183 184 186
125 10 8 air
78 76 73 77 199 197 189 191
126 10 8 air
199 197 189 191 200 198 190 192
127 10 8 air
200 198 190 192 186 184 181 185
128 10 8 air
39 56 104 74 153 179 235 193
129 10 8 air
153 179 235 193 154 180 236 194
130 10 8 air
154 180 236 194 147 164 212 182
131 10 8 air
56 55 107 104 179 177 241 235
132 10 8 air
179 177 241 235 180 178 242 236
133 10 8 air
180 178 242 236 164 163 215 212
134 10 8 air
55 54 110 107 177 175 247 241
135 10 8 air
177 175 247 241 178 176 248 242
136 10 8 air
178 176 248 242 163 162 218 215
137 10 8 air
54 53 98 110 175 167 223 247
138 10 8 air
175 167 223 247 176 168 224 248
139 10 8 air
176 168 224 248 162 161 206 218
140 10 8 air
74 104 105 75 193 235 237 195
141 10 8 air
193 235 237 195 194 236 238 196
142 10 8 air
194 236 238 196 182 212 213 183
143 10 8 air
104 107 108 105 235 241 243 237
144 10 8 air
235 241 243 237 236 242 244 238
145 10 8 air
236 242 244 238 212 215 216 213
146 10 8 air
107 110 111 108 241 247 249 243
147 10 8 air
241 247 249 243 242 248 250 244
148 10 8 air
242 248 250 244 215 218 219 216
149 10 8 air
110 98 99 111 247 223 225 249
150 10 8 air
247 223 225 249 248 224 226 250
151 10 8 air
248 224 226 250 218 206 207 219
152 10 8 air
75 105 106 76 195 237 239 197
153 10 8 air
195 237 239 197 196 238 240 198
154 10 8 air
196 238 240 198 183 213 214 184
155 10 8 air
105 108 109 106 237 243 245 239
156 10 8 air
237 243 245 239 238 244 246 240
157 10 8 air
238 244 246 240 213 216 217 214
158 10 8 air
108 111 112 109 243 249 251 245
159 10 8 air
243 249 251 245 244 250 252 246
160 10 8 air
244 250 252 246 216 219 220 217
161 10 8 air
111 99 100 112 249 225 227 251
162 10 8 air
249 225 227 251 250 226 228 252
163 10 8 air
250 226 228 252 219 207 208 220
164 10 8 air
76 106 103 73 197 239 233 189
165 10 8 air
197 239 233 189 198 240 234 190
166 10 8 air
198 240 234 190 184 214 211 181
167 10 8 air
106 109 102 103 239 245 231 233
168 10 8 air
239 245 231 233 240 246 232 234
169 10 8 air
240 246 232 234 214 217 210 211
170 10 8 air
109 112 101 102 245 251 229 231
171 10 8 air
245 251 229 231 246 252 230 232
172 10 8 air
246 252 230 232 217 220 209 210
173 10 8 air
112 100 97 101 251 227 221 229
174 10 8 air
251 227 221 229 252 228 222 230
175 10 8 air
252 228 222 230 220 208 205 209

[2D Elements]
#ElemNr  ElemType  NrOfNodes  Level
#Node1 Node2 ... NodeNrOfNodes
1 6 4 botSurf
1 2 3 4
2 6 4 botSurf
2 6 12 3
3 6 4 botSurf
6 7 11 12
4 6 4 botSurf
7 8 10 11
5 6 4 botSurf
8 5 9 10
6 6 4 botSurf
4 3 14 20
7 6 4 botSurf
20 14 15 19
8 6 4 botSurf
19 15 16 18
9 6 4 botSurf
18 16 13 17
10 6 4 botSurf
3 12 28 14
11 6 4 botSurf
12 11 31 28
12 6 4 botSurf
11 10 34 31
13 6 4 botSurf
10 9 22 34
14 6 4 botSurf
14 28 29 15
15 6 4 botSurf
28 31 32 29
16 6 4 botSurf
31 34 35 32
17 6 4 botSurf
34 22 23 35
18 6 4 botSurf
15 29 30 16
19 6 4 botSurf
29 32 33 30
20 6 4 botSurf
32 35 36 33
21 6 4 botSurf
35 23 24 36
22 6 4 botSurf
16 30 27 13
23 6 4 botSurf
30 33 26 27
24 6 4 botSurf
33 36 25 26
25 6 4 botSurf
36 24 21 25
236 6 4 topSurf
147 148 145 146
243 6 4 topSurf
161 162 160 157
244 6 4 topSurf
162 163 159 160
245 6 4 topSurf
163 164 158 159
246 6 4 topSurf
164 147 146 158
262 6 4 topSurf
181 185 186 184
263 6 4 topSurf
184 186 187 183
264 6 4 topSurf
183 187 188 182
265 6 4 topSurf
182 188 148 147
281 6 4 topSurf
205 209 220 208
282 6 4 topSurf
209 210 217 220
283 6 4 topSurf
210 211 214 217
284 6 4 topSurf
211 181 184 214
285 6 4 topSurf
208 220 219 207
286 6 4 topSurf
220 217 216 219
287 6 4 topSurf
217 214 213 216
288 6 4 topSurf
214 184 183 213
289 6 4 topSurf
207 219 218 206
290 6 4 topSurf
219 216 215 218
291 6 4 topSurf
216 213 212 215
292 6 4 topSurf
213 183 182 212
293 6 4 topSurf
206 218 162 161
294 6 4 topSurf
218 215 163 162
295 6 4 topSurf
215 212 164 163
296 6 4 topSurf
212 182 147 164
194 6 4 xOuterSurf
60 53 49 58
195 6 4 xOuterSurf
59 60 58 57
196 6 4 xOuterSurf
9 59 57 5
212 6 4 xOuterSurf
114 97 100 120
213 6 4 xOuterSurf
113 114 120 119
214 6 4 xOuterSurf
21 113 119 24
215 6 4 xOuterSurf
120 100 99 118
216 6 4 xOuterSurf
119 120 118 117
217 6 4 xOuterSurf
24 119 117 23
218 6 4 xOuterSurf
118 99 98 116
219 6 4 xOuterSurf
117 118 116 115
220 6 4 xOuterSurf
23 117 115 22
221 6 4 xOuterSurf
116 98 53 60
222 6 4 xOuterSurf
115 116 60 59
223 6 4 xOuterSurf
22 115 59 9
259 6 4 xOuterSurf
168 161 157 166
260 6 4 xOuterSurf
167 168 166 165
261 6 4 xOuterSurf
53 167 165 49
297 6 4 xOuterSurf
222 205 208 228
298 6 4 xOuterSurf
221 222 228 227
299 6 4 xOuterSurf
97 221 227 100
300 6 4 xOuterSurf
228 208 207 226
301 6 4 xOuterSurf
227 228 226 225
302 6 4 xOuterSurf
100 227 225 99
303 6 4 xOuterSurf
226 207 206 224
304 6 4 xOuterSurf
225 226 224 223
305 6 4 xOuterSurf
99 225 223 98
306 6 4 xOuterSurf
224 206 161 168
307 6 4 xOuterSurf
223 224 168 167
308 6 4 xOuterSurf
98 223 167 53
179 6 4 xInnerSurf
37 40 48 42
180 6 4 xInnerSurf
42 48 47 41
181 6 4 xInnerSurf
41 47 4 1
200 6 4 xInnerSurf
78 77 84 92
201 6 4 xInnerSurf
92 84 83 91
202 6 4 xInnerSurf
91 83 17 18
203 6 4 xInnerSurf
79 78 92 94
204 6 4 xInnerSurf
94 92 91 93
205 6 4 xInnerSurf
93 91 18 19
206 6 4 xInnerSurf
80 79 94 96
207 6 4 xInnerSurf
96 94 93 95
208 6 4 xInnerSurf
95 93 19 20
209 6 4 xInnerSurf
40 80 96 48
210 6 4 xInnerSurf
48 96 95 47
211 6 4 xInnerSurf
47 95 20 4
240 6 4 xInnerSurf
145 148 156 150
241 6 4 xInnerSurf
150 156 155 149
242 6 4 xInnerSurf
149 155 40 37
269 6 4 xInnerSurf
186 185 192 200
270 6 4 xInnerSurf
200 192 191 199
271 6 4 xInnerSurf
199 191 77 78
272 6 4 xInnerSurf
187 186 200 202
273 6 4 xInnerSurf
202 200 199 201
274 6 4 xInnerSurf
201 199 78 79
275 6 4 xInnerSurf
188 187 202 204
276 6 4 xInnerSurf
204 202 201 203
277 6 4 xInnerSurf
203 201 79 80
278 6 4 xInnerSurf
148 188 204 156
279 6 4 xInnerSurf
156 204 203 155
280 6 4 xInnerSurf
155 203 80 40
197 6 4 yOuterSurf
84 77 73 82
198 6 4 yOuterSurf
83 84 82 81
199 6 4 yOuterSurf
17 83 81 13
224 6 4 yOuterSurf
122 101 97 114
225 6 4 yOuterSurf
121 122 114 113
226 6 4 yOuterSurf
25 121 113 21
227 6 4 yOuterSurf
124 102 101 122
228 6 4 yOuterSurf
123 124 122 121
229 6 4 yOuterSurf
26 123 121 25
230 6 4 yOuterSurf
126 103 102 124
231 6 4 yOuterSurf
125 126 124 123
232 6 4 yOuterSurf
27 125 123 26
233 6 4 yOuterSurf
82 73 103 126
234 6 4 yOuterSurf
81 82 126 125
235 6 4 yOuterSurf
13 81 125 27
266 6 4 yOuterSurf
192 185 181 190
267 6 4 yOuterSurf
191 192 190 189
268 6 4 yOuterSurf
77 191 189 73
309 6 4 yOuterSurf
230 209 205 222
310 6 4 yOuterSurf
229 230 222 221
311 6 4 yOuterSurf
101 229 221 97
312 6 4 yOuterSurf
232 210 209 230
313 6 4 yOuterSurf
231 232 230 229
314 6 4 yOuterSurf
102 231 229 101
315 6 4 yOuterSurf
234 211 210 232
316 6 4 yOuterSurf
233 234 232 231
317 6 4 yOuterSurf
103 233 231 102
318 6 4 yOuterSurf
190 181 211 234
319 6 4 yOuterSurf
189 190 234 233
320 6 4 yOuterSurf
73 189 233 103
176 6 4 yInnerSurf
44 38 37 42
177 6 4 yInnerSurf
43 44 42 41
178 6 4 yInnerSurf
2 43 41 1
182 6 4 yInnerSurf
58 49 52 66
183 6 4 yInnerSurf
57 58 66 65
184 6 4 yInnerSurf
5 57 65 8
185 6 4 yInnerSurf
66 52 51 64
186 6 4 yInnerSurf
65 66 64 63
187 6 4 yInnerSurf
8 65 63 7
188 6 4 yInnerSurf
64 51 50 62
189 6 4 yInnerSurf
63 64 62 61
190 6 4 yInnerSurf
7 63 61 6
191 6 4 yInnerSurf
62 50 38 44
192 6 4 yInnerSurf
61 62 44 43
193 6 4 yInnerSurf
6 61 43 2
237 6 4 yInnerSurf
152 146 145 150
238 6 4 yInnerSurf
151 152 150 149
239 6 4 yInnerSurf
38 151 149 37
247 6 4 yInnerSurf
166 157 160 174
248 6 4 yInnerSurf
165 166 174 173
249 6 4 yInnerSurf
49 165 173 52
250 6 4 yInnerSurf
174 160 159 172
251 6 4 yInnerSurf
173 174 172 171
252 6 4 yInnerSurf
52 173 171 51
253 6 4 yInnerSurf
172 159 158 170
254 6 4 yInnerSurf
171 172 170 169
255 6 4 yInnerSurf
51 171 169 50
256 6 4 yInnerSurf
170 158 146 152
257 6 4 yInnerSurf
169 170 152 151
258 6 4 yInnerSurf
50 169 151 38

[1D Elements]
#ElemNr  ElemType  NrOfNodes  Level
#Node1 Node2 ... NodeNrOfNodes

[Node BC]
#NodeNr Level
       1 botNodes
       2 botNodes
       3 botNodes
       4 botNodes
       5 botNodes
       6 botNodes
       7 botNodes
       8 botNodes
       9 botNodes
      10 botNodes
      11 botNodes
      12 botNodes
      13 botNodes
      14 botNodes
      15 botNodes
      16 botNodes
      17 botNodes
      18 botNodes
      19 botNodes
      20 botNodes
      21 botNodes
      22 botNodes
      23 botNodes
      24 botNodes
      25 botNodes
      26 botNodes
      27 botNodes
      28 botNodes
      29 botNodes
      30 botNodes
      31 botNodes
      32 botNodes
      33 botNodes
      34 botNodes
      35 botNodes
      36 botNodes
     145 topNodes
     146 topNodes
     147 topNodes
     148 topNodes
     157 topNodes
     158 topNodes
     159 topNodes
     160 topNodes
     161 topNodes
     162 topNodes
     163 topNodes
     164 topNodes
     181 topNodes
     182 topNodes
     183 topNodes
     184 topNodes
     185 topNodes
     186 topNodes
     187 topNodes
     188 topNodes
     205 topNodes
     206 topNodes
     207 topNodes
     208 topNodes
     209 topNodes
     210 topNodes
     211 topNodes
     212 topNodes
     213 topNodes
     214 topNodes
     215 topNodes
     216 topNodes
     217 topNodes
     218 topNodes
     219 topNodes
     220 topNodes
       5 xOuterNodes
       9 xOuterNodes
      21 xOuterNodes
      22 xOuterNodes
      23 xOuterNodes
      24 xOuterNodes
      49 xOuterNodes
      53 xOuterNodes
      57 xOuterNodes
      58 xOuterNodes
      59 xOuterNodes
      60 xOuterNodes
      97 xOuterNodes
      98 xOuterNodes
      99 xOuterNodes
     100 xOuterNodes
     113 xOuterNodes
     114 xOuterNodes
     115 xOuterNodes
     116 xOuterNodes
     117 xOuterNodes
     118 xOuterNodes
     119 xOuterNodes
     120 xOuterNodes
     157 xOuterNodes
     161 xOuterNodes
     165 xOuterNodes
     166 xOuterNodes
     167 xOuterNodes
     168 xOuterNodes
     205 xOuterNodes
     206 xOuterNodes
     207 xOuterNodes
     208 xOuterNodes
     221 xOuterNodes
     222 xOuterNodes
     223 xOuterNodes
     224 xOuterNodes
     225 xOuterNodes
     226 xOuterNodes
     227 xOuterNodes
     228 xOuterNodes
       1 xInnerNodes
       4 xInnerNodes
      17 xInnerNodes
      18 xInnerNodes
      19 xInnerNodes
      20 xInnerNodes
      37 xInnerNodes
      40 xInnerNodes
      41 xInnerNodes
      42 xInnerNodes
      47 xInnerNodes
      48 xInnerNodes
      77 xInnerNodes
      78 xInnerNodes
      79 xInnerNodes
      80 xInnerNodes
      83 xInnerNodes
      84 xInnerNodes
      91 xInnerNodes
      92 xInnerNodes
      93 xInnerNodes
      94 xInnerNodes
      95 xInnerNodes
      96 xInnerNodes
     145 xInnerNodes
     148 xInnerNodes
     149 xInnerNodes
     150 xInnerNodes
     155 xInnerNodes
     156 xInnerNodes
     185 xInnerNodes
     186 xInnerNodes
     187 xInnerNodes
     188 xInnerNodes
     191 xInnerNodes
     192 xInnerNodes
     199 xInnerNodes
     200 xInnerNodes
     201 xInnerNodes
     202 xInnerNodes
     203 xInnerNodes
     204 xInnerNodes
      13 yOuterNodes
      17 yOuterNodes
      21 yOuterNodes
      25 yOuterNodes
      26 yOuterNodes
      27 yOuterNodes
      73 yOuterNodes
      77 yOuterNodes
      81 yOuterNodes
      82 yOuterNodes
      83 yOuterNodes
      84 yOuterNodes
      97 yOuterNodes
     101 yOuterNodes
     102 yOuterNodes
     103 yOuterNodes
     113 yOuterNodes
     114 yOuterNodes
     121 yOuterNodes
     122 yOuterNodes
     123 yOuterNodes
     124 yOuterNodes
     125 yOuterNodes
     126 yOuterNodes
     181 yOuterNodes
     185 yOuterNodes
     189 yOuterNodes
     190 yOuterNodes
     191 yOuterNodes
     192 yOuterNodes
     205 yOuterNodes
     209 yOuterNodes
     210 yOuterNodes
     211 yOuterNodes
     221 yOuterNodes
     222 yOuterNodes
     229 yOuterNodes
     230 yOuterNodes
     231 yOuterNodes
     232 yOuterNodes
     233 yOuterNodes
     234 yOuterNodes
       1 yInnerNodes
       2 yInnerNodes
       5 yInnerNodes
       6 yInnerNodes
       7 yInnerNodes
       8 yInnerNodes
      37 yInnerNodes
      38 yInnerNodes
      41 yInnerNodes
      42 yInnerNodes
      43 yInnerNodes
      44 yInnerNodes
      49 yInnerNodes
      50 yInnerNodes
      51 yInnerNodes
      52 yInnerNodes
      57 yInnerNodes
      58 yInnerNodes
      61 yInnerNodes
      62 yInnerNodes
      63 yInnerNodes
      64 yInnerNodes
      65 yInnerNodes
      66 yInnerNodes
     145 yInnerNodes
     146 yInnerNodes
     149 yInnerNodes
     150 yInnerNodes
     151 yInnerNodes
     152 yInnerNodes
     157 yInnerNodes
     158 yInnerNodes
     159 yInnerNodes
     160 yInnerNodes
     165 yInnerNodes
     166 yInnerNodes
     169 yInnerNodes
     170 yInnerNodes
     171 yInnerNodes
     172 yInnerNodes
     173 yInnerNodes
     174 yInnerNodes

[Save Nodes]
#NodeNr Level

[Save Elements]
#ElemNr Level

