$MeshFormat
2.2 0 8
$EndMeshFormat
$PhysicalNames
5
1 2 "bottom"
1 3 "top"
1 4 "right"
1 5 "left"
2 1 "cavity"
$EndPhysicalNames
$Nodes
441
1 -1 -1 0
2 1 -1 0
3 1 1 0
4 -1 1 0
5 -0.8000000000005545 -1 0
6 -0.6000000000011093 -1 0
7 -0.4000000000016637 -1 0
8 -0.2000000000022178 -1 0
9 -2.750244476601438e-12 -1 0
10 0.1999999999977826 -1 0
11 0.3999999999983368 -1 0
12 0.5999999999988912 -1 0
13 0.7999999999994456 -1 0
14 -0.9000000000002277 -1 0
15 -0.7000000000008114 -1 0
16 -0.5000000000013864 -1 0
17 -0.3000000000019407 -1 0
18 -0.1000000000024841 -1 0
19 0.0999999999975163 -1 0
20 0.2999999999980598 -1 0
21 0.499999999998614 -1 0
22 0.6999999999991684 -1 0
23 0.8999999999997228 -1 0
24 1 -0.8000000000005545 0
25 1 -0.6000000000011093 0
26 1 -0.4000000000016637 0
27 1 -0.2000000000022178 0
28 1 -2.750244476601438e-12 0
29 1 0.1999999999977826 0
30 1 0.3999999999983368 0
31 1 0.5999999999988912 0
32 1 0.7999999999994456 0
33 1 -0.9000000000002277 0
34 1 -0.7000000000008114 0
35 1 -0.5000000000013864 0
36 1 -0.3000000000019407 0
37 1 -0.1000000000024841 0
38 1 0.0999999999975163 0
39 1 0.2999999999980598 0
40 1 0.499999999998614 0
41 1 0.6999999999991684 0
42 1 0.8999999999997228 0
43 0.8000000000005545 1 0
44 0.6000000000011093 1 0
45 0.4000000000016637 1 0
46 0.2000000000022178 1 0
47 2.750244476601438e-12 1 0
48 -0.1999999999977826 1 0
49 -0.3999999999983368 1 0
50 -0.5999999999988912 1 0
51 -0.7999999999994456 1 0
52 0.9000000000002277 1 0
53 0.7000000000008114 1 0
54 0.5000000000013864 1 0
55 0.3000000000019407 1 0
56 0.1000000000024841 1 0
57 -0.0999999999975163 1 0
58 -0.2999999999980598 1 0
59 -0.499999999998614 1 0
60 -0.6999999999991684 1 0
61 -0.8999999999997228 1 0
62 -1 0.8000000000005545 0
63 -1 0.6000000000011093 0
64 -1 0.4000000000016637 0
65 -1 0.2000000000022178 0
66 -1 2.750244476601438e-12 0
67 -1 -0.1999999999977826 0
68 -1 -0.3999999999983368 0
69 -1 -0.5999999999988912 0
70 -1 -0.7999999999994456 0
71 -1 0.9000000000002277 0
72 -1 0.7000000000008114 0
73 -1 0.5000000000013864 0
74 -1 0.3000000000019407 0
75 -1 0.1000000000024841 0
76 -1 -0.0999999999975163 0
77 -1 -0.2999999999980598 0
78 -1 -0.499999999998614 0
79 -1 -0.6999999999991684 0
80 -1 -0.8999999999997228 0
81 -0.7999999999995565 0.8000000000004435 0
82 -0.599999999999113 0.8000000000003329 0
83 -0.3999999999986695 0.8000000000002219 0
84 -0.1999999999982261 0.8000000000001111 0
85 2.200195592123172e-12 0.8 0
86 0.2000000000017743 0.7999999999998892 0
87 0.400000000001331 0.7999999999997782 0
88 0.6000000000008875 0.7999999999996674 0
89 0.8000000000004436 0.7999999999995564 0
90 -0.7999999999996673 0.6000000000008874 0
91 -0.5999999999993348 0.6000000000006658 0
92 -0.3999999999990022 0.6000000000004437 0
93 -0.1999999999986697 0.6000000000002221 0
94 1.650146680539852e-12 0.6000000000000003 0
95 0.2000000000013308 0.5999999999997785 0
96 0.4000000000009983 0.5999999999995567 0
97 0.6000000000006657 0.5999999999993348 0
98 0.8000000000003328 0.599999999999113 0
99 -0.7999999999997782 0.4000000000013311 0
100 -0.5999999999995567 0.4000000000009983 0
101 -0.3999999999993348 0.4000000000006656 0
102 -0.1999999999991132 0.400000000000333 0
103 1.100097768956532e-12 0.4000000000000002 0
104 0.2000000000008873 0.3999999999996675 0
105 0.4000000000006657 0.3999999999993349 0
106 0.6000000000004438 0.3999999999990022 0
107 0.8000000000002219 0.3999999999986695 0
108 -0.7999999999998891 0.2000000000017743 0
109 -0.5999999999997785 0.2000000000013308 0
110 -0.3999999999996676 0.2000000000008873 0
111 -0.1999999999995567 0.2000000000004437 0
112 5.500488844782658e-13 0.2000000000000002 0
113 0.2000000000004438 0.1999999999995567 0
114 0.4000000000003329 0.1999999999991132 0
115 0.600000000000222 0.1999999999986697 0
116 0.800000000000111 0.1999999999982262 0
117 -0.8 2.200195601611467e-12 0
118 -0.6000000000000002 1.650146672411387e-12 0
119 -0.4000000000000002 1.100097790645151e-12 0
120 -0.2000000000000002 5.500488682213331e-13 0
121 0 7.564178960885304e-24 0
122 0.2000000000000002 -5.500489224192436e-13 0
123 0.4000000000000002 -1.100097790636001e-12 0
124 0.6000000000000002 -1.650146713062867e-12 0
125 0.8 -2.200195554174571e-12 0
126 -0.800000000000111 -0.1999999999982262 0
127 -0.600000000000222 -0.1999999999986697 0
128 -0.4000000000003329 -0.1999999999991132 0
129 -0.2000000000004438 -0.1999999999995568 0
130 -5.500488709257387e-13 -0.2000000000000002 0
131 0.1999999999995567 -0.2000000000004438 0
132 0.3999999999996676 -0.2000000000008873 0
133 0.5999999999997785 -0.2000000000013308 0
134 0.7999999999998891 -0.2000000000017743 0
135 -0.8000000000002219 -0.3999999999986694 0
136 -0.6000000000004438 -0.3999999999990022 0
137 -0.4000000000006656 -0.3999999999993349 0
138 -0.2000000000008873 -0.3999999999996675 0
139 -1.100097768956532e-12 -0.4000000000000002 0
140 0.1999999999991132 -0.400000000000333 0
141 0.3999999999993349 -0.4000000000006656 0
142 0.5999999999995567 -0.4000000000009983 0
143 0.7999999999997782 -0.4000000000013311 0
144 -0.8000000000003328 -0.599999999999113 0
145 -0.6000000000006657 -0.5999999999993348 0
146 -0.4000000000009983 -0.5999999999995567 0
147 -0.2000000000013308 -0.5999999999997785 0
148 -1.650146700868643e-12 -0.6000000000000003 0
149 0.1999999999986697 -0.6000000000002221 0
150 0.3999999999990022 -0.600000000000444 0
151 0.5999999999993348 -0.6000000000006658 0
152 0.7999999999996674 -0.6000000000008876 0
153 -0.8000000000004436 -0.7999999999995566 0
154 -0.6000000000008875 -0.7999999999996672 0
155 -0.400000000001331 -0.7999999999997782 0
156 -0.2000000000017743 -0.799999999999889 0
157 -2.200195602287567e-12 -0.8 0
158 0.1999999999982262 -0.8000000000001108 0
159 0.3999999999986695 -0.8000000000002219 0
160 0.599999999999113 -0.8000000000003327 0
161 0.7999999999995565 -0.8000000000004435 0
162 -0.8999999999997783 0.800000000000499 0
163 -0.7999999999995011 0.9000000000002217 0
164 -0.8999999999997506 0.9000000000002247 0
165 -0.6999999999993347 0.8000000000003882 0
166 -0.5999999999990021 0.9000000000001664 0
167 -0.6999999999992514 0.9000000000001941 0
168 -0.4999999999988913 0.8000000000002774 0
169 -0.3999999999985032 0.9000000000001109 0
170 -0.4999999999987526 0.9000000000001387 0
171 -0.2999999999984478 0.8000000000001665 0
172 -0.1999999999980044 0.9000000000000555 0
173 -0.2999999999982538 0.9000000000000833 0
174 -0.09999999999801297 0.8000000000000556 0
175 2.475220034362305e-12 0.9 0
176 -0.09999999999776463 0.9000000000000278 0
177 0.1000000000019873 0.7999999999999446 0
178 0.2000000000019961 0.8999999999999446 0
179 0.1000000000022357 0.8999999999999723 0
180 0.3000000000015526 0.7999999999998337 0
181 0.4000000000014973 0.8999999999998891 0
182 0.3000000000017466 0.8999999999999169 0
183 0.5000000000011092 0.7999999999997228 0
184 0.6000000000009984 0.8999999999998337 0
185 0.5000000000012479 0.8999999999998615 0
186 0.7000000000006655 0.7999999999996119 0
187 0.800000000000499 0.8999999999997782 0
188 0.7 0.8999999999999999 0
189 0.9000000000002217 0.799999999999501 0
190 0.8999999999999999 0.8999999999999999 0
191 -0.8999999999998336 0.6000000000009984 0
192 -0.7999999999996119 0.7000000000006654 0
193 -0.8999999999998058 0.7000000000007385 0
194 -0.699999999999501 0.6000000000007766 0
195 -0.5999999999992239 0.7000000000004993 0
196 -0.6999999999994178 0.7000000000005824 0
197 -0.4999999999991686 0.6000000000005548 0
198 -0.3999999999988358 0.7000000000003328 0
199 -0.4999999999990299 0.7000000000004161 0
200 -0.2999999999988359 0.6000000000003329 0
201 -0.1999999999984479 0.7000000000001666 0
202 -0.2999999999986419 0.7000000000002496 0
203 -0.09999999999850975 0.6000000000001112 0
204 1.925171136331512e-12 0.7000000000000002 0
205 -0.09999999999826135 0.7000000000000833 0
206 0.1000000000014905 0.5999999999998894 0
207 0.2000000000015526 0.6999999999998339 0
208 0.1000000000017389 0.699999999999917 0
209 0.3000000000011646 0.5999999999996676 0
210 0.4000000000011646 0.6999999999996674 0
211 0.3000000000013586 0.6999999999997507 0
212 0.500000000000832 0.5999999999994458 0
213 0.6000000000007766 0.6999999999995011 0
214 0.5000000000009707 0.6999999999995843 0
215 0.7000000000004992 0.5999999999992239 0
216 0.8000000000003882 0.6999999999993347 0
217 0.7 0.7 0
218 0.9000000000001664 0.5999999999990021 0
219 0.8999999999999999 0.7 0
220 -0.8999999999998891 0.4000000000014974 0
221 -0.7999999999997227 0.5000000000011092 0
222 -0.8999999999998612 0.5000000000012479 0
223 -0.6999999999996674 0.4000000000011647 0
224 -0.5999999999994458 0.500000000000832 0
225 -0.6999999999995843 0.5000000000009706 0
226 -0.4999999999994458 0.400000000000832 0
227 -0.3999999999991685 0.5000000000005547 0
228 -0.4999999999993071 0.5000000000006933 0
229 -0.299999999999224 0.4000000000004993 0
230 -0.1999999999988914 0.5000000000002776 0
231 -0.2999999999990299 0.5000000000004161 0
232 -0.09999999999900655 0.4000000000001666 0
233 1.375122224748192e-12 0.5000000000000002 0
234 -0.09999999999875815 0.5000000000001388 0
235 0.1000000000009937 0.3999999999998339 0
236 0.200000000001109 0.499999999999723 0
237 0.1000000000012421 0.4999999999998617 0
238 0.3000000000007765 0.3999999999995012 0
239 0.400000000000832 0.4999999999994458 0
240 0.3000000000009705 0.4999999999995844 0
241 0.5000000000005548 0.3999999999991685 0
242 0.6000000000005548 0.4999999999991685 0
243 0.4999999999999999 0.4999999999999999 0
244 0.7000000000003328 0.3999999999988358 0
245 0.8000000000002774 0.4999999999988913 0
246 0.7000000000004161 0.4999999999990299 0
247 0.9000000000001109 0.3999999999985032 0
248 0.9000000000001387 0.4999999999987526 0
249 -0.8999999999999446 0.2000000000019961 0
250 -0.7999999999998337 0.3000000000015527 0
251 -0.8999999999999169 0.3000000000017466 0
252 -0.6999999999998339 0.2000000000015525 0
253 -0.5999999999996676 0.3000000000011646 0
254 -0.6999999999997507 0.3000000000013586 0
255 -0.499999999999723 0.200000000001109 0
256 -0.3999999999995012 0.3000000000007764 0
257 -0.4999999999995843 0.3000000000009705 0
258 -0.2999999999996121 0.2000000000006655 0
259 -0.1999999999993349 0.3000000000003883 0
260 -0.2999999999994181 0.3000000000005824 0
261 -0.09999999999950332 0.200000000000222 0
262 8.250733267173987e-13 0.3000000000000003 0
263 -0.09999999999925493 0.3000000000001943 0
264 0.1000000000004969 0.1999999999997785 0
265 0.2000000000006655 0.2999999999996121 0
266 0.1 0.3 0
267 0.3000000000003883 0.1999999999993349 0
268 0.4000000000004993 0.299999999999224 0
269 0.3 0.3 0
270 0.5000000000002774 0.1999999999988914 0
271 0.6000000000003329 0.2999999999988359 0
272 0.5000000000004161 0.29999999999903 0
273 0.7000000000001665 0.1999999999984479 0
274 0.8000000000001664 0.2999999999984478 0
275 0.7000000000002496 0.2999999999986419 0
276 0.9000000000000554 0.1999999999980044 0
277 0.9000000000000832 0.2999999999982538 0
278 -0.9 2.475220039106452e-12 0
279 -0.7999999999999445 0.1000000000019872 0
280 -0.8999999999999724 0.1000000000022357 0
281 -0.7000000000000002 1.925171137011427e-12 0
282 -0.5999999999998893 0.1000000000014905 0
283 -0.699999999999917 0.1000000000017389 0
284 -0.5000000000000002 1.375122231528269e-12 0
285 -0.3999999999998339 0.1000000000009937 0
286 -0.4999999999998616 0.1000000000012421 0
287 -0.3000000000000003 8.250733294332419e-13 0
288 -0.1999999999997785 0.1000000000004969 0
289 -0.2999999999998062 0.1000000000007453 0
290 -0.1000000000000001 2.750244341144486e-13 0
291 2.750244422391329e-13 0.1000000000000001 0
292 -0.09999999999975172 0.1000000000002485 0
293 0.1000000000000001 -2.750244612058397e-13 0
294 0.200000000000222 0.09999999999950332 0
295 0.1 0.1 0
296 0.3000000000000003 -8.250733565276222e-13 0
297 0.4000000000001666 0.09999999999900654 0
298 0.3 0.1 0
299 0.5000000000000002 -1.375122251849434e-12 0
300 0.6000000000001111 0.09999999999850977 0
301 0.5000000000001388 0.09999999999875815 0
302 0.7000000000000002 -1.925171133618719e-12 0
303 0.8000000000000556 0.09999999999801298 0
304 0.7000000000000834 0.09999999999826138 0
305 0.9 -2.475220015388005e-12 0
306 0.9000000000000277 0.09999999999776464 0
307 -0.9000000000000554 -0.1999999999980044 0
308 -0.8000000000000556 -0.09999999999801298 0
309 -0.9000000000000279 -0.09999999999776464 0
310 -0.7000000000001665 -0.1999999999984479 0
311 -0.6000000000001111 -0.09999999999850977 0
312 -0.7000000000000833 -0.09999999999826137 0
313 -0.5000000000002774 -0.1999999999988914 0
314 -0.4000000000001666 -0.09999999999900654 0
315 -0.5000000000001388 -0.09999999999875818 0
316 -0.3000000000003883 -0.199999999999335 0
317 -0.200000000000222 -0.09999999999950335 0
318 -0.3000000000001943 -0.09999999999925493 0
319 -0.1000000000004969 -0.1999999999997785 0
320 -2.750244354628693e-13 -0.1000000000000001 0
321 -0.1000000000002485 -0.09999999999975173 0
322 0.09999999999950332 -0.200000000000222 0
323 0.1999999999997785 -0.1000000000004969 0
324 0.09999999999975172 -0.1000000000002485 0
325 0.2999999999996121 -0.2000000000006655 0
326 0.3999999999998339 -0.1000000000009937 0
327 0.2999999999998062 -0.1000000000007453 0
328 0.499999999999723 -0.2000000000011091 0
329 0.5999999999998893 -0.1000000000014905 0
330 0.4999999999998616 -0.1000000000012421 0
331 0.6999999999998339 -0.2000000000015526 0
332 0.7999999999999445 -0.1000000000019872 0
333 0.699999999999917 -0.1000000000017389 0
334 0.8999999999999446 -0.2000000000019961 0
335 0.8999999999999724 -0.1000000000022357 0
336 -0.9000000000001109 -0.3999999999985031 0
337 -0.8000000000001664 -0.2999999999984478 0
338 -0.9000000000000831 -0.2999999999982538 0
339 -0.7000000000003328 -0.3999999999988358 0
340 -0.6000000000003329 -0.2999999999988359 0
341 -0.7000000000002495 -0.2999999999986419 0
342 -0.5000000000005547 -0.3999999999991685 0
343 -0.4000000000004993 -0.299999999999224 0
344 -0.5000000000004161 -0.2999999999990299 0
345 -0.3000000000007764 -0.3999999999995012 0
346 -0.2000000000006655 -0.2999999999996121 0
347 -0.3000000000005824 -0.2999999999994181 0
348 -0.1000000000009937 -0.3999999999998339 0
349 -8.250733199411352e-13 -0.3000000000000003 0
350 -0.1000000000007453 -0.2999999999998062 0
351 0.09999999999900655 -0.4000000000001666 0
352 0.1999999999993349 -0.3000000000003884 0
353 0.09999999999925493 -0.3000000000001943 0
354 0.2999999999992241 -0.4000000000004993 0
355 0.3999999999995012 -0.3000000000007764 0
356 0.2999999999994181 -0.3000000000005824 0
357 0.4999999999994458 -0.400000000000832 0
358 0.5999999999996676 -0.3000000000011646 0
359 0.4999999999995844 -0.3000000000009705 0
360 0.6999999999996674 -0.4000000000011647 0
361 0.7999999999998337 -0.3000000000015527 0
362 0.6999999999997507 -0.3000000000013586 0
363 0.8999999999998891 -0.4000000000014974 0
364 0.8999999999999169 -0.3000000000017466 0
365 -0.9000000000001664 -0.5999999999990021 0
366 -0.8000000000002774 -0.4999999999988912 0
367 -0.9000000000001387 -0.4999999999987526 0
368 -0.7000000000004992 -0.5999999999992239 0
369 -0.6000000000005548 -0.4999999999991685 0
370 -0.7000000000004161 -0.4999999999990298 0
371 -0.500000000000832 -0.5999999999994458 0
372 -0.400000000000832 -0.4999999999994458 0
373 -0.5000000000006933 -0.4999999999993071 0
374 -0.3000000000011646 -0.5999999999996676 0
375 -0.200000000001109 -0.499999999999723 0
376 -0.3000000000009705 -0.4999999999995843 0
377 -0.1000000000014905 -0.5999999999998894 0
378 -1.375122234912587e-12 -0.5000000000000002 0
379 -0.1000000000012421 -0.4999999999998616 0
380 0.09999999999850975 -0.6000000000001112 0
381 0.1999999999988914 -0.5000000000002776 0
382 0.09999999999875815 -0.5000000000001389 0
383 0.2999999999988359 -0.600000000000333 0
384 0.3999999999991685 -0.5000000000005548 0
385 0.2999999999990299 -0.5000000000004162 0
386 0.4999999999991685 -0.6000000000005549 0
387 0.5999999999994458 -0.500000000000832 0
388 0.4999999999993071 -0.5000000000006933 0
389 0.6999999999995011 -0.6000000000007767 0
390 0.7999999999997228 -0.5000000000011093 0
391 0.6999999999995843 -0.5000000000009707 0
392 0.8999999999998337 -0.6000000000009984 0
393 0.8999999999998615 -0.5000000000012479 0
394 -0.9000000000002217 -0.7999999999995011 0
395 -0.8000000000003882 -0.6999999999993348 0
396 -0.9000000000001941 -0.6999999999992516 0
397 -0.7000000000006655 -0.7999999999996119 0
398 -0.6000000000007766 -0.699999999999501 0
399 -0.7000000000005824 -0.699999999999418 0
400 -0.5000000000011092 -0.7999999999997227 0
401 -0.4000000000011646 -0.6999999999996674 0
402 -0.5000000000009706 -0.6999999999995842 0
403 -0.3000000000015527 -0.7999999999998336 0
404 -0.2000000000015525 -0.6999999999998338 0
405 -0.3000000000013586 -0.6999999999997506 0
406 -0.1000000000019872 -0.7999999999999445 0
407 -1.925171151578105e-12 -0.7000000000000002 0
408 -0.1000000000017389 -0.699999999999917 0
409 0.09999999999801298 -0.8000000000000554 0
410 0.1999999999984479 -0.7000000000001665 0
411 0.09999999999826137 -0.7000000000000833 0
412 0.2999999999984478 -0.8000000000001664 0
413 0.3999999999988358 -0.7000000000003329 0
414 0.2999999999986419 -0.7000000000002495 0
415 0.4999999999988912 -0.8000000000002773 0
416 0.5999999999992239 -0.7000000000004992 0
417 0.4999999999990299 -0.7000000000004161 0
418 0.6999999999993347 -0.8000000000003881 0
419 0.7999999999996119 -0.7000000000006655 0
420 0.6999999999994179 -0.7000000000005824 0
421 0.8999999999997783 -0.800000000000499 0
422 0.8999999999998061 -0.7000000000007384 0
423 -0.800000000000499 -0.8999999999997783 0
424 -0.9000000000002247 -0.8999999999997506 0
425 -0.6000000000009984 -0.8999999999998336 0
426 -0.7000000000007385 -0.899999999999806 0
427 -0.4000000000014974 -0.8999999999998891 0
428 -0.5000000000012479 -0.8999999999998614 0
429 -0.2000000000019961 -0.8999999999999445 0
430 -0.3000000000017466 -0.8999999999999166 0
431 -2.475220039444503e-12 -0.9 0
432 -0.1000000000022357 -0.8999999999999724 0
433 0.1999999999980044 -0.9000000000000554 0
434 0.09999999999776464 -0.9000000000000277 0
435 0.3999999999985031 -0.9000000000001109 0
436 0.2999999999982538 -0.9000000000000831 0
437 0.5999999999990021 -0.9000000000001663 0
438 0.4999999999987526 -0.9000000000001385 0
439 0.7999999999995011 -0.9000000000002217 0
440 0.6999999999992517 -0.900000000000194 0
441 0.8999999999997506 -0.9000000000002247 0
$EndNodes
$Elements
140
1 8 2 2 1 1 5 14
2 8 2 2 1 5 6 15
3 8 2 2 1 6 7 16
4 8 2 2 1 7 8 17
5 8 2 2 1 8 9 18
6 8 2 2 1 9 10 19
7 8 2 2 1 10 11 20
8 8 2 2 1 11 12 21
9 8 2 2 1 12 13 22
10 8 2 2 1 13 2 23
11 8 2 4 2 2 24 33
12 8 2 4 2 24 25 34
13 8 2 4 2 25 26 35
14 8 2 4 2 26 27 36
15 8 2 4 2 27 28 37
16 8 2 4 2 28 29 38
17 8 2 4 2 29 30 39
18 8 2 4 2 30 31 40
19 8 2 4 2 31 32 41
20 8 2 4 2 32 3 42
21 8 2 3 3 3 43 52
22 8 2 3 3 43 44 53
23 8 2 3 3 44 45 54
24 8 2 3 3 45 46 55
25 8 2 3 3 46 47 56
26 8 2 3 3 47 48 57
27 8 2 3 3 48 49 58
28 8 2 3 3 49 50 59
29 8 2 3 3 50 51 60
30 8 2 3 3 51 4 61
31 8 2 5 4 4 62 71
32 8 2 5 4 62 63 72
33 8 2 5 4 63 64 73
34 8 2 5 4 64 65 74
35 8 2 5 4 65 66 75
36 8 2 5 4 66 67 76
37 8 2 5 4 67 68 77
38 8 2 5 4 68 69 78
39 8 2 5 4 69 70 79
40 8 2 5 4 70 1 80
41 10 2 1 6 4 62 81 51 71 162 163 61 164
42 10 2 1 6 51 81 82 50 163 165 166 60 167
43 10 2 1 6 50 82 83 49 166 168 169 59 170
44 10 2 1 6 49 83 84 48 169 171 172 58 173
45 10 2 1 6 48 84 85 47 172 174 175 57 176
46 10 2 1 6 47 85 86 46 175 177 178 56 179
47 10 2 1 6 46 86 87 45 178 180 181 55 182
48 10 2 1 6 45 87 88 44 181 183 184 54 185
49 10 2 1 6 44 88 89 43 184 186 187 53 188
50 10 2 1 6 43 89 32 3 187 189 42 52 190
51 10 2 1 6 62 63 90 81 72 191 192 162 193
52 10 2 1 6 81 90 91 82 192 194 195 165 196
53 10 2 1 6 82 91 92 83 195 197 198 168 199
54 10 2 1 6 83 92 93 84 198 200 201 171 202
55 10 2 1 6 84 93 94 85 201 203 204 174 205
56 10 2 1 6 85 94 95 86 204 206 207 177 208
57 10 2 1 6 86 95 96 87 207 209 210 180 211
58 10 2 1 6 87 96 97 88 210 212 213 183 214
59 10 2 1 6 88 97 98 89 213 215 216 186 217
60 10 2 1 6 89 98 31 32 216 218 41 189 219
61 10 2 1 6 63 64 99 90 73 220 221 191 222
62 10 2 1 6 90 99 100 91 221 223 224 194 225
63 10 2 1 6 91 100 101 92 224 226 227 197 228
64 10 2 1 6 92 101 102 93 227 229 230 200 231
65 10 2 1 6 93 102 103 94 230 232 233 203 234
66 10 2 1 6 94 103 104 95 233 235 236 206 237
67 10 2 1 6 95 104 105 96 236 238 239 209 240
68 10 2 1 6 96 105 106 97 239 241 242 212 243
69 10 2 1 6 97 106 107 98 242 244 245 215 246
70 10 2 1 6 98 107 30 31 245 247 40 218 248
71 10 2 1 6 64 65 108 99 74 249 250 220 251
72 10 2 1 6 99 108 109 100 250 252 253 223 254
73 10 2 1 6 100 109 110 101 253 255 256 226 257
74 10 2 1 6 101 110 111 102 256 258 259 229 260
75 10 2 1 6 102 111 112 103 259 261 262 232 263
76 10 2 1 6 103 112 113 104 262 264 265 235 266
77 10 2 1 6 104 113 114 105 265 267 268 238 269
78 10 2 1 6 105 114 115 106 268 270 271 241 272
79 10 2 1 6 106 115 116 107 271 273 274 244 275
80 10 2 1 6 107 116 29 30 274 276 39 247 277
81 10 2 1 6 65 66 117 108 75 278 279 249 280
82 10 2 1 6 108 117 118 109 279 281 282 252 283
83 10 2 1 6 109 118 119 110 282 284 285 255 286
84 10 2 1 6 110 119 120 111 285 287 288 258 289
85 10 2 1 6 111 120 121 112 288 290 291 261 292
86 10 2 1 6 112 121 122 113 291 293 294 264 295
87 10 2 1 6 113 122 123 114 294 296 297 267 298
88 10 2 1 6 114 123 124 115 297 299 300 270 301
89 10 2 1 6 115 124 125 116 300 302 303 273 304
90 10 2 1 6 116 125 28 29 303 305 38 276 306
91 10 2 1 6 66 67 126 117 76 307 308 278 309
92 10 2 1 6 117 126 127 118 308 310 311 281 312
93 10 2 1 6 118 127 128 119 311 313 314 284 315
94 10 2 1 6 119 128 129 120 314 316 317 287 318
95 10 2 1 6 120 129 130 121 317 319 320 290 321
96 10 2 1 6 121 130 131 122 320 322 323 293 324
97 10 2 1 6 122 131 132 123 323 325 326 296 327
98 10 2 1 6 123 132 133 124 326 328 329 299 330
99 10 2 1 6 124 133 134 125 329 331 332 302 333
100 10 2 1 6 125 134 27 28 332 334 37 305 335
101 10 2 1 6 67 68 135 126 77 336 337 307 338
102 10 2 1 6 126 135 136 127 337 339 340 310 341
103 10 2 1 6 127 136 137 128 340 342 343 313 344
104 10 2 1 6 128 137 138 129 343 345 346 316 347
105 10 2 1 6 129 138 139 130 346 348 349 319 350
106 10 2 1 6 130 139 140 131 349 351 352 322 353
107 10 2 1 6 131 140 141 132 352 354 355 325 356
108 10 2 1 6 132 141 142 133 355 357 358 328 359
109 10 2 1 6 133 142 143 134 358 360 361 331 362
110 10 2 1 6 134 143 26 27 361 363 36 334 364
111 10 2 1 6 68 69 144 135 78 365 366 336 367
112 10 2 1 6 135 144 145 136 366 368 369 339 370
113 10 2 1 6 136 145 146 137 369 371 372 342 373
114 10 2 1 6 137 146 147 138 372 374 375 345 376
115 10 2 1 6 138 147 148 139 375 377 378 348 379
116 10 2 1 6 139 148 149 140 378 380 381 351 382
117 10 2 1 6 140 149 150 141 381 383 384 354 385
118 10 2 1 6 141 150 151 142 384 386 387 357 388
119 10 2 1 6 142 151 152 143 387 389 390 360 391
120 10 2 1 6 143 152 25 26 390 392 35 363 393
121 10 2 1 6 69 70 153 144 79 394 395 365 396
122 10 2 1 6 144 153 154 145 395 397 398 368 399
123 10 2 1 6 145 154 155 146 398 400 401 371 402
124 10 2 1 6 146 155 156 147 401 403 404 374 405
125 10 2 1 6 147 156 157 148 404 406 407 377 408
126 10 2 1 6 148 157 158 149 407 409 410 380 411
127 10 2 1 6 149 158 159 150 410 412 413 383 414
128 10 2 1 6 150 159 160 151 413 415 416 386 417
129 10 2 1 6 151 160 161 152 416 418 419 389 420
130 10 2 1 6 152 161 24 25 419 421 34 392 422
131 10 2 1 6 70 1 5 153 80 14 423 394 424
132 10 2 1 6 153 5 6 154 423 15 425 397 426
133 10 2 1 6 154 6 7 155 425 16 427 400 428
134 10 2 1 6 155 7 8 156 427 17 429 403 430
135 10 2 1 6 156 8 9 157 429 18 431 406 432
136 10 2 1 6 157 9 10 158 431 19 433 409 434
137 10 2 1 6 158 10 11 159 433 20 435 412 436
138 10 2 1 6 159 11 12 160 435 21 437 415 438
139 10 2 1 6 160 12 13 161 437 22 439 418 440
140 10 2 1 6 161 13 2 24 439 23 33 421 441
$EndElements
