
0                         -1.9938349942627553E-5
8.33E-4                   -0.01880510151062405
0.001667                  -0.03733753563901102
0.0025                    -0.0555862078925798
0.003333                  -0.07356599176734356
0.004167                  -0.09129497398839874
0.005                     -0.1087270168339374
0.005833                  -0.12588040151519342
0.006667                  -0.14277200574028803
0.0075                    -0.1593583574730074
0.008333                  -0.17565714065859495
0.009167                  -0.1916846663187432
0.01                      -0.20739999016569663
0.010833                  -0.22282022381921307
0.011667                  -0.23796106345295967
0.0125                    -0.252784141954683
0.013333                  -0.26730595950370906
0.014167                  -0.2815415663611701
0.015                     -0.2954552063332198
0.015833                  -0.30906273381128685
0.016667                  -0.3223785253089176
0.0175                    -0.33536945872740753
0.018333                  -0.3480507119721754
0.019167                  -0.3604359634913252
0.02                      -0.37249473815062367
0.020833                  -0.38424151030714687
0.021667                  -0.3956892394829832
0.0225                    -0.40681010043749183
0.023333                  -0.4176178405035018
0.024167                  -0.42812468281055366
0.025                     -0.43830544538636523
0.025833                  -0.4481731285907489
0.026667                  -0.4577392050148907
0.0275                    -0.46698112018003785
0.028333                  -0.47591111098163075
0.029167                  -0.48453988856534475
0.03                      -0.49284750144264405
0.030833                  -0.5008454099315311
0.031667                  -0.508543555973226
0.0325                    -0.5159245582731082
0.033333                  -0.5229990907486746
0.034167                  -0.5297763214282872
0.035                     -0.5362413985691782
0.035833                  -0.5424042030593595
0.036667                  -0.548273127251171
0.0375                    -0.5538358009238524
0.038333                  -0.5591013083968163
0.039167                  -0.5640772674177975
0.04                      -0.5687537343354356
0.040833                  -0.5731389963412133
0.041667                  -0.5772399003668085
0.0425                    -0.5810488679272275
0.043333                  -0.5845733913890012
0.044167                  -0.5878195532520885
0.045                     -0.5907820728195847
0.045833                  -0.5934676526767461
0.046667                  -0.5958816197448673
0.0475                    -0.5980209182407492
0.048333                  -0.59989146862422
0.049167                  -0.6014978534310705
0.05                      -0.6028391638983726
0.050833                  -0.6039205484986183
0.051667                  -0.6047458587807736
0.0525                    -0.6053162505683675
0.053333                  -0.605636112830605
0.054167                  -0.6057085815991148
0.055                     -0.6055367907833493
0.055833                  -0.6051243845420009
0.056667                  -0.604473800791266
0.0575                    -0.603590061429917
0.058333                  -0.6024760825665811
0.059167                  -0.6011336231979376
0.06                      -0.5995694999828185
0.060833                  -0.5977859196663987
0.061667                  -0.5957839831752663
0.0625                    -0.5935722060237167
0.063333                  -0.5911521060622216
0.064167                  -0.5885241485106792
0.065                     -0.5856984496063636
0.065833                  -0.5826758604124412
0.066667                  -0.57945623417901
0.0675                    -0.5760511879443042
0.068333                  -0.5724609295859757
0.069167                  -0.5686847253556115
0.07                      -0.5647355918076972
0.070833                  -0.5606131185871384
0.071667                  -0.556316011014045
0.0725                    -0.5518585829270541
0.073333                  -0.5472398318984573
0.074167                  -0.542457929344484
0.075                     -0.5375283836087138
0.075833                  -0.5324496274184095
0.076667                  -0.5272193261378781
0.0775                    -0.5218540796781443
0.078333                  -0.5163517840762227
0.079167                  -0.5107096271891782
0.08                      -0.5049451977724758
0.080833                  -0.49905588411678614
0.081667                  -0.49303842568121875
0.0825                    -0.48691129791276067
0.083333                  -0.4806714109558615
0.084167                  -0.4743150854176647
0.085                     -0.46786158219617874
0.085833                  -0.4613073634130153
0.086667                  -0.45464836068475317
0.0875                    -0.4479045203550283
0.088333                  -0.44107188704215344
0.089167                  -0.43414603342876296
0.09                      -0.4271474928419274
0.090833                  -0.4200719231863908
0.091667                  -0.41291456834944024
0.0925                    -0.40569645200965576
0.093333                  -0.3984128762995755
0.094167                  -0.3910587864192096
0.095                     -0.3836556018697915
0.095833                  -0.37619829998653187
0.096667                  -0.3686815572553715
0.0975                    -0.36112709682537064
0.098333                  -0.3535296021327463
0.099167                  -0.3458835106847848
0.1                       -0.3382107596932611
0.100833                  -0.33050576940867044
0.101667                  -0.3227627677621685
0.1025                    -0.31500381924722265
0.103333                  -0.3072231113559874
0.104167                  -0.2994146914204893
0.105                     -0.2916006674369898
0.105833                  -0.28377502418300465
0.106667                  -0.2759316568572615
0.1075                    -0.26809263636009006
0.108333                  -0.26025177432304336
0.109167                  -0.2524028416848253
0.11                      -0.244567794991733
0.110833                  -0.2367403017361882
0.111667                  -0.22891403580217448
0.1125                    -0.22111076560610313
0.113333                  -0.2133240428656872
0.114167                  -0.20554747087668326
0.115                     -0.1978025597563277
0.115833                  -0.19008277309368402
0.116667                  -0.18238166925959948
0.1175                    -0.17472043361501782
0.118333                  -0.16709246847859124
0.119167                  -0.159491312096448
0.12                      -0.15193776241742626
0.120833                  -0.1444251864955429
0.121667                  -0.13694712633542114
0.1225                    -0.12952393369084383
0.123333                  -0.12214896544580457
0.124167                  -0.11481579028109162
0.125                     -0.10754425890034676
0.125833                  -0.1003277421478347
0.126667                  -0.09315985728923917
0.1275                    -0.08605990308978448
0.128333                  -0.07902128747248137
0.129167                  -0.07203769714972623
0.13                      -0.06512783205032377
0.130833                  -0.058285159240265755
0.131667                  -0.05150345466096755
0.1325                    -0.04480077650507075
0.133333                  -0.03817067195508783
0.134167                  -0.03160702485652146
0.135                     -0.02512721275813074
0.135833                  -0.018724882810359073
0.136667                  -0.012394044308014789
0.1375                    -0.006151359220267882
0.138333                  9.406631609299582E-6
0.139167                  0.006094102105511668
0.14                      0.012086811809546955
0.140833                  0.01799363371784506
0.141667                  0.02382025960336772
0.1425                    0.029551547757052918
0.143333                  0.0351934435999844
0.144167                  0.04075146775112574
0.145                     0.04621127545577134
0.145833                  0.05157864443015498
0.146667                  0.056858911242318524
0.1475                    0.062038547598981676
0.148333                  0.06712314956268133
0.149167                  0.07211785792534232
0.15                      0.07700997667773418
0.150833                  0.08180490748470456
0.151667                  0.08650758480395974
0.1525                    0.09110615713819785
0.153333                  0.09560582021337087
0.154167                  0.10001129275284647
0.155                     0.10431157650402723
0.155833                  0.10851165090833517
0.156667                  0.11261601070089682
0.1575                    0.11661451621837189
0.158333                  0.1205119214575494
0.159167                  0.12431249004113815
0.16                      0.12800694296709145
0.160833                  0.13159980079828873
0.161667                  0.13509509003145045
0.1625                    0.1384843912472971
0.163333                  0.14177198473885225
0.164167                  0.1449616549507086
0.165                     0.14804583794657764
0.165833                  0.15102856804481662
0.166667                  0.15391338377456595
0.1675                    0.1566935696948151
0.168333                  0.15937290955183966
0.169167                  0.16195469312980607
0.17                      0.16443304374703813
0.170833                  0.1668114910597443
0.171667                  0.16909307428091636
0.1725                    0.17127274314693539
0.173333                  0.1733537707557064
0.174167                  0.17533894489234358
0.175                     0.1772240269122179
0.175833                  0.17901203190274506
0.176667                  0.18070549629964425
0.1775                    0.18230097596919856
0.178333                  0.18380122751811004
0.179167                  0.18520853700810075
0.18                      0.18652023555215047
0.180833                  0.18773882174988857
0.181667                  0.18886633312325357
0.1825                    0.1899008547643752
0.183333                  0.19084462864505738
0.184167                  0.19169944639921127
0.185                     0.19246412398229878
0.185833                  0.19314064898213323
0.186667                  0.19373057057229304
0.1875                    0.19423341076254716
0.188333                  0.19465090582247202
0.189167                  0.19498436662666158
0.19                      0.195233994891247
0.190833                  0.19540127941228283
0.191667                  0.19548729761618105
0.1925                    0.19549290319276752
0.193333                  0.1954193420441204
0.194167                  0.19526746364341901
0.195                     0.19503874469075277
0.195833                  0.19473419346198048
0.196667                  0.1943544375726671
0.1975                    0.1939015466884691
0.198333                  0.19337629737054088
0.199167                  0.19277910202624432
0.2                       0.19211259231136746
0.200833                  0.19137731957983478
0.201667                  0.19057348818941
0.2025                    0.18970426002546503
0.203333                  0.18876996829209244
0.204167                  0.18777061691923563
0.205                     0.1867098656197011
0.205833                  0.18558783700823495
0.206667                  0.18440434262612437
0.2075                    0.18316350711042487
0.208333                  0.18186525050279753
0.209167                  0.1805092003678803
0.21                      0.1790999129983505
0.210833                  0.17763711428861892
0.211667                  0.17612025656656047
0.2125                    0.1745542942788548
0.213333                  0.17293876796166213
0.214167                  0.17127296372985812
0.215                     0.16956220057707874
0.215833                  0.16780584278809652
0.216667                  0.1660030195285218
0.2175                    0.16415938075019304
0.218333                  0.16227412386544043
0.219167                  0.16034623055264063
0.22                      0.158381648268685
0.220833                  0.15637941716104686
0.221667                  0.1543383810389415
0.2225                    0.1522647516604237
0.223333                  0.1501574217005356
0.224167                  0.14801510683332605
0.225                     0.14584425027069983
0.225833                  0.14364360715076355
0.226667                  0.14141177482244194
0.2275                    0.13915539556362153
0.228333                  0.13687309701220587
0.229167                  0.13456336804073554
0.23                      0.13223301816049596
0.230833                  0.12988055760796752
0.231667                  0.12750437662953132
0.2325                    0.12511142078387022
0.233333                  0.12270009302796243
0.234167                  0.12026869479863972
0.235                     0.11782427724739272
0.235833                  0.11536514615991429
0.236667                  0.1128895239124514
0.2375                    0.11040453760541033
0.238333                  0.10790840591189468
0.239167                  0.10539928179678867
0.24                      0.10288433954937042
0.240833                  0.1003617207051817
0.241667                  0.0978295183367285
0.2425                    0.09529492611298437
0.243333                  0.09275601829107137
0.244167                  0.09021083741068163
0.245                     0.08766656972346358
0.245833                  0.08512123192073423
0.246667                  0.08257282518191408
0.2475                    0.0800285026122038
0.248333                  0.07748623287364845
0.249167                  0.07494398474591916
0.25                      0.07240885357530474
0.250833                  0.06987876932829032
0.251667                  0.06735167710899799
0.2525                    0.06483459105295457
0.253333                  0.062325411536137396
0.254167                  0.0598220684528863
0.255                     0.057331472474825895
0.255833                  0.05485150324002117
0.256667                  0.052380083620271384
0.2575                    0.04992399980048657
0.258333                  0.047481119259330754
0.259167                  0.045049365735900085
0.26                      0.0426353811631146
0.260833                  0.04023702914408174
0.261667                  0.03785224186115187
0.2625                    0.03548749850833242
0.263333                  0.033140666784569305
0.264167                  0.030809694562003276
0.265                     0.028500881103515147
0.265833                  0.026212105845940668
0.266667                  0.02394133925538019
0.2675                    0.021694684776676004
0.268333                  0.01947004088274074
0.269167                  0.017265407183623568
0.27                      0.015086676730595338
0.270833                  0.012931773973952312
0.271667                  0.010798733853601517
0.2725                    0.008693225764200977
0.273333                  0.006613206706711579
0.274167                  0.004556752764456457
0.275                     0.002529297721480937
0.275833                  5.288373252000047E-4
0.276667                  -0.0014465057631342232
0.2775                    -0.0033915440228095375
0.278333                  -0.005308237149469522
0.279167                  -0.007198410853490449
0.28                      -0.009057133241024145
0.280833                  -0.010886314031619276
0.281667                  -0.012687722644525145
0.2825                    -0.01445669090302681
0.283333                  -0.016195073527346008
0.284167                  -0.01790457937254428
0.285                     -0.019580810815719434
0.285833                  -0.02122556295356364
0.286667                  -0.02284048019400348
0.2875                    -0.024421441074676708
0.288333                  -0.025970176844542912
0.289167                  -0.027488263971266382
0.29                      -0.028971861555860016
0.290833                  -0.0304226331760278
0.291667                  -0.03184208425304169
0.2925                    -0.03322665768063052
0.293333                  -0.03457794594031455
0.294167                  -0.03589738068509268
0.295                     -0.03718169068929359
0.295833                  -0.038432394309643826
0.296667                  -0.03965084708827275
0.2975                    -0.0408340646620844
0.298333                  -0.041983488626446054
0.299167                  -0.043100396443567085
0.3                       -0.04418209052684859
0.300833                  -0.045229933460405214
0.301667                  -0.046245123024290825
0.3025                    -0.04722524729380926
0.303333                  -0.04817158797251927
0.304167                  -0.04908526191494021
0.305                     -0.04996414075716951
0.305833                  -0.05080942382584805
0.306667                  -0.05162214615638455
0.3075                    -0.05240045990207287
0.308333                  -0.05314548088027185
0.309167                  -0.05385816175446282
0.31                      -0.05453693125336659
0.310833                  -0.055182820908071493
0.311667                  -0.055796700786503756
0.3125                    -0.05637727140040239
0.313333                  -0.05692547956180057
0.314167                  -0.05744211283794581
0.315                     -0.05792613792771243
0.315833                  -0.05837841682442958
0.316667                  -0.058799654996183046
0.3175                    -0.059189078977800284
0.318333                  -0.05954746616608726
0.319167                  -0.059875440624718425
0.32                      -0.06017248166808669
0.320833                  -0.06043928262692952
0.321667                  -0.06067638713616103
0.3225                    -0.06088351957716633
0.323333                  -0.061061290040857495
0.324167                  -0.061210162975490354
0.325                     -0.061330099511446405
0.325833                  -0.061421627607594474
0.326667                  -0.061485134020305504
0.3275                    -0.061520807755659025
0.328333                  -0.0615290960154183
0.329167                  -0.06151030959729781
0.33                      -0.06146485600420541
0.330833                  -0.06139310330907275
0.331667                  -0.06129528830684417
0.3325                    -0.061172027164023854
0.333333                  -0.06102361069001592
0.334167                  -0.06085020384164915
0.335                     -0.060652621210118704
0.335833                  -0.060431078429439
0.336667                  -0.06018567097545164
0.3375                    -0.059917401269573595
0.338333                  -0.05962641206518466
0.339167                  -0.059312731891877433
0.34                      -0.058977540099600004
0.340833                  -0.05862090904682221
0.341667                  -0.05824280301385885
0.3425                    -0.05784456711801454
0.343333                  -0.057426205984020824
0.344167                  -0.05698762248620457
0.345                     -0.05653031613595502
0.345833                  -0.05605422664470022
0.346667                  -0.055559198455133824
0.3475                    -0.05504687393334258
0.348333                  -0.05451713084122573
0.349167                  -0.053969758280038964
0.35                      -0.05340652980959152
0.350833                  -0.05282726433403132
0.351667                  -0.052231698803370724
0.3525                    -0.051621726232974195
0.353333                  -0.05099710987260951
0.354167                  -0.05035753779676805
0.355                     -0.04970501070287981
0.355833                  -0.04903923948610764
0.356667                  -0.0483598666915265
0.3575                    -0.047668988930959576
0.358333                  -0.04696626812590873
0.359167                  -0.04625130469350846
0.36                      -0.04552627943818129
0.360833                  -0.04479080875414437
0.361667                  -0.04404445437373102
0.3625                    -0.043289469655463736
0.363333                  -0.04252542896391488
0.364167                  -0.04175185881674632
0.365                     -0.04097107360835712
0.365833                  -0.04018260920746747
0.366667                  -0.03938596040106734
0.3675                    -0.03858349125592881
0.368333                  -0.03777470270106753
0.369167                  -0.03695906127699458
0.37                      -0.03613896954755875
0.370833                  -0.03531389706647614
0.371667                  -0.03448328559944058
0.3725                    -0.033649565251741606
0.373333                  -0.032812177761093
0.374167                  -0.03197054356507388
0.375                     -0.031127109603979852
0.375833                  -0.03028129334096677
0.376667                  -0.029432497295185413
0.3775                    -0.028583174812812008
0.378333                  -0.027732722593272627
0.379167                  -0.026880528598617275
0.38                      -0.026029042455343352
0.380833                  -0.025177643567379816
0.381667                  -0.024325708641685987
0.3825                    -0.02347567378717819
0.383333                  -0.022626904526795
0.384167                  -0.02177876954435517
0.385                     -0.02093368198402417
0.385833                  -0.020090996837037554
0.386667                  -0.019250077916511125
0.3875                    -0.018413306325846306
0.388333                  -0.017580029798600835
0.389167                  -0.016749610340500796
0.39                      -0.015924388328502147
0.390833                  -0.015103707427355938
0.391667                  -0.014286930800773832
0.3925                    -0.013476349821318729
0.393333                  -0.01267130717919989
0.394167                  -0.011871170055545157
0.395                     -0.01107817296360238
0.395833                  -0.010291660610246398
0.396667                  -0.009511006939648384
0.3975                    -0.008738382187881205
0.398333                  -0.007973135958331509
0.399167                  -0.007214651583152793
0.4                       -0.006465028052409352
0.400833                  -0.0057236226270808545
0.401667                  -0.004989830525048646
0.4025                    -0.004265672981004848
0.403333                  -0.003550517548946923
0.404167                  -0.002843773697146195
0.405                     -0.002147378863861135
0.405833                  -0.0014607133995498428
0.406667                  -7.832032491899102E-4
0.4075                    -1.1669648902263164E-4
0.408333                  5.394113682589131E-4
0.409167                  0.0011856758176739392
0.41                      0.0018203432294805315
0.410833                  0.002444000705727381
0.411667                  0.003057183245269979
0.4125                    0.0036582362641321285
0.413333                  0.00424772740329216
0.414167                  0.0048261693799947075
0.415                     0.005392010767373227
0.415833                  0.0059457978207101345
0.416667                  0.006488019343742916
0.4175                    0.007017230689040153
0.418333                  0.007533954955959038
0.419167                  0.008038655558837825
0.42                      0.008529997763112064
0.420833                  0.009008479899091263
0.421667                  0.009474538673712224
0.4225                    0.00992695191121726
0.423333                  0.0103661917191285
0.424167                  0.010792666937970723
0.425                     0.011205270112207446
0.425833                  0.011604445833611676
0.426667                  0.011990574077190773
0.4275                    0.012362663788389497
0.428333                  0.012721130912156256
0.429167                  0.013066325718934473
0.43                      0.013397374760455518
0.430833                  0.013714664366211908
0.431667                  0.014018514422618722
0.4325                    0.014308169824086
0.433333                  0.014583986478129486
0.434167                  0.014846253366774594
0.435                     0.015094334001634294
0.435833                  0.015328553223642969
0.436667                  0.015549168747480078
0.4375                    0.015755662523413667
0.438333                  0.015948327841666474
0.439167                  0.016127390942601183
0.44                      0.01629245159261697
0.440833                  0.016443771206263644
0.441667                  0.01658154449608469
0.4425                    0.0167054879887
0.443333                  0.01681583105496697
0.444167                  0.01691273697701072
0.445                     0.016996037563472115
0.445833                  0.01706593012796722
0.446667                  0.017122546767445887
0.4475                    0.017165832684054742
0.448333                  0.017195953272216912
0.449167                  0.017213009833136353
0.45                      0.017217058676536993
0.450833                  0.01720823356386547
0.451667                  0.017186605530276712
0.4525                    0.017152339323378424
0.453333                  0.017105537502072405
0.454167                  0.017046241501328573
0.455                     0.016974721467061613
0.455833                  0.016891049326517533
0.456667                  0.01679523771142764
0.4575                    0.016687658771905086
0.458333                  0.016568354509819323
0.459167                  0.016437309677104946
0.46                      0.016294994694548492
0.460833                  0.01614142247570955
0.461667                  0.015976550937113913
0.4625                    0.01580094471336392
0.463333                  0.015614588592353857
0.464167                  0.01541741481476473
0.465                     0.015210077865579303
0.465833                  0.014992535489412394
0.466667                  0.014764695520163152
0.4675                    0.014527297639926972
0.468333                  0.014280273746564206
0.469167                  0.014023508639268656
0.47                      0.013757822271856188
0.470833                  0.013483121999733016
0.471667                  0.013199271056197118
0.4725                    0.012907164486916416
0.473333                  0.01260668651067731
0.474167                  0.012297680353586943
0.475                     0.011981110737168971
0.475833                  0.011656840244180112
0.476667                  0.011324693735234178
0.4775                    0.010985699974168088
0.478333                  0.01063970149617477
0.479167                  0.010286506513929861
0.48                      0.009927202001282089
0.480833                  0.009561612115167777
0.481667                  0.009189530206413903
0.4825                    0.008812095446974023
0.483333                  0.008429115358358419
0.484167                  0.008040370276644053
0.485                     0.007647045399816886
0.485833                  0.007248933422794611
0.486667                  0.006845803567491226
0.4875                    0.006438880745123156
0.488333                  0.006027944691385453
0.489167                  0.005612755460187616
0.49                      0.005194571242361843
0.490833                  0.004773160732430305
0.491667                  0.00434827680023239
0.4925                    0.003921204381610622
0.493333                  0.0034917030900864124
0.494167                  0.0030595206222138217
0.495                     0.0026259620143054
0.495833                  0.002190779635654912
0.496667                  0.0017537169963136106
0.4975                    0.0013160876608422326
0.498333                  8.776217078489698E-4
0.499167                  4.3809686617360356E-4
0.5                       -1.4591556835262306E-17
