
0                         NaN
2.0000000000000226E-4     NaN
3.999999999999941E-4      NaN
5.999999999999929E-4      NaN
7.999999999999986E-4      NaN
9.999999999999905E-4      NaN
0.0011999999999999927     NaN
0.001399999999999988      NaN
0.0015999999999999903     NaN
0.001799999999999996      NaN
0.0019999999999999914     NaN
0.0021999999999999936     NaN
0.002399999999999989      NaN
0.0025999999999999877     NaN
0.0027999999999999935     NaN
0.0029999999999999923     NaN
0.003199999999999998      NaN
0.00339999999999999       NaN
0.003599999999999992      NaN
0.0037999999999999944     NaN
0.003999999999999993      NaN
0.004199999999999995      NaN
0.004399999999999987      NaN
0.0045999999999999895     NaN
0.004799999999999995      NaN
0.004999999999999994      NaN
0.0052                    NaN
0.005399999999999992      NaN
0.005599999999999994      NaN
0.0058                    NaN
0.005999999999999995      NaN
0.006200000000000001      NaN
0.006399999999999989      NaN
0.006599999999999991      NaN
0.006799999999999997      NaN
0.006999999999999992      NaN
0.007199999999999995      NaN
0.007399999999999993      NaN
0.007599999999999992      NaN
0.007799999999999998      NaN
0.007999999999999997      NaN
0.008199999999999999      NaN
0.00839999999999999       NaN
0.008599999999999993      NaN
0.008800000000000002      NaN
0.008999999999999998      NaN
0.009200000000000003      NaN
0.009399999999999995      NaN
0.009599999999999997      NaN
0.009800000000000003      NaN
0.009999999999999998      NaN
0.009999999999999998      5.535417135739989E-6
0.01019999999999889       5.466288959803965E-6
0.010399999999997769      5.40329302742002E-6
0.010599999999996657      5.346646099277303E-6
0.010799999999995553      5.29655188819376E-6
0.010999999999994434      5.2531978565822985E-6
0.01119999999999444       5.188015132876988E-6
0.011399999999994439      5.128652633577209E-6
0.011599999999994452      5.0753145883988605E-6
0.011799999999994457      5.028192719547272E-6
0.01199999999999447       4.987463222619303E-6
0.012199999999994483      4.925988763191749E-6
0.012399999999994481      4.870039513193256E-6
0.012599999999994494      4.819807889521822E-6
0.012799999999994507      4.7754743210063415E-6
0.012999999999994506      4.737204403036259E-6
0.013199999999994511      4.679221974663737E-6
0.013399999999994517      4.626497202329288E-6
0.013599999999994523      4.579211698655161E-6
0.013799999999994528      4.5375355141304075E-6
0.013999999999994534      4.501624445224629E-6
0.01419999999999454       4.446881519791397E-6
0.014399999999994539      4.397135341677692E-6
0.014599999999994544      4.352557240490949E-6
0.014799999999994564      4.313307455679437E-6
0.01499999999999457       4.279532595908096E-6
0.015199999999994582      4.227816645968619E-6
0.015399999999994588      4.180852033019698E-6
0.015599999999994594      4.13880050614507E-6
0.0157999999999946        4.101813174062731E-6
0.015999999999994605      4.0700281052774835E-6
0.016199999999994618      4.0211354807087475E-6
0.01639999999999461       3.976762838398625E-6
0.016599999999994616      3.937063008602882E-6
0.016799999999994635      3.902178614151002E-6
0.01699999999999464       3.872239801710769E-6
0.017199999999994654      3.825982625219383E-6
0.017399999999994652      3.7840266710607615E-6
0.017599999999994658      3.7465164457678297E-6
0.017799999999994678      3.7135866681430065E-6
0.017999999999994677      3.685360123176726E-6
0.018199999999994682      3.6415750175500436E-6
0.018399999999994674      3.60188457690042E-6
0.018599999999994687      3.566425511363827E-6
0.0187999999999947        3.535325144428084E-6
0.018999999999994705      3.5086993817466406E-6
0.01919999999999471       3.4672265844399175E-6
0.01939999999999471       3.429652975830077E-6
0.019599999999994722      3.396107977050918E-6
0.019799999999994735      3.3667120101596484E-6
0.01999999999999474       3.3415745745551045E-6
0.020199999999994753      3.302271795822828E-6
0.020399999999994752      3.266683233628864E-6
0.020599999999994758      3.23493147430794E-6
0.020799999999994778      3.2071304771205625E-6
0.020999999999994776      3.183383751653921E-6
0.02119999999999479       3.1461175869363796E-6
0.02139999999999478       3.1123904892869004E-6
0.021599999999994787      3.0823186355751236E-6
0.021799999999994813      3.056009933076266E-6
0.021999999999994812      3.0335622916539697E-6
0.022199999999994825      2.9982098767910692E-6
0.02239999999999483       2.9662305906793855E-6
0.022599999999994836      2.937734591948168E-6
0.022799999999994842      2.912824112820337E-6
0.022999999999994847      2.891591820360946E-6
0.02319999999999486       2.8580390335455655E-6
0.023399999999994852      2.827702089168404E-6
0.023599999999994858      2.8006854909164983E-6
0.023799999999994877      2.7770861454226738E-6
0.023999999999994876      2.756991807258862E-6
0.024199999999994882      2.725132851231075E-6
0.02439999999999488       2.696340583633251E-6
0.024599999999994893      2.6707141897925283E-6
0.024799999999994913      2.648345573880643E-6
0.02499999999999491       2.629317882712129E-6
0.025199999999994924      2.5990544456919375E-6
0.025399999999994916      2.5717161939523827E-6
0.02559999999999493       2.5473973070660783E-6
0.02579999999999494       2.5261849863188486E-6
0.025999999999994947      2.508158052715715E-6
0.02619999999999496       2.4793987377716855E-6
0.026399999999994952      2.453430307667225E-6
0.026599999999994964      2.4303422266321842E-6
0.026799999999994977      2.4102172708654292E-6
0.026999999999994983      2.393130196470646E-6
0.027199999999994996      2.3657899326122208E-6
0.027399999999994987      2.3411130380306706E-6
0.027599999999995         2.3191845316885023E-6
0.02779999999999502       2.30008302259014E-6
0.02799999999999502       2.283879443663726E-6
0.02819999999999503       2.2578789689449465E-6
0.02839999999999503       2.234420742194878E-6
0.02859999999999503       2.2135855884582763E-6
0.02879999999999504       2.1954481891500625E-6
0.028999999999995047      2.180075878171917E-6
0.029199999999995067      2.1553412565530436E-6
0.029399999999995065      2.133033790142691E-6
0.029599999999995064      2.113230344202822E-6
0.029799999999995084      2.096001895396783E-6
0.02999999999999509       2.0814123866818123E-6
0.03019999999999511       2.057874563303282E-6
0.030399999999995094      2.036654488102367E-6
0.0305999999999951        2.0178252848755257E-6
0.03079999999999512       2.001454433010436E-6
0.03099999999999512       1.9876026779288403E-6
0.03119999999999513       1.9651970671661187E-6
0.031399999999995126      1.945005161778346E-6
0.03159999999999513       1.927096547905212E-6
0.03179999999999516       1.9115354010872086E-6
0.03199999999999516       1.8983794492484278E-6
0.03219999999999518       1.8770455547402105E-6
0.03239999999999517       1.8578263855958946E-6
0.03259999999999517       1.8407881808257368E-6
0.032799999999995194      1.8259919927327849E-6
0.03299999999999519       1.8134926996229863E-6
0.033199999999995206      1.79317376599779E-6
0.0333999999999952        1.7748753581661698E-6
0.0335999999999952        1.7586605464029266E-6
0.03379999999999523       1.7445874287088492E-6
0.03399999999999522       1.732708190616535E-6
0.034199999999995234      1.7133508875974308E-6
0.034399999999995226      1.6959244271799927E-6
0.03459999999999524       1.6804888782298665E-6
0.034799999999995265      1.66709954276173E-6
0.034999999999995264      1.6558060603742423E-6
0.03519999999999528       1.637360200173553E-6
0.03539999999999526       1.6207597692829173E-6
0.035599999999995274      1.6060619923941242E-6
0.035799999999995294      1.5933195241925833E-6
0.03599999999999529       1.582579596104697E-6
0.0361999999999953        1.564997884715696E-6
0.036399999999995304      1.5491802296495223E-6
0.0365999999999953        1.5351811594479458E-6
0.036799999999995316      1.5230508213206738E-6
0.03699999999999533       1.5128341680243293E-6
0.03719999999999534       1.4960719903405794E-6
0.03739999999999534       1.4809963228062662E-6
0.037599999999995345      1.4676591374001126E-6
0.037799999999995365      1.456108205651869E-6
0.037999999999995364      1.4463863235953488E-6
0.03819999999999537       1.4304015610982045E-6
0.03839999999999537       1.4160293910910862E-6
0.03859999999999537       1.403319360804412E-6
0.03879999999999538       1.3923169904573872E-6
0.03899999999999539       1.3830630343398047E-6
0.039199999999995405      1.3678159127962787E-6
0.039399999999995404      1.3541109104005842E-6
0.03959999999999541       1.3419952742311625E-6
0.03979999999999543       1.3315123906585852E-6
0.039999999999995435      1.3227010807138554E-6
0.040199999999995455      1.3081540438797882E-6
0.04039999999999544       1.2950819258074787E-6
0.040599999999995445      1.283529791249153E-6
0.040799999999995465      1.2735390036947065E-6
0.040999999999995464      1.2651465532799109E-6
0.04119999999999547       1.2512641573289818E-6
0.04139999999999546       1.2387925927627817E-6
0.04159999999999547       1.2277748534154062E-6
0.0417999999999955        1.218250384691944E-6
0.0419999999999955        1.210254442360149E-6
0.04219999999999552       1.1970032648014907E-6
0.042399999999995504      1.1851017942061645E-6
0.04259999999999551       1.174591058755431E-6
0.04279999999999554       1.1655086846429031E-6
0.042999999999995535      1.1578882841795E-6
0.043199999999995554      1.1452368405601597E-6
0.04339999999999553       1.1338768007394184E-6
0.04359999999999554       1.1238473265869668E-6
0.04379999999999556       1.1151843182367019E-6
0.043999999999995563      1.1079198300184966E-6
0.04419999999999558       1.095838491845429E-6
0.044399999999995575      1.0849929407556167E-6
0.044599999999995595      1.0754205659120458E-6
0.044799999999995614      1.0671556289975961E-6
0.044999999999995606      1.0602287065692629E-6
0.045199999999995626      1.0486896146714814E-6
0.045399999999995604      1.0383332503886604E-6
0.04559999999999561       1.0291953182278447E-6
0.04579999999999564       1.0213085236685931E-6
0.045999999999995635      1.0147020406162103E-6
0.046199999999995654      1.0036790095674625E-6
0.04639999999999563       9.937880792955505E-7
0.04659999999999565       9.85063352349255E-7
0.04679999999999567       9.77536055100353E-7
0.04699999999999568       9.712340290520944E-7
0.04719999999999568       9.607024401763327E-7
0.04739999999999569       9.512546371569806E-7
0.04759999999999568       9.429231981685783E-7
0.047799999999995714      9.357379426720733E-7
0.047999999999995706      9.297254454126611E-7
0.04819999999999571       9.19662128115085E-7
0.04839999999999572       9.106364765611709E-7
0.04859999999999572       9.026796173125336E-7
0.04879999999999574       8.958200305264676E-7
0.048999999999995734      8.900830855524452E-7
0.049199999999995754      8.804661890254413E-7
0.049399999999995746      8.718429195095191E-7
0.04959999999999575       8.64243020239246E-7
0.049799999999995785      8.576936954514128E-7
0.04999999999999578       8.522191665607049E-7
0.0501999999999958        8.430280260449179E-7
0.050399999999995775      8.347884458667489E-7
0.05059999999999578       8.275288501434351E-7
0.050799999999995814      8.212752267653476E-7
0.050999999999995806      8.160507031973523E-7
0.051199999999995825      8.072657066743292E-7
0.0513999999999958        7.993920713498707E-7
0.05159999999999582       7.924569627953253E-7
0.05179999999999584       7.864852087672524E-7
0.05199999999999585       7.81498893740527E-7
0.052199999999995854      7.731013559679471E-7
0.052399999999995846      7.655767489049749E-7
0.05259999999999585       7.589510369654716E-7
0.052799999999995885      7.532479410795884E-7
0.05299999999999588       7.484885511168055E-7
0.05319999999999588       7.404606021260212E-7
0.05339999999999589       7.332688296253456E-7
0.053599999999995894      7.269380515221483E-7
0.053799999999995914      7.214909327586245E-7
0.053999999999995905      7.169476148271934E-7
0.054199999999995925      7.092721093073864E-7
0.05439999999999592       7.023976171894707E-7
0.05459999999999592       6.963478621943867E-7
0.05479999999999594       6.911445020320202E-7
0.05499999999999595       6.868067742477757E-7
0.05519999999999597       6.79467226668643E-7
0.055399999999995946      6.728950431174159E-7
0.05559999999999595       6.671129034565821E-7
0.055799999999995985      6.621415051449524E-7
0.05599999999999598       6.57999224683468E-7
0.056199999999995996      6.509797726956748E-7
0.056399999999995974      6.446954794885065E-7
0.05659999999999598       6.391680296495233E-7
0.05679999999999601       6.344172058025601E-7
0.05699999999999602       6.304605649441822E-7
0.057199999999996025      6.237459607821715E-7
0.05739999999999603       6.177356921912677E-7
0.057599999999996036      6.124504954643994E-7
0.05779999999999604       6.079092823396971E-7
0.05799999999999605       6.041288305382852E-7
0.058199999999996054      5.977044571530453E-7
0.058399999999996045      5.919549227899516E-7
0.05859999999999605       5.869000608548952E-7
0.058799999999996085      5.825579546699903E-7
0.058999999999996076      5.789446415406797E-7
0.059199999999996096      5.727965473724956E-7
0.05939999999999609       5.672950724709709E-7
0.059599999999996094      5.624591911175814E-7
0.05979999999999613       5.583061990971004E-7
0.05999999999999612       5.548514306394689E-7
0.06019999999999614       5.489663746654717E-7
0.060399999999996117      5.437009491194433E-7
0.06059999999999612       5.390733111208183E-7
0.06079999999999614       5.351000080185837E-7
0.06099999999999615       5.317957065730794E-7
0.06119999999999617       5.261612038457015E-7
0.061399999999996145      5.211205300429899E-7
0.06159999999999615       5.166910650759768E-7
0.061799999999996184      5.128886449547695E-7
0.06199999999999619       5.097273025990108E-7
0.062199999999996196      5.043316601524647E-7
0.0623999999999962        4.995051894788545E-7
0.06259999999999621       4.952645310007161E-7
0.06279999999999622       4.91624844251488E-7
0.06299999999999623       4.885995597318196E-7
0.06319999999999623       4.834318935762079E-7
0.06339999999999622       4.788098424902341E-7
0.06359999999999622       4.7474934269218557E-7
0.06379999999999625       4.7126490967405613E-7
0.06399999999999625       4.683694005545463E-7
0.06419999999999629       4.63419626464111E-7
0.06439999999999627       4.589929652022154E-7
0.06459999999999627       4.551046814907345E-7
0.0647999999999963        4.5176867667105755E-7
0.0649999999999963        4.489972610430146E-7
0.06519999999999632       4.4425605480352406E-7
0.06539999999999631       4.4001646487497924E-7
0.0655999999999963        4.362931145670021E-7
0.06579999999999632       4.3309931840410004E-7
0.06599999999999633       4.3044686398164887E-7
0.06619999999999635       4.2590559039912745E-7
0.06639999999999632       4.218453907601912E-7
0.06659999999999633       4.1828027449164196E-7
0.06679999999999636       4.15222994188405E-7
0.06699999999999637       4.1268483656122003E-7
0.06719999999999637       4.0833545046665753E-7
0.06739999999999637       4.0444749622753583E-7
0.06759999999999637       4.010343945577541E-7
0.0677999999999964        3.9810835880266757E-7
0.0679999999999964        3.9568019459592603E-7
0.0681999999999964        3.9151512086870644E-7
0.06839999999999638       3.877926821379881E-7
0.0685999999999964        3.8452573353194495E-7
0.06879999999999642       3.8172596997631014E-7
0.06899999999999643       3.7940373421725587E-7
0.06919999999999644       3.754157370425139E-7
0.06939999999999644       3.7185236859909836E-7
0.06959999999999644       3.6872593993202517E-7
0.06979999999999648       3.6604764697667574E-7
0.06999999999999647       3.6382738663819215E-7
0.07019999999999649       3.6000944038881034E-7
0.07039999999999647       3.565988548752378E-7
0.07059999999999647       3.5360741742188647E-7
0.07079999999999649       3.510458435039508E-7
0.0709999999999965        3.4892360059933337E-7
0.07119999999999652       3.4526877555152536E-7
0.0713999999999965        3.420047334782099E-7
0.07159999999999651       3.391427577100216E-7
0.07179999999999653       3.36693101396243E-7
0.07199999999999654       3.3466481886133236E-7
0.07219999999999654       3.311661942009866E-7
0.07239999999999652       3.2804242304728765E-7
0.07259999999999653       3.2530430429829623E-7
0.07279999999999658       3.2296164696501396E-7
0.07299999999999657       3.210231087706972E-7
0.07319999999999657       3.1767372298706175E-7
0.07339999999999657       3.1468387507304297E-7
0.07359999999999657       3.1206389927125675E-7
0.0737999999999966        3.0982317903708273E-7
0.0739999999999966        3.0796999261579983E-7
0.0741999999999966        3.047628375746816E-7
0.0743999999999966        3.019004923559434E-7
0.0745999999999966        2.993928467855297E-7
0.07479999999999662       2.972488779311363E-7
0.07499999999999662       2.954765023816426E-7
0.07519999999999666       2.924045624968132E-7
0.07539999999999664       2.8966327391255415E-7
0.07559999999999664       2.872621028156147E-7
0.07579999999999668       2.8520963965104854E-7
0.07599999999999667       2.8351345781326833E-7
0.07619999999999669       2.805697903488812E-7
0.07639999999999668       2.7794317441399967E-7
0.07659999999999668       2.756426737680211E-7
0.0767999999999967        2.736765124236514E-7
0.07699999999999671       2.720519394426348E-7
0.07719999999999672       2.6922978675195943E-7
0.0773999999999967        2.6671163941220975E-7
0.0775999999999967        2.6450618012596263E-7
0.07779999999999675       2.626212867517489E-7
0.07799999999999674       2.610639028837518E-7
0.07819999999999674       2.583568230111872E-7
0.07839999999999674       2.5594125406373526E-7
0.07859999999999674       2.538255188012973E-7
0.07879999999999678       2.520171688308648E-7
0.07899999999999677       2.5052286064159526E-7
0.07919999999999677       2.479248597888823E-7
0.07939999999999678       2.4560642599201724E-7
0.07959999999999678       2.43575542421143E-7
0.07979999999999679       2.418394534249579E-7
0.0799999999999968        2.404045456932068E-7
0.08019999999999682       2.3791019500009872E-7
0.08039999999999681       2.356840147455505E-7
0.08059999999999681       2.3373366756790674E-7
0.08079999999999686       2.3206610810171453E-7
0.08099999999999684       2.3068746895047545E-7
0.08119999999999686       2.2829198904966477E-7
0.08139999999999682       2.2615382229545453E-7
0.08159999999999684       2.2428032805966708E-7
0.08179999999999689       2.2267818687822982E-7
0.08199999999999688       2.2135329093852633E-7
0.08219999999999689       2.1905259074820566E-7
0.08239999999999688       2.1699887120685704E-7
0.08259999999999688       2.1519920349286535E-7
0.08279999999999692       2.1366000737208987E-7
0.08299999999999691       2.1238694593567563E-7
0.08319999999999692       2.1017760686235325E-7
0.08339999999999691       2.082054183913531E-7
0.08359999999999691       2.0647717614128942E-7
0.08379999999999693       2.0499904996285683E-7
0.08399999999999694       2.0377648270273203E-7
0.08419999999999696       2.0165568538362579E-7
0.08439999999999694       1.9976268065388073E-7
0.08459999999999694       1.9810399871317657E-7
0.08479999999999696       1.9668556789942075E-7
0.08499999999999697       1.9551261729956577E-7
0.08519999999999699       1.934780146458822E-7
0.08539999999999698       1.9166228088350263E-7
0.085599999999997         1.90071688606667E-7
0.08579999999999702       1.8871193083714036E-7
0.08599999999999701       1.8758802734967443E-7
0.08619999999999703       1.8563757431388574E-7
0.086399999999997         1.8389745756398457E-7
0.08659999999999701       1.8237369796383556E-7
0.08679999999999706       1.8107175767817562E-7
0.08699999999999705       1.7999645012465205E-7
0.08719999999999706       1.7812820661325344E-7
0.08739999999999705       1.764621118566123E-7
0.08759999999999706       1.750039395168043E-7
0.08779999999999709       1.7375892428238366E-7
0.08799999999999708       1.7273167539569888E-7
0.0881999999999971        1.7094360336370024E-7
0.08839999999999706       1.693497921979437E-7
0.08859999999999708       1.6795577228713225E-7
0.0887999999999971        1.6676655393755368E-7
0.08899999999999711       1.6578654444920025E-7
0.08919999999999713       1.6407632273883097E-7
0.0893999999999971        1.6255273250915444E-7
0.08959999999999711       1.612210650271662E-7
0.08979999999999716       1.6008610986091242E-7
0.08999999999999714       1.591520754872893E-7
0.09019999999999717       1.57516955807977E-7
0.09039999999999715       1.5606106345428166E-7
0.09059999999999716       1.5478945574656982E-7
0.09079999999999719       1.5370670648519562E-7
0.09099999999999718       1.5281683006495605E-7
0.0911999999999972        1.5125355428915085E-7
0.09139999999999716       1.4986230444937386E-7
0.09159999999999717       1.4864791078393538E-7
0.09179999999999722       1.4761473822676752E-7
0.09199999999999721       1.4676661397900288E-7
0.09219999999999723       1.4527140668030703E-7
0.0923999999999972        1.4394121686341533E-7
0.09259999999999721       1.4278065666818624E-7
0.09279999999999726       1.4179389132931038E-7
0.09299999999999725       1.4098457011762026E-7
0.09319999999999727       1.3955321155337952E-7
0.09339999999999725       1.382800581144171E-7
0.09359999999999727       1.3716951506454695E-7
0.09379999999999729       1.3622555937712835E-7
0.09399999999999728       1.3545167391299457E-7
0.09419999999999731       1.3407964853203258E-7
0.09439999999999729       1.3285922691059632E-7
0.0945999999999973        1.3179462068026907E-7
0.09479999999999733       1.3088963192475348E-7
0.09499999999999732       1.3014759041451993E-7
0.09519999999999734       1.2883029591218562E-7
0.09539999999999732       1.2765823864112168E-7
0.09559999999999733       1.2663545133611847E-7
0.09579999999999736       1.2576557585948503E-7
0.09599999999999735       1.2505180327148396E-7
0.09619999999999737       1.2378479676654022E-7
0.09639999999999735       1.2265692465364175E-7
0.09659999999999735       1.2167205622621965E-7
0.09679999999999739       1.2083368823724328E-7
0.09699999999999738       1.201448875549267E-7
0.0971999999999974        1.1892413991046869E-7
0.09739999999999738       1.1783671675438276E-7
0.09759999999999738       1.1688633920013786E-7
0.09779999999999742       1.1607637348709638E-7
0.09799999999999742       1.1540977595668078E-7
0.09819999999999743       1.1423190334608537E-7
0.09839999999999742       1.131818631975044E-7
0.09859999999999743       1.1226324256291047E-7
0.09879999999999746       1.1147929029066437E-7
0.09899999999999745       1.1083286406013614E-7
0.09919999999999746       1.0969530766965642E-7
0.09939999999999743       1.0868042596742554E-7
0.09959999999999745       1.0779168403422435E-7
0.09979999999999749       1.0703222412040017E-7
0.09999999999999748       1.064048144969841E-7
0.10019999999999751       1.0530594428162849E-7
0.10039999999999748       1.0432492963716044E-7
0.1005999999999975        1.0346512299512672E-7
0.10079999999999753       1.0272956779253045E-7
0.10099999999999752       1.0212094893374575E-7
0.10119999999999754       1.0106007481757437E-7
0.10139999999999752       1.0011256599160402E-7
0.10159999999999753       9.92816682625616E-8
0.10179999999999756       9.857033059118708E-8
0.10199999999999755       9.798115700990169E-8
0.10219999999999757       9.695844003372694E-8
0.10239999999999753       9.60449019655562E-8
0.10259999999999755       9.524368445412772E-8
0.10279999999999759       9.455764272784226E-8
0.1029999999999976        9.398929887556207E-8
0.1031999999999976        9.300556489601406E-8
0.10339999999999759       9.21270879047885E-8
0.1035999999999976        9.135690436792165E-8
0.10379999999999763       9.069777313278169E-8
0.10399999999999762       9.015213004962497E-8
0.10419999999999764       8.920859921462318E-8
0.10439999999999762       8.836661624913073E-8
0.10459999999999763       8.76291083655545E-8
0.10479999999999766       8.699873258098731E-8
0.10499999999999765       8.647783172923153E-8
0.10519999999999768       8.557578762971961E-8
0.10539999999999766       8.477173519829109E-8
0.10559999999999767       8.406848613384339E-8
0.1057999999999977        8.346858837531624E-8
0.10599999999999768       8.297428361923022E-8
0.10619999999999771       8.211471597706359E-8
0.10639999999999769       8.134967427201263E-8
0.1065999999999977        8.068184749143178E-8
0.10679999999999773       8.011366682032554E-8
0.10699999999999774       7.964726482726803E-8
0.10719999999999774       7.88305274719651E-8
0.10739999999999772       7.81048827160174E-8
0.10759999999999773       7.747289024032042E-8
0.10779999999999776       7.69368579799432E-8
0.10799999999999776       7.649880316053626E-8
0.1081999999999978        7.572433289827964E-8
0.10839999999999778       7.503750799222761E-8
0.10859999999999778       7.444075445195938E-8
0.10879999999999779       7.393625325893477E-8
0.1089999999999978        7.35259034181894E-8
0.1091999999999978        7.279204302087374E-8
0.10939999999999775       7.214233899210022E-8
0.10959999999999775       7.157908296252491E-8
0.10979999999999782       7.110432936655477E-8
0.10999999999999782       7.071986061910425E-8
0.11019999999999786       7.002381906331036E-8
0.11039999999999783       6.940839832942442E-8
0.11059999999999784       6.887575954804411E-8
0.11079999999999787       6.842783585795371E-8
0.11099999999999785       6.806629973272562E-8
0.11119999999999788       6.740426526786235E-8
0.11139999999999783       6.681928901673232E-8
0.11159999999999787       6.631341029165214E-8
0.11179999999999793       6.588845100412154E-8
0.1119999999999979        6.55459850665332E-8
0.11219999999999791       6.49133843556219E-8
0.11239999999999789       6.435429351130191E-8
0.1125999999999979        6.387064296573572E-8
0.11279999999999793       6.346415749896766E-8
0.11299999999999794       6.313632754548408E-8
0.113199999999998         6.252820165622725E-8
0.11339999999999795       6.199010884951034E-8
0.11359999999999792       6.152388669750646E-8
0.11379999999999799       6.113117960535554E-8
0.11399999999999796       6.081341177649888E-8
0.11419999999999797       6.0224862321067E-8
0.11439999999999795       5.970300601867273E-8
0.11459999999999795       5.92496051473814E-8
0.11479999999999799       5.886624150526573E-8
0.11499999999999799       5.8554290740924094E-8
0.115199999999998         5.79809405940502E-8
0.115399999999998         5.747114524872854E-8
0.11559999999999801       5.702660919484595E-8
0.11579999999999804       5.664886876500263E-8
0.11599999999999802       5.633926751812499E-8
0.11619999999999805       5.5777681097871036E-8
0.116399999999998         5.5276769129369686E-8
0.11659999999999804       5.483819430521363E-8
0.11679999999999807       5.446346258254228E-8
0.11699999999999808       5.415389931346119E-8
0.11719999999999808       5.36019154034544E-8
0.11739999999999806       5.310802562569556E-8
0.1175999999999981        5.267386414222764E-8
0.11779999999999813       5.230091842751938E-8
0.1179999999999981        5.199050586332165E-8
0.11819999999999814       5.1447447821201563E-8
0.11839999999999809       5.096022692784492E-8
0.1185999999999981        5.053045837503019E-8
0.11879999999999818       5.015961894268023E-8
0.11899999999999816       4.9849023813813324E-8
0.11919999999999817       4.931576425468619E-8
0.11939999999999817       4.8836409861477244E-8
0.11959999999999818       4.841256187802241E-8
0.11979999999999819       4.804568932099172E-8
0.11999999999999819       4.773710582310073E-8
0.1201999999999982        4.7215973408541956E-8
0.12039999999999818       4.674711721548133E-8
0.12059999999999818       4.6332124292885055E-8
0.12079999999999821       4.597245333366857E-8
0.12099999999999822       4.5669411426390263E-8
0.12119999999999825       4.5163936223696616E-8
0.1213999999999982        4.470936451888034E-8
0.12159999999999824       4.43072630775683E-8
0.12179999999999824       4.395907178781565E-8
0.12199999999999825       4.366608029977688E-8
0.12219999999999828       4.3180583365770854E-8
0.12239999999999823       4.274480176991923E-8
0.12259999999999824       4.236026988075943E-8
0.12279999999999827       4.202839442414544E-8
0.12299999999999828       4.175043112174991E-8
0.12319999999999831       4.128947698834169E-8
0.12339999999999829       4.08771406730806E-8
0.12359999999999827       4.0514906611765125E-8
0.12379999999999833       4.020412907190613E-8
0.12399999999999833       3.994600905745319E-8
0.12419999999999837       3.9513760001130414E-8
0.12439999999999832       3.912901268931229E-8
0.12459999999999832       3.8793180501969916E-8
0.12479999999999838       3.850754325688803E-8
0.12499999999999836       3.8273224801529523E-8
0.12519999999999837       3.787276365156263E-8
0.12539999999999835       3.7518558080220483E-8
0.12559999999999835       3.72119289763871E-8
0.12579999999999839       3.695406066701632E-8
0.1259999999999984        3.6745979716595015E-8
0.12619999999999842       3.637869775437448E-8
0.12639999999999837       3.605619967421976E-8
0.1265999999999984        3.5779696466873955E-8
0.12679999999999844       3.555026136679469E-8
0.12699999999999842       3.5368810368805904E-8
0.12719999999999845       3.5033975147536566E-8
0.1273999999999984        3.4742167561367127E-8
0.1275999999999984        3.4494479610167365E-8
0.12779999999999844       3.429186732711762E-8
0.12799999999999845       3.413513337421233E-8
0.12819999999999848       3.382974120416553E-8
0.12839999999999843       3.356532888162933E-8
0.12859999999999847       3.3342871343791587E-8
0.12879999999999853       3.316321289457507E-8
0.1289999999999985        3.302705198861618E-8
0.12919999999999854       3.27460223139797E-8
0.1293999999999985        3.250368244426437E-8
0.1295999999999985        3.230090321041389E-8
0.12979999999999856       3.2138433451251094E-8
0.12999999999999853       3.2016886824197744E-8
0.13019999999999857       3.175358068825564E-8
0.13039999999999852       3.152652786930517E-8
0.13059999999999852       3.133651641167263E-8
0.13079999999999858       3.118422342307758E-8
0.13099999999999856       3.107020354838784E-8
0.1311999999999986        3.081717417150326E-8
0.13139999999999857       3.0597937288620194E-8
0.13159999999999858       3.041322369863069E-8
0.1317999999999986        3.026366554452087E-8
0.1319999999999986        3.014978599694098E-8
0.1321999999999986        2.989962674470726E-8
0.1323999999999986        2.9680900315536076E-8
0.13259999999999858       2.949430602447302E-8
0.13279999999999859       2.934045692292881E-8
0.13299999999999862       2.9219870247551008E-8
0.13319999999999868       2.8966027135767078E-8
0.1333999999999986        2.8741469089383773E-8
0.13359999999999864       2.8546887211073332E-8
0.1337999999999987        2.8382898021646973E-8
0.13399999999999868       2.8250034290464345E-8
0.1341999999999987        2.798748655198858E-8
0.13439999999999866       2.775237452725532E-8
0.1345999999999987        2.7545400752618166E-8
0.13479999999999873       2.7367203650749627E-8
0.1349999999999987        2.7218348425627307E-8
0.1351999999999987        2.6944108802402084E-8
0.1353999999999987        2.669581459883856E-8
0.1355999999999987        2.6474195829873468E-8
0.13579999999999873       2.6279927366422937E-8
0.13599999999999873       2.6113619621444438E-8
0.13619999999999877       2.5827045625240147E-8
0.13639999999999874       2.5565323750759012E-8
0.13659999999999872       2.5329224385917316E-8
0.13679999999999878       2.5119470023495975E-8
0.13699999999999876       2.4936725472455594E-8
0.13719999999999877       2.46396535972671E-8
0.13739999999999877       2.436675656070736E-8
0.13759999999999875       2.411885496815693E-8
0.13779999999999878       2.389672673091353E-8
0.1379999999999988        2.3701096508804852E-8
0.13819999999999882       2.339781163445598E-8
0.13839999999999877       2.3118441099692377E-8
0.1385999999999988        2.2863861539885778E-8
0.13879999999999884       2.2634909458331183E-8
0.13899999999999885       2.243236955596294E-8
0.13919999999999885       2.212940377586361E-8
0.1393999999999988        2.1850485380429065E-8
0.1395999999999988        2.1596546102344843E-8
0.13979999999999884       2.1368476502696494E-8
0.13999999999999885       2.116711281320866E-8
0.14019999999999888       2.0872835501150826E-8
0.14039999999999886       2.0603070379116924E-8
0.14059999999999886       2.0358791870180588E-8
0.1407999999999989        2.014092733608759E-8
0.14099999999999888       1.9950342144422803E-8
0.1411999999999989        1.9674265849184106E-8
0.14139999999999886       1.9423375585947507E-8
0.14159999999999884       1.9198658781924372E-8
0.14179999999999893       1.9001044085005232E-8
0.1419999999999989        1.883138473504891E-8
0.14219999999999894       1.8583096309036234E-8
0.14239999999999894       1.836067226682293E-8
0.14259999999999892       1.8165062730850312E-8
0.14279999999999893       1.7997142056700416E-8
0.14299999999999893       1.7857691358898114E-8
0.14319999999999897       1.764537887317295E-8
0.14339999999999892       1.745933096570161E-8
0.14359999999999895       1.7300395002598376E-8
0.143799999999999         1.7169323923960708E-8
0.143999999999999         1.706675974078803E-8
0.14419999999999902       1.6895501480143817E-8
0.14439999999999895       1.6750326427982212E-8
0.14459999999999898       1.6631917615988713E-8
0.144799999999999         1.6540849878067656E-8
0.144999999999999         1.6477576543750737E-8
0.145199999999999         1.6347855016895156E-8
0.14539999999999897       1.6243243024514113E-8
0.14559999999999898       1.616422808720451E-8
0.145799999999999         1.6111186820301558E-8
0.14599999999999902       1.608437618510238E-8
0.14619999999999905       1.5991450978011735E-8
0.14639999999999903       1.5921860985603736E-8
0.146599999999999         1.587591307144576E-8
0.14679999999999907       1.585381279704628E-8
0.14699999999999905       1.5855659882198172E-8
0.14719999999999905       1.5790193661093456E-8
0.14739999999999906       1.5745698190917796E-8
0.14759999999999904       1.5722351519217998E-8
0.14779999999999907       1.5720247872663768E-8
0.14799999999999908       1.5739395768957314E-8
0.14819999999999914       1.5689133612770374E-8
0.14839999999999906       1.5657218561732847E-8
0.1485999999999991        1.5643762906775433E-8
0.14879999999999913       1.564881426498363E-8
0.1489999999999991        1.5672354741375907E-8
0.14919999999999914       1.5624186396592338E-8
0.14939999999999906       1.5591798560004213E-8
0.1495999999999991        1.557528967564948E-8
0.14979999999999916       1.5574710237734516E-8
0.14999999999999913       1.5590062022415012E-8
0.15019999999999917       1.553180830482085E-8
0.15039999999999915       1.5487043728875546E-8
0.15059999999999915       1.545588550002719E-8
0.15079999999999918       1.5438416000589058E-8
0.15099999999999916       1.5434681710744274E-8
0.1511999999999992        1.5356294658338597E-8
0.15139999999999917       1.5289490287653358E-8
0.15159999999999915       1.5234420972901038E-8
0.1517999999999992        1.5191214336045713E-8
0.15199999999999922       1.5159971805006348E-8
0.15219999999999922       1.505417094307046E-8
0.1523999999999992        1.4958463863576575E-8
0.1525999999999992        1.4873045426300732E-8
0.15279999999999924       1.4798093798453354E-8
0.15299999999999925       1.4733768716895947E-8
0.1531999999999993        1.459628703018389E-8
0.15339999999999923       1.4467822981025819E-8
0.15359999999999926       1.4348618777824392E-8
0.1537999999999993        1.423890698511028E-8
0.15399999999999928       1.413890857556415E-8
0.1541999999999993        1.3968531907429062E-8
0.15439999999999923       1.3806499413968498E-8
0.15459999999999927       1.3653108179652998E-8
0.1547999999999993        1.3508652573112134E-8
0.1549999999999993        1.3373422157216787E-8
0.1551999999999993        1.3171966380458189E-8
0.1553999999999993        1.2978592728376976E-8
0.1555999999999993        1.279366768517198E-8
0.15579999999999933       1.2617562728852313E-8
0.1559999999999993        1.2450652125202412E-8
0.15619999999999934       1.2222990655209697E-8
0.15639999999999932       1.2003609429236418E-8
0.1565999999999993        1.1792970561302056E-8
0.15679999999999936       1.1591550653281641E-8
0.15699999999999936       1.1399838375750098E-8
0.1571999999999994        1.1154086270991234E-8
0.15739999999999935       1.0917385129280324E-8
0.15759999999999935       1.0690336175919487E-8
0.1577999999999994        1.0473567158334366E-8
0.1579999999999994        1.0267729177327045E-8
0.15819999999999942       1.0015695461642168E-8
0.15839999999999935       9.774255288450751E-9
0.15859999999999938       9.544212646901623E-9
0.1587999999999994        9.326410960105063E-9
0.15899999999999942       9.121727110930272E-9
0.15919999999999945       8.879681076835998E-9
0.1593999999999994        8.650813269640509E-9
0.15959999999999944       8.436196304371259E-9
0.15979999999999947       8.236944190985895E-9
0.15999999999999945       8.054197339572409E-9
0.16019999999999945       7.843555473112388E-9
0.16039999999999943       7.649856089308066E-9
0.16059999999999944       7.47441649674224E-9
0.1607999999999995        7.318549979247101E-9
0.16099999999999948       7.183530725417642E-9
0.1611999999999995        7.029584520223677E-9
0.1613999999999995        6.896854360679172E-9
0.16159999999999947       6.786585173662246E-9
0.16179999999999953       6.699886063794449E-9
0.1619999999999995        6.637680688145812E-9
0.1621999999999995        6.562339892124181E-9
0.1623999999999995        6.510732866861759E-9
0.1625999999999995        6.483426388059978E-9
0.16279999999999953       6.48072763330168E-9
0.16299999999999953       6.502667240954015E-9
0.16319999999999957       6.511021935552349E-9
0.16339999999999952       6.54149186163098E-9
0.16359999999999952       6.593770441727398E-9
0.16379999999999956       6.667344691290876E-9
0.16399999999999954       6.761519471142891E-9
0.16419999999999957       6.835733727690774E-9
0.16439999999999952       6.927152400995366E-9
0.16459999999999955       7.0351048272804324E-9
0.1647999999999996        7.1588430789140026E-9
0.1649999999999996        7.297564201820171E-9
0.1651999999999996        7.407591327200847E-9
0.1653999999999996        7.529522447198886E-9
0.1655999999999996        7.66278932999201E-9
0.16579999999999964       7.806811472664345E-9
0.16599999999999962       7.961005178023984E-9
0.16619999999999965       8.078256467571392E-9
0.1663999999999996        8.203329572167592E-9
0.16659999999999958       8.335872418994047E-9
0.16679999999999964       8.475534573364559E-9
0.16699999999999965       8.621970077961083E-9
0.16719999999999968       8.724729692328062E-9
0.16739999999999963       8.832560301691926E-9
0.16759999999999964       8.945278523431007E-9
0.1677999999999997        9.062701988942727E-9
0.16799999999999968       9.184650233891079E-9
0.1681999999999997        9.257885286274808E-9
0.16839999999999963       9.334410932387873E-9
0.16859999999999967       9.41414692691225E-9
0.1687999999999997        9.497012408871067E-9
0.16899999999999968       9.582926194694454E-9
0.1691999999999997        9.616771022105918E-9
0.16939999999999966       9.65275467178965E-9
0.16959999999999967       9.69085331843299E-9
0.16979999999999976       9.73104212037418E-9
0.16999999999999973       9.773295292842377E-9
0.17019999999999977       9.761776017967843E-9
0.17039999999999972       9.751640895325227E-9
0.17059999999999972       9.742894244541336E-9
0.17079999999999979       9.735539807929715E-9
0.17099999999999976       9.72958074254907E-9
0.1711999999999998        9.669772239944919E-9
0.17139999999999977       9.61084701442057E-9
0.17159999999999975       9.552821411098604E-9
0.17179999999999981       9.495711922001992E-9
0.1719999999999998        9.43953517470629E-9
0.1721999999999998        9.331013077275665E-9
0.17239999999999978       9.22303972708162E-9
0.17259999999999978       9.115634623635723E-9
0.17279999999999981       9.00881809124766E-9
0.17299999999999982       8.902611315564668E-9
0.17319999999999988       8.747086571489728E-9
0.1733999999999998        8.591888268477609E-9
0.17359999999999984       8.437034421087882E-9
0.1737999999999999        8.282544349594015E-9
0.17399999999999988       8.128438795925885E-9
0.17419999999999988       7.929445917406511E-9
0.17439999999999983       7.730634620290622E-9
0.17459999999999984       7.532019283379222E-9
0.1747999999999999        7.3336158281816444E-9
0.17499999999999988       7.135441929054963E-9
0.17519999999999994       6.898093912600038E-9
0.1753999999999999        6.660836921912416E-9
0.1755999999999999        6.4236810430392266E-9
0.17579999999999993       6.18663790391997E-9
0.1759999999999999        5.949720979580883E-9
0.17619999999999994       5.680463212203387E-9
0.1763999999999999        5.411243995936044E-9
0.17659999999999987       5.142069385951387E-9
0.17679999999999993       4.872946774216789E-9
0.17699999999999994       4.603885279499031E-9
0.17719999999999997       4.310194915922284E-9
0.17739999999999992       4.016516528257587E-9
0.17759999999999992       3.722852950676416E-9
0.17779999999999999       3.4292079880088137E-9
0.178                     3.1355868700701712E-9
0.1782                    2.8257431633898923E-9
0.17839999999999998       2.5159012552732052E-9
0.17859999999999998       2.2060619035462655E-9
0.17880000000000001       1.89622636133542E-9
0.179                     1.586396860725862E-9
0.17920000000000003       1.2691443214895629E-9
0.17939999999999998       9.518917871247645E-10
0.1796                    6.34639264937174E-10
0.17980000000000004       3.1738679144296167E-10
0.18000000000000002       3.3278065218957626E-13
