$MeshFormat
2.2 0 8
$EndMeshFormat
$PhysicalNames
9
2 5 "S_T"
2 6 "S_B"
2 7 "S_N"
2 8 "S_S"
2 9 "S1_W"
3 1 "V1"
3 2 "V2"
3 3 "V3"
3 4 "V4"
$EndPhysicalNames
$Nodes
20
1 -0.5 -0.5 -0.5
2 0.5 -0.5 -0.5
3 -0.5 0.5 -0.5
4 0.5 0.5 -0.5
5 -0.5 1.5 -0.5
6 0.5 1.5 -0.5
7 -0.5 2.5 -0.5
8 0.5 2.5 -0.5
9 -0.5 3.5 -0.5
10 0.5 3.5 -0.5
11 -0.5 1.5 0.5
12 0.5 1.5 0.5
13 0.5 2.5 0.5
14 -0.5 2.5 0.5
15 -0.5 0.5 0.5
16 0.5 0.5 0.5
17 -0.5 -0.5 0.5
18 0.5 -0.5 0.5
19 0.5 3.5 0.5
20 -0.5 3.5 0.5
$EndNodes
$Elements
15
1 3 2 6 5 1 2 4 3
2 3 2 6 9 3 4 6 5
3 3 2 6 13 5 6 8 7
4 3 2 6 17 7 8 10 9
5 3 2 5 39 11 12 13 14
6 3 2 5 61 15 16 12 11
7 3 2 8 70 1 2 18 17
8 3 2 9 82 1 17 15 3
9 3 2 5 83 17 18 16 15
10 3 2 7 100 9 20 19 10
11 3 2 5 105 14 13 19 20
12 5 2 3 1 5 6 8 7 11 12 13 14
13 5 2 2 2 3 4 6 5 15 16 12 11
14 5 2 1 3 1 2 4 3 17 18 16 15
15 5 2 4 4 7 8 10 9 14 13 19 20
$EndElements
