
0                         0
2.0000000000000003E-6     4.231465702109599E-6
4.000000000000001E-6      8.362807340950844E-6
6.0E-6                    1.239510338633034E-5
8.000000000000001E-6      1.632939209086969E-5
1.0E-5                    2.0166672510549276E-5
1.2E-5                    2.3907905512110325E-5
1.4000000000000001E-5     2.7554014767166887E-5
1.6000000000000003E-5     3.1105887732841306E-5
1.8000000000000004E-5     3.456437661869886E-5
2.0E-5                    3.793029933972694E-5
2.2E-5                    4.1204440455068984E-5
2.4E-5                    4.438755209219826E-5
2.6000000000000002E-5     4.748035485618867E-5
2.8000000000000003E-5     5.0483538723719E-5
3.0000000000000008E-5     5.339776392142222E-5
3.2000000000000005E-5     5.622366178817708E-5
3.4000000000000007E-5     5.8961835620920786E-5
3.600000000000001E-5      6.16128615035494E-5
3.8E-5                    6.417728911845747E-5
4.0E-5                    6.665564254026591E-5
4.2E-5                    6.904842101127255E-5
4.4E-5                    7.135609969815785E-5
4.6E-5                    7.35791304294779E-5
4.8E-5                    7.571794241347075E-5
5.0E-5                    7.777294293570386E-5
5.2000000000000004E-5     7.974451803609578E-5
5.4000000000000005E-5     8.163303316484352E-5
5.6000000000000006E-5     8.343883381679859E-5
5.800000000000001E-5      8.516224614383854E-5
6.0000000000000015E-5     8.680357754478721E-5
6.200000000000002E-5      8.836311723245152E-5
6.400000000000001E-5      8.98411367773502E-5
6.600000000000002E-5      9.123789062772273E-5
6.800000000000001E-5      9.255361660542115E-5
7.0E-5                    9.378853637730006E-5
7.200000000000002E-5      9.494285590173947E-5
7.4E-5                    9.601676584994535E-5
7.6E-5                    9.701044200169563E-5
7.800000000000001E-5      9.792404561521411E-5
8.0E-5                    9.875772377087563E-5
8.200000000000001E-5      9.951160968846466E-5
8.4E-5                    1.0018582301772647E-4
8.600000000000002E-5      1.0078047010197683E-4
8.8E-5                    1.0129564421455182E-4
9.000000000000002E-5      1.0173142576790342E-4
9.2E-5                    1.0208788249516854E-4
9.4E-5                    1.0236506960406103E-4
9.6E-5                    1.0256302990295728E-4
9.8E-5                    1.0268179389907251E-4
1.0E-4                    1.0272137986864549E-4
