$MeshFormat
2.2 0 8
$EndMeshFormat
$PhysicalNames
5
1 2 "bottom"
1 3 "left"
1 4 "top"
1 5 "right"
2 1 "internal"
$EndPhysicalNames
$Nodes
109
1 0 0 0
2 2 0 0
3 2 2 0
4 0 2 0
5 0.2499999999995462 0 0
6 0.4999999999988215 0 0
7 0.749999999998092 0 0
8 0.9999999999973844 0 0
9 1.249999999998021 0 0
10 1.499999999998681 0 0
11 1.74999999999934 0 0
12 2 0.2499999999995462 0
13 2 0.4999999999988215 0
14 2 0.749999999998092 0
15 2 0.9999999999973844 0
16 2 1.249999999998021 0
17 2 1.499999999998681 0
18 2 1.74999999999934 0
19 1.749999999999003 2 0
20 1.500000000000695 2 0
21 1.250000000002431 2 0
22 1.000000000004123 2 0
23 0.7500000000031257 2 0
24 0.5000000000020839 2 0
25 0.2500000000010418 2 0
26 0 1.749999999999003 0
27 0 1.500000000000695 0
28 0 1.250000000002431 0
29 0 1.000000000004123 0
30 0 0.7500000000031257 0
31 0 0.5000000000020839 0
32 0 0.2500000000010418 0
33 0.9917969716331727 0.9832372898590345 0
34 1.37616095823352 1.357051179292175 0
35 0.6429488207078011 1.376160958233456 0
36 1.357051179292232 0.623839041766505 0
37 0.6238390417665688 0.6429488207077433 0
38 1.008040532787103 1.574040049058962 0
39 0.4259599509410197 1.008040532787019 0
40 1.57404004905893 0.9919594672129119 0
41 0.991959467212996 0.4259599509410511 0
42 1.663864020326859 1.659807604560005 0
43 0.34019239543997 1.663864020326779 0
44 1.65980760456024 0.3361359796732375 0
45 0.3361359796733177 0.340192395439735 0
46 1.136379270698659 1.286582446236367 0
47 0.7202380952380137 1.136904761904562 0
48 1.295468681717197 0.8733128201120244 0
49 0.8880137264161027 0.7446223446261274 0
50 1.278469079939289 1.692657832363602 0
51 0.3073421676363865 1.278469079939186 0
52 1.692657832363659 0.7215309200607144 0
53 0.7215309200608173 0.30734216763633 0
54 0.7345655966769455 1.697291394961726 0
55 1.697291394961702 1.265434403323073 0
56 0.30270860503828 0.7345655966768523 0
57 1.265434403323166 0.3027086050383033 0
58 0.877263493442785 1.341621158119634 0
59 0.6636686801795388 0.8814151168750751 0
60 1.33445872159023 1.126866489463879 0
61 1.124443288320101 0.6696488256161097 0
62 0.9293905064846846 1.800835186755035 0
63 0.1991648132449496 0.9293905064846117 0
64 1.800835186754909 1.070609493515644 0
65 1.070609493515716 0.1991648132450755 0
66 1.469422212948986 1.801254440648863 0
67 0.1987455593511353 1.469422212948939 0
68 1.801254440649048 0.530577787051059 0
69 0.5305777870511049 0.1987455593509508 0
70 1.787605155331026 1.473505077713756 0
71 1.473505077713956 0.2123948446690598 0
72 0.5264949222862589 1.78760515533097 0
73 0.2123948446691169 0.5264949222860584 0
74 1.219182533358244 1.490428528978991 0
75 0.5099265596025376 1.21920989129266 0
76 1.490891160980312 0.7813220527939043 0
77 0.7772429890959009 0.5104169734853012 0
78 1.117277807549822 1.826529177107447 0
79 0.1734708228925203 1.117277807549748 0
80 1.82652917710732 0.8827221924504467 0
81 0.8827221924505203 0.1734708228926476 0
82 0.7696591399634696 1.495962941905971 0
83 1.495962941905982 1.230340860036511 0
84 0.5040370580940192 0.7696591399634002 0
85 1.230340860036579 0.5040370580940088 0
86 1.805769751082263 1.805769751082338 0
87 0.194230248917699 1.805769751082311 0
88 1.805769751082132 0.1942302489176193 0
89 0.1942302489175714 0.1942302489179051 0
90 1.434625005006777 1.573435161017137 0
91 0.4266240204131 1.434629564662453 0
92 1.573512266350786 0.5654590926852837 0
93 0.5647792487356766 0.4267057560601321 0
94 1.575918245960978 1.426595714323776 0
95 0.5734141492479241 1.575919005903559 0
96 1.426608565212826 0.4240957703210663 0
97 0.4239824629961631 0.5734277718556534 0
98 0.9493652833795225 1.139057811794109 0
99 1.139115503326838 1.059251651064609 0
100 0.8199242086215091 0.9863151012615984 0
101 1.099686113383468 0.8494103393569963 0
102 1.637811196871561 1.853366359258241 0
103 0.1466336407417609 1.637811196871545 0
104 1.853366359258284 0.3621888031280567 0
105 0.3621888031280724 0.1466336407417182 0
106 1.85144778534803 1.637816486670824 0
107 1.63781648667087 0.1485522146519833 0
108 0.3621835133294107 1.851447785348012 0
109 0.1485522146520012 0.3621835133293648 0
$EndNodes
$Elements
216
1 1 2 2 1 1 5
2 1 2 2 1 5 6
3 1 2 2 1 6 7
4 1 2 2 1 7 8
5 1 2 2 1 8 9
6 1 2 2 1 9 10
7 1 2 2 1 10 11
8 1 2 2 1 11 2
9 1 2 5 2 2 12
10 1 2 5 2 12 13
11 1 2 5 2 13 14
12 1 2 5 2 14 15
13 1 2 5 2 15 16
14 1 2 5 2 16 17
15 1 2 5 2 17 18
16 1 2 5 2 18 3
17 1 2 4 3 3 19
18 1 2 4 3 19 20
19 1 2 4 3 20 21
20 1 2 4 3 21 22
21 1 2 4 3 22 23
22 1 2 4 3 23 24
23 1 2 4 3 24 25
24 1 2 4 3 25 4
25 1 2 3 4 4 26
26 1 2 3 4 26 27
27 1 2 3 4 27 28
28 1 2 3 4 28 29
29 1 2 3 4 29 30
30 1 2 3 4 30 31
31 1 2 3 4 31 32
32 1 2 3 4 32 1
33 2 2 1 6 34 46 60
34 2 2 1 6 35 47 58
35 2 2 1 6 36 48 61
36 2 2 1 6 37 49 59
37 2 2 1 6 21 50 66
38 2 2 1 6 28 51 67
39 2 2 1 6 30 73 56
40 2 2 1 6 23 72 54
41 2 2 1 6 9 71 57
42 2 2 1 6 16 70 55
43 2 2 1 6 14 52 68
44 2 2 1 6 7 53 69
45 2 2 1 6 38 50 78
46 2 2 1 6 39 51 79
47 2 2 1 6 40 52 80
48 2 2 1 6 41 53 81
49 2 2 1 6 16 55 64
50 2 2 1 6 9 57 65
51 2 2 1 6 23 54 62
52 2 2 1 6 30 56 63
53 2 2 1 6 34 60 83
54 2 2 1 6 35 58 82
55 2 2 1 6 36 61 85
56 2 2 1 6 37 59 84
57 2 2 1 6 38 58 46
58 2 2 1 6 39 59 47
59 2 2 1 6 40 60 48
60 2 2 1 6 41 61 49
61 2 2 1 6 30 31 73
62 2 2 1 6 23 24 72
63 2 2 1 6 9 10 71
64 2 2 1 6 16 17 70
65 2 2 1 6 20 21 66
66 2 2 1 6 27 28 67
67 2 2 1 6 13 14 68
68 2 2 1 6 6 7 69
69 2 2 1 6 33 100 49
70 2 2 1 6 33 49 101
71 2 2 1 6 21 78 50
72 2 2 1 6 28 79 51
73 2 2 1 6 14 80 52
74 2 2 1 6 7 81 53
75 2 2 1 6 38 46 74
76 2 2 1 6 39 47 75
77 2 2 1 6 40 48 76
78 2 2 1 6 41 49 77
79 2 2 1 6 34 74 46
80 2 2 1 6 35 75 47
81 2 2 1 6 36 76 48
82 2 2 1 6 37 77 49
83 2 2 1 6 38 62 54
84 2 2 1 6 39 63 56
85 2 2 1 6 40 64 55
86 2 2 1 6 41 65 57
87 2 2 1 6 38 54 82
88 2 2 1 6 40 55 83
89 2 2 1 6 39 56 84
90 2 2 1 6 41 57 85
91 2 2 1 6 38 74 50
92 2 2 1 6 39 75 51
93 2 2 1 6 40 76 52
94 2 2 1 6 41 77 53
95 2 2 1 6 38 78 62
96 2 2 1 6 39 79 63
97 2 2 1 6 40 80 64
98 2 2 1 6 41 81 65
99 2 2 1 6 50 74 90
100 2 2 1 6 51 75 91
101 2 2 1 6 52 76 92
102 2 2 1 6 53 77 93
103 2 2 1 6 34 90 74
104 2 2 1 6 35 91 75
105 2 2 1 6 36 92 76
106 2 2 1 6 37 93 77
107 2 2 1 6 22 23 62
108 2 2 1 6 29 30 63
109 2 2 1 6 15 16 64
110 2 2 1 6 8 9 65
111 2 2 1 6 3 19 86
112 2 2 1 6 4 26 87
113 2 2 1 6 2 12 88
114 2 2 1 6 1 5 89
115 2 2 1 6 2 88 11
116 2 2 1 6 1 89 32
117 2 2 1 6 3 86 18
118 2 2 1 6 4 87 25
119 2 2 1 6 47 100 98
120 2 2 1 6 47 98 58
121 2 2 1 6 48 99 101
122 2 2 1 6 48 60 99
123 2 2 1 6 49 100 59
124 2 2 1 6 49 61 101
125 2 2 1 6 38 82 58
126 2 2 1 6 40 83 60
127 2 2 1 6 39 84 59
128 2 2 1 6 41 85 61
129 2 2 1 6 21 22 78
130 2 2 1 6 28 29 79
131 2 2 1 6 14 15 80
132 2 2 1 6 7 8 81
133 2 2 1 6 33 98 100
134 2 2 1 6 33 101 99
135 2 2 1 6 46 58 98
136 2 2 1 6 46 99 60
137 2 2 1 6 47 59 100
138 2 2 1 6 48 101 61
139 2 2 1 6 24 25 108
140 2 2 1 6 17 18 106
141 2 2 1 6 31 32 109
142 2 2 1 6 19 20 102
143 2 2 1 6 26 27 103
144 2 2 1 6 10 11 107
145 2 2 1 6 12 13 104
146 2 2 1 6 5 6 105
147 2 2 1 6 22 62 78
148 2 2 1 6 29 63 79
149 2 2 1 6 15 64 80
150 2 2 1 6 8 65 81
151 2 2 1 6 50 90 66
152 2 2 1 6 51 91 67
153 2 2 1 6 52 92 68
154 2 2 1 6 53 93 69
155 2 2 1 6 42 94 70
156 2 2 1 6 44 96 71
157 2 2 1 6 43 95 72
158 2 2 1 6 45 97 73
159 2 2 1 6 34 83 94
160 2 2 1 6 35 82 95
161 2 2 1 6 55 94 83
162 2 2 1 6 36 85 96
163 2 2 1 6 54 95 82
164 2 2 1 6 37 84 97
165 2 2 1 6 57 96 85
166 2 2 1 6 56 97 84
167 2 2 1 6 42 90 94
168 2 2 1 6 44 92 96
169 2 2 1 6 43 91 95
170 2 2 1 6 45 93 97
171 2 2 1 6 42 102 66
172 2 2 1 6 43 103 67
173 2 2 1 6 44 104 68
174 2 2 1 6 45 105 69
175 2 2 1 6 42 70 106
176 2 2 1 6 44 71 107
177 2 2 1 6 43 72 108
178 2 2 1 6 45 73 109
179 2 2 1 6 42 66 90
180 2 2 1 6 43 67 91
181 2 2 1 6 44 68 92
182 2 2 1 6 45 69 93
183 2 2 1 6 20 66 102
184 2 2 1 6 27 67 103
185 2 2 1 6 13 68 104
186 2 2 1 6 6 69 105
187 2 2 1 6 17 106 70
188 2 2 1 6 24 108 72
189 2 2 1 6 10 107 71
190 2 2 1 6 31 109 73
191 2 2 1 6 55 70 94
192 2 2 1 6 57 71 96
193 2 2 1 6 54 72 95
194 2 2 1 6 56 73 97
195 2 2 1 6 42 86 102
196 2 2 1 6 43 87 103
197 2 2 1 6 44 88 104
198 2 2 1 6 45 89 105
199 2 2 1 6 42 106 86
200 2 2 1 6 43 108 87
201 2 2 1 6 44 107 88
202 2 2 1 6 45 109 89
203 2 2 1 6 34 94 90
204 2 2 1 6 35 95 91
205 2 2 1 6 36 96 92
206 2 2 1 6 37 97 93
207 2 2 1 6 19 102 86
208 2 2 1 6 26 103 87
209 2 2 1 6 12 104 88
210 2 2 1 6 5 105 89
211 2 2 1 6 18 86 106
212 2 2 1 6 25 87 108
213 2 2 1 6 11 88 107
214 2 2 1 6 32 89 109
215 2 2 1 6 33 99 98
216 2 2 1 6 46 98 99
$EndElements
