#1:iter	2:compliance	3:duration	4:volume	5:sub_prb_itr	6:dual_eval	7:neg_asym_min	8:neg_asym_max	9:pos_asym_min	10:pos_asym_max	11:lambda_volume
0 	1366.03 	0.451 	0.2 	0 	0 	0 	0 	0 	0 	1.72723e-77
1 	44.7216 	0.073 	0.590192 	51 	0 	-0.2995 	-0.2995 	0.6995 	0.6995 	141.651
2 	31.92 	0.07 	0.588124 	51 	0 	-0.379294 	0.15005 	0.619706 	1.14905 	147.49
3 	29.509 	0.07 	0.576472 	51 	0 	-0.5984 	0.357865 	0.372182 	1.55666 	151.842
4 	29.4189 	0.072 	0.550557 	51 	0 	-0.5984 	0.339889 	0.42058 	1.71928 	154.854
5 	29.9419 	0.071 	0.518684 	51 	0 	-0.5984 	0.306709 	0.42058 	1.86314 	156.259
6 	29.7678 	0.07 	0.494902 	51 	0 	-0.603195 	0.376606 	0.42058 	2.03576 	156.332
7 	29.1612 	0.072 	0.475791 	51 	0 	-0.724034 	0.325995 	0.42058 	2.24292 	155.379
8 	28.9501 	0.071 	0.461919 	51 	0 	-0.869041 	0.296159 	0.42058 	2.4815 	153.59
9 	29.7064 	0.07 	0.444098 	51 	0 	-1.04305 	0.28072 	0.42058 	2.7898 	150.846
10 	29.9612 	0.07 	0.433584 	51 	0 	-1.29686 	0.28072 	0.42058 	3.14776 	147.511
11 	30.2924 	0.072 	0.427379 	51 	0 	-1.62494 	0.28072 	0.42058 	3.57731 	143.807
12 	30.4624 	0.071 	0.423489 	51 	0 	-2.09277 	0.28072 	0.42058 	4.09277 	139.875
13 	30.2173 	0.073 	0.42331 	51 	0 	-2.10975 	0.28072 	0.42058 	4.09277 	135.914
14 	30.0101 	0.074 	0.423078 	51 	0 	-2.59693 	0.28072 	0.42058 	4.09277 	131.939
15 	29.7696 	0.073 	0.423421 	51 	0 	-3.11651 	0.28072 	0.42058 	4.09277 	127.964
16 	29.5032 	0.072 	0.424004 	51 	0 	-3.62706 	0.28072 	0.42058 	4.33811 	124.002
17 	29.1735 	0.071 	0.425519 	51 	0 	-4.43454 	0.28072 	0.42058 	5.06499 	120.102
18 	28.8596 	0.073 	0.427678 	51 	0 	-5.36636 	0.28072 	0.42058 	5.93928 	116.312
19 	28.4641 	0.072 	0.430689 	51 	0 	-6.46348 	0.28072 	0.42058 	7.00529 	112.664
20 	27.9319 	0.072 	0.435001 	51 	0 	-7.7436 	0.28072 	0.42058 	8.17997 	109.237
21 	27.4639 	0.073 	0.43884 	51 	0 	-9.30785 	0.28072 	0.42058 	9.30985 	106.002
22 	26.8744 	0.073 	0.444025 	51 	0 	-9.30785 	0.28072 	0.42058 	9.30985 	103.021
23 	26.5436 	0.072 	0.446911 	51 	0 	-9.30785 	0.28072 	0.42058 	9.30985 	100.168
24 	25.6532 	0.074 	0.456242 	51 	0 	-9.30785 	0.28072 	0.42058 	10.1244 	97.7968
25 	28.575 	0.073 	0.43998 	51 	0 	-10.754 	0.28072 	0.42058 	12.2164 	94.579
26 	25.3026 	0.073 	0.476368 	51 	0 	-12.8211 	0.28072 	0.42058 	14.4458 	93.7855
27 	32.2146 	0.071 	0.423114 	51 	0 	-15.4393 	0.28072 	0.42058 	16.9895 	90.2581
28 	25.6473 	0.075 	0.459476 	51 	0 	-10.7914 	0.28072 	0.42058 	11.9088 	88.8569
29 	26.2877 	0.076 	0.448229 	51 	0 	-6.94504 	0.28072 	0.42058 	8.94504 	86.2441
30 	25.5454 	0.071 	0.455876 	51 	0 	-6.51519 	0.28072 	0.42058 	7.51619 	83.9638
