[Info]
Version 1
Dimension 2
NumNodes 25
Num3DElements 0
Num2DElements 16
Num1DElements 0
NumNodeBC 10
NumSaveNodes 0
NumSaveElements 0
Num 2d-line      : 0
Num 2d-line,quad : 0
Num 3d-line      : 0
Num 3d-line,quad : 0
Num triangle     : 0
Num triangle,quad: 0
Num quadr        : 16
Num quadr,quad   : 0
Num tetra        : 0
Num tetra,quad   : 0
Num brick        : 0
Num brick,quad   : 0
Num pyramid      : 0
Num pyramid,quad : 0
Num wedge        : 0
Num wedge,quad   : 0

[Nodes]
#NodeNr x-coord y-coord z-coord
       1  0.0000000000000e+00  0.0000000000000e+00  0.0000000000000e+00
       2  2.5000000000000e+00  0.0000000000000e+00  0.0000000000000e+00
       3  5.0000000000000e+00  0.0000000000000e+00  0.0000000000000e+00
       4  7.5000000000000e+00  0.0000000000000e+00  0.0000000000000e+00
       5  1.0000000000000e+01  0.0000000000000e+00  0.0000000000000e+00
       6  0.0000000000000e+00  2.5000000000000e+00  0.0000000000000e+00
       7  2.5000000000000e+00  2.5000000000000e+00  0.0000000000000e+00
       8  5.0000000000000e+00  2.5000000000000e+00  0.0000000000000e+00
       9  7.5000000000000e+00  2.5000000000000e+00  0.0000000000000e+00
      10  1.0000000000000e+01  2.5000000000000e+00  0.0000000000000e+00
      11  0.0000000000000e+00  5.0000000000000e+00  0.0000000000000e+00
      12  2.5000000000000e+00  5.0000000000000e+00  0.0000000000000e+00
      13  5.0000000000000e+00  5.0000000000000e+00  0.0000000000000e+00
      14  7.5000000000000e+00  5.0000000000000e+00  0.0000000000000e+00
      15  1.0000000000000e+01  5.0000000000000e+00  0.0000000000000e+00
      16  0.0000000000000e+00  7.5000000000000e+00  0.0000000000000e+00
      17  2.5000000000000e+00  7.5000000000000e+00  0.0000000000000e+00
      18  5.0000000000000e+00  7.5000000000000e+00  0.0000000000000e+00
      19  7.5000000000000e+00  7.5000000000000e+00  0.0000000000000e+00
      20  1.0000000000000e+01  7.5000000000000e+00  0.0000000000000e+00
      21  0.0000000000000e+00  1.0000000000000e+01  0.0000000000000e+00
      22  2.5000000000000e+00  1.0000000000000e+01  0.0000000000000e+00
      23  5.0000000000000e+00  1.0000000000000e+01  0.0000000000000e+00
      24  7.5000000000000e+00  1.0000000000000e+01  0.0000000000000e+00
      25  1.0000000000000e+01  1.0000000000000e+01  0.0000000000000e+00

[3D Elements]
#ElemNr  ElemType  NrOfNodes  Level
#Node1 Node2 ... NodeNrOfNodes

[2D Elements]
#ElemNr  ElemType  NrOfNodes  Level
#Node1 Node2 ... NodeNrOfNodes
1 6 4 mech
1 2 7 6
2 6 4 mech
2 3 8 7
3 6 4 mech
3 4 9 8
4 6 4 mech
4 5 10 9
5 6 4 mech
6 7 12 11
6 6 4 mech
7 8 13 12
7 6 4 mech
8 9 14 13
8 6 4 mech
9 10 15 14
9 6 4 mech
11 12 17 16
10 6 4 mech
12 13 18 17
11 6 4 mech
13 14 19 18
12 6 4 mech
14 15 20 19
13 6 4 mech
16 17 22 21
14 6 4 mech
17 18 23 22
15 6 4 mech
18 19 24 23
16 6 4 mech
19 20 25 24

[1D Elements]
#ElemNr  ElemType  NrOfNodes  Level
#Node1 Node2 ... NodeNrOfNodes

[Node BC]
#NodeNr Level
       1 fixed
       2 fixed
       3 fixed
       4 fixed
       5 fixed
       1 force1
       6 force2
      11 force3
      16 force4
      21 force5

[Save Nodes]
#NodeNr Level

[Save Elements]
#ElemNr Level

