[Info]
Version 1
Dimension 2
NumNodes 651
Num3DElements 0
Num2DElements 600
Num1DElements 0
NumNodeBC 131
NumSaveNodes 0
NumSaveElements 0
Num 2d-line      : 0
Num 2d-line,quad : 0
Num 3d-line      : 0
Num 3d-line,quad : 0
Num triangle     : 0
Num triangle,quad: 0
Num quadr        : 600
Num quadr,quad   : 0
Num tetra        : 0
Num tetra,quad   : 0
Num brick        : 0
Num brick,quad   : 0
Num pyramid      : 0
Num wedge        : 0
Num pyramid,quad : 0
Num wedge,quad   : 0

[Nodes]
#NodeNr x-coord y-coord z-coord
       1  0.0000000000000e+00  0.0000000000000e+00  0.0000000000000e+00
       2  2.0000000000000e-02  0.0000000000000e+00  0.0000000000000e+00
       3  1.0000000000000e-03  0.0000000000000e+00  0.0000000000000e+00
       4  2.0000000000000e-03  0.0000000000000e+00  0.0000000000000e+00
       5  3.0000000000000e-03  0.0000000000000e+00  0.0000000000000e+00
       6  4.0000000000000e-03  0.0000000000000e+00  0.0000000000000e+00
       7  5.0000000000000e-03  0.0000000000000e+00  0.0000000000000e+00
       8  6.0000000000000e-03  0.0000000000000e+00  0.0000000000000e+00
       9  7.0000000000000e-03  0.0000000000000e+00  0.0000000000000e+00
      10  8.0000000000000e-03  0.0000000000000e+00  0.0000000000000e+00
      11  9.0000000000000e-03  0.0000000000000e+00  0.0000000000000e+00
      12  1.0000000000000e-02  0.0000000000000e+00  0.0000000000000e+00
      13  1.1000000000000e-02  0.0000000000000e+00  0.0000000000000e+00
      14  1.2000000000000e-02  0.0000000000000e+00  0.0000000000000e+00
      15  1.3000000000000e-02  0.0000000000000e+00  0.0000000000000e+00
      16  1.4000000000000e-02  0.0000000000000e+00  0.0000000000000e+00
      17  1.5000000000000e-02  0.0000000000000e+00  0.0000000000000e+00
      18  1.6000000000000e-02  0.0000000000000e+00  0.0000000000000e+00
      19  1.7000000000000e-02  0.0000000000000e+00  0.0000000000000e+00
      20  1.8000000000000e-02  0.0000000000000e+00  0.0000000000000e+00
      21  1.9000000000000e-02  0.0000000000000e+00  0.0000000000000e+00
      22  2.0000000000000e-02  1.0000000000000e-02  0.0000000000000e+00
      23  2.0000000000000e-02  1.0000000000000e-03  0.0000000000000e+00
      24  2.0000000000000e-02  2.0000000000000e-03  0.0000000000000e+00
      25  2.0000000000000e-02  3.0000000000000e-03  0.0000000000000e+00
      26  2.0000000000000e-02  4.0000000000000e-03  0.0000000000000e+00
      27  2.0000000000000e-02  5.0000000000000e-03  0.0000000000000e+00
      28  2.0000000000000e-02  6.0000000000000e-03  0.0000000000000e+00
      29  2.0000000000000e-02  7.0000000000000e-03  0.0000000000000e+00
      30  2.0000000000000e-02  8.0000000000000e-03  0.0000000000000e+00
      31  2.0000000000000e-02  9.0000000000000e-03  0.0000000000000e+00
      32  0.0000000000000e+00  1.0000000000000e-02  0.0000000000000e+00
      33  1.9000000000000e-02  1.0000000000000e-02  0.0000000000000e+00
      34  1.8000000000000e-02  1.0000000000000e-02  0.0000000000000e+00
      35  1.7000000000000e-02  1.0000000000000e-02  0.0000000000000e+00
      36  1.6000000000000e-02  1.0000000000000e-02  0.0000000000000e+00
      37  1.5000000000000e-02  1.0000000000000e-02  0.0000000000000e+00
      38  1.4000000000000e-02  1.0000000000000e-02  0.0000000000000e+00
      39  1.3000000000000e-02  1.0000000000000e-02  0.0000000000000e+00
      40  1.2000000000000e-02  1.0000000000000e-02  0.0000000000000e+00
      41  1.1000000000000e-02  1.0000000000000e-02  0.0000000000000e+00
      42  1.0000000000000e-02  1.0000000000000e-02  0.0000000000000e+00
      43  9.0000000000000e-03  1.0000000000000e-02  0.0000000000000e+00
      44  8.0000000000000e-03  1.0000000000000e-02  0.0000000000000e+00
      45  7.0000000000000e-03  1.0000000000000e-02  0.0000000000000e+00
      46  6.0000000000000e-03  1.0000000000000e-02  0.0000000000000e+00
      47  5.0000000000000e-03  1.0000000000000e-02  0.0000000000000e+00
      48  4.0000000000000e-03  1.0000000000000e-02  0.0000000000000e+00
      49  3.0000000000000e-03  1.0000000000000e-02  0.0000000000000e+00
      50  2.0000000000000e-03  1.0000000000000e-02  0.0000000000000e+00
      51  1.0000000000000e-03  1.0000000000000e-02  0.0000000000000e+00
      52  0.0000000000000e+00  9.0000000000000e-03  0.0000000000000e+00
      53  0.0000000000000e+00  8.0000000000000e-03  0.0000000000000e+00
      54  0.0000000000000e+00  7.0000000000000e-03  0.0000000000000e+00
      55  0.0000000000000e+00  6.0000000000000e-03  0.0000000000000e+00
      56  0.0000000000000e+00  5.0000000000000e-03  0.0000000000000e+00
      57  0.0000000000000e+00  4.0000000000000e-03  0.0000000000000e+00
      58  0.0000000000000e+00  3.0000000000000e-03  0.0000000000000e+00
      59  0.0000000000000e+00  2.0000000000000e-03  0.0000000000000e+00
      60  0.0000000000000e+00  1.0000000000000e-03  0.0000000000000e+00
      61  1.0000000000000e-03  1.0000000000000e-03  0.0000000000000e+00
      62  1.0000000000000e-03  2.0000000000000e-03  0.0000000000000e+00
      63  1.0000000000000e-03  3.0000000000000e-03  0.0000000000000e+00
      64  1.0000000000000e-03  4.0000000000000e-03  0.0000000000000e+00
      65  1.0000000000000e-03  5.0000000000000e-03  0.0000000000000e+00
      66  1.0000000000000e-03  6.0000000000000e-03  0.0000000000000e+00
      67  1.0000000000000e-03  7.0000000000000e-03  0.0000000000000e+00
      68  1.0000000000000e-03  8.0000000000000e-03  0.0000000000000e+00
      69  1.0000000000000e-03  9.0000000000000e-03  0.0000000000000e+00
      70  2.0000000000000e-03  1.0000000000000e-03  0.0000000000000e+00
      71  2.0000000000000e-03  2.0000000000000e-03  0.0000000000000e+00
      72  2.0000000000000e-03  3.0000000000000e-03  0.0000000000000e+00
      73  2.0000000000000e-03  4.0000000000000e-03  0.0000000000000e+00
      74  2.0000000000000e-03  5.0000000000000e-03  0.0000000000000e+00
      75  2.0000000000000e-03  6.0000000000000e-03  0.0000000000000e+00
      76  2.0000000000000e-03  7.0000000000000e-03  0.0000000000000e+00
      77  2.0000000000000e-03  8.0000000000000e-03  0.0000000000000e+00
      78  2.0000000000000e-03  9.0000000000000e-03  0.0000000000000e+00
      79  3.0000000000000e-03  1.0000000000000e-03  0.0000000000000e+00
      80  3.0000000000000e-03  2.0000000000000e-03  0.0000000000000e+00
      81  3.0000000000000e-03  3.0000000000000e-03  0.0000000000000e+00
      82  3.0000000000000e-03  4.0000000000000e-03  0.0000000000000e+00
      83  3.0000000000000e-03  5.0000000000000e-03  0.0000000000000e+00
      84  3.0000000000000e-03  6.0000000000000e-03  0.0000000000000e+00
      85  3.0000000000000e-03  7.0000000000000e-03  0.0000000000000e+00
      86  3.0000000000000e-03  8.0000000000000e-03  0.0000000000000e+00
      87  3.0000000000000e-03  9.0000000000000e-03  0.0000000000000e+00
      88  4.0000000000000e-03  1.0000000000000e-03  0.0000000000000e+00
      89  4.0000000000000e-03  2.0000000000000e-03  0.0000000000000e+00
      90  4.0000000000000e-03  3.0000000000000e-03  0.0000000000000e+00
      91  4.0000000000000e-03  4.0000000000000e-03  0.0000000000000e+00
      92  4.0000000000000e-03  5.0000000000000e-03  0.0000000000000e+00
      93  4.0000000000000e-03  6.0000000000000e-03  0.0000000000000e+00
      94  4.0000000000000e-03  7.0000000000000e-03  0.0000000000000e+00
      95  4.0000000000000e-03  8.0000000000000e-03  0.0000000000000e+00
      96  4.0000000000000e-03  9.0000000000000e-03  0.0000000000000e+00
      97  5.0000000000000e-03  1.0000000000000e-03  0.0000000000000e+00
      98  5.0000000000000e-03  2.0000000000000e-03  0.0000000000000e+00
      99  5.0000000000000e-03  3.0000000000000e-03  0.0000000000000e+00
     100  5.0000000000000e-03  4.0000000000000e-03  0.0000000000000e+00
     101  5.0000000000000e-03  5.0000000000000e-03  0.0000000000000e+00
     102  5.0000000000000e-03  6.0000000000000e-03  0.0000000000000e+00
     103  5.0000000000000e-03  7.0000000000000e-03  0.0000000000000e+00
     104  5.0000000000000e-03  8.0000000000000e-03  0.0000000000000e+00
     105  5.0000000000000e-03  9.0000000000000e-03  0.0000000000000e+00
     106  6.0000000000000e-03  1.0000000000000e-03  0.0000000000000e+00
     107  6.0000000000000e-03  2.0000000000000e-03  0.0000000000000e+00
     108  6.0000000000000e-03  3.0000000000000e-03  0.0000000000000e+00
     109  6.0000000000000e-03  4.0000000000000e-03  0.0000000000000e+00
     110  6.0000000000000e-03  5.0000000000000e-03  0.0000000000000e+00
     111  6.0000000000000e-03  6.0000000000000e-03  0.0000000000000e+00
     112  6.0000000000000e-03  7.0000000000000e-03  0.0000000000000e+00
     113  6.0000000000000e-03  8.0000000000000e-03  0.0000000000000e+00
     114  6.0000000000000e-03  9.0000000000000e-03  0.0000000000000e+00
     115  7.0000000000000e-03  1.0000000000000e-03  0.0000000000000e+00
     116  7.0000000000000e-03  2.0000000000000e-03  0.0000000000000e+00
     117  7.0000000000000e-03  3.0000000000000e-03  0.0000000000000e+00
     118  7.0000000000000e-03  4.0000000000000e-03  0.0000000000000e+00
     119  7.0000000000000e-03  5.0000000000000e-03  0.0000000000000e+00
     120  7.0000000000000e-03  6.0000000000000e-03  0.0000000000000e+00
     121  7.0000000000000e-03  7.0000000000000e-03  0.0000000000000e+00
     122  7.0000000000000e-03  8.0000000000000e-03  0.0000000000000e+00
     123  7.0000000000000e-03  9.0000000000000e-03  0.0000000000000e+00
     124  8.0000000000000e-03  1.0000000000000e-03  0.0000000000000e+00
     125  8.0000000000000e-03  2.0000000000000e-03  0.0000000000000e+00
     126  8.0000000000000e-03  3.0000000000000e-03  0.0000000000000e+00
     127  8.0000000000000e-03  4.0000000000000e-03  0.0000000000000e+00
     128  8.0000000000000e-03  5.0000000000000e-03  0.0000000000000e+00
     129  8.0000000000000e-03  6.0000000000000e-03  0.0000000000000e+00
     130  8.0000000000000e-03  7.0000000000000e-03  0.0000000000000e+00
     131  8.0000000000000e-03  8.0000000000000e-03  0.0000000000000e+00
     132  8.0000000000000e-03  9.0000000000000e-03  0.0000000000000e+00
     133  9.0000000000000e-03  1.0000000000000e-03  0.0000000000000e+00
     134  9.0000000000000e-03  2.0000000000000e-03  0.0000000000000e+00
     135  9.0000000000000e-03  3.0000000000000e-03  0.0000000000000e+00
     136  9.0000000000000e-03  4.0000000000000e-03  0.0000000000000e+00
     137  9.0000000000000e-03  5.0000000000000e-03  0.0000000000000e+00
     138  9.0000000000000e-03  6.0000000000000e-03  0.0000000000000e+00
     139  9.0000000000000e-03  7.0000000000000e-03  0.0000000000000e+00
     140  9.0000000000000e-03  8.0000000000000e-03  0.0000000000000e+00
     141  9.0000000000000e-03  9.0000000000000e-03  0.0000000000000e+00
     142  1.0000000000000e-02  1.0000000000000e-03  0.0000000000000e+00
     143  1.0000000000000e-02  2.0000000000000e-03  0.0000000000000e+00
     144  1.0000000000000e-02  3.0000000000000e-03  0.0000000000000e+00
     145  1.0000000000000e-02  4.0000000000000e-03  0.0000000000000e+00
     146  1.0000000000000e-02  5.0000000000000e-03  0.0000000000000e+00
     147  1.0000000000000e-02  6.0000000000000e-03  0.0000000000000e+00
     148  1.0000000000000e-02  7.0000000000000e-03  0.0000000000000e+00
     149  1.0000000000000e-02  8.0000000000000e-03  0.0000000000000e+00
     150  1.0000000000000e-02  9.0000000000000e-03  0.0000000000000e+00
     151  1.1000000000000e-02  1.0000000000000e-03  0.0000000000000e+00
     152  1.1000000000000e-02  2.0000000000000e-03  0.0000000000000e+00
     153  1.1000000000000e-02  3.0000000000000e-03  0.0000000000000e+00
     154  1.1000000000000e-02  4.0000000000000e-03  0.0000000000000e+00
     155  1.1000000000000e-02  5.0000000000000e-03  0.0000000000000e+00
     156  1.1000000000000e-02  6.0000000000000e-03  0.0000000000000e+00
     157  1.1000000000000e-02  7.0000000000000e-03  0.0000000000000e+00
     158  1.1000000000000e-02  8.0000000000000e-03  0.0000000000000e+00
     159  1.1000000000000e-02  9.0000000000000e-03  0.0000000000000e+00
     160  1.2000000000000e-02  1.0000000000000e-03  0.0000000000000e+00
     161  1.2000000000000e-02  2.0000000000000e-03  0.0000000000000e+00
     162  1.2000000000000e-02  3.0000000000000e-03  0.0000000000000e+00
     163  1.2000000000000e-02  4.0000000000000e-03  0.0000000000000e+00
     164  1.2000000000000e-02  5.0000000000000e-03  0.0000000000000e+00
     165  1.2000000000000e-02  6.0000000000000e-03  0.0000000000000e+00
     166  1.2000000000000e-02  7.0000000000000e-03  0.0000000000000e+00
     167  1.2000000000000e-02  8.0000000000000e-03  0.0000000000000e+00
     168  1.2000000000000e-02  9.0000000000000e-03  0.0000000000000e+00
     169  1.3000000000000e-02  1.0000000000000e-03  0.0000000000000e+00
     170  1.3000000000000e-02  2.0000000000000e-03  0.0000000000000e+00
     171  1.3000000000000e-02  3.0000000000000e-03  0.0000000000000e+00
     172  1.3000000000000e-02  4.0000000000000e-03  0.0000000000000e+00
     173  1.3000000000000e-02  5.0000000000000e-03  0.0000000000000e+00
     174  1.3000000000000e-02  6.0000000000000e-03  0.0000000000000e+00
     175  1.3000000000000e-02  7.0000000000000e-03  0.0000000000000e+00
     176  1.3000000000000e-02  8.0000000000000e-03  0.0000000000000e+00
     177  1.3000000000000e-02  9.0000000000000e-03  0.0000000000000e+00
     178  1.4000000000000e-02  1.0000000000000e-03  0.0000000000000e+00
     179  1.4000000000000e-02  2.0000000000000e-03  0.0000000000000e+00
     180  1.4000000000000e-02  3.0000000000000e-03  0.0000000000000e+00
     181  1.4000000000000e-02  4.0000000000000e-03  0.0000000000000e+00
     182  1.4000000000000e-02  5.0000000000000e-03  0.0000000000000e+00
     183  1.4000000000000e-02  6.0000000000000e-03  0.0000000000000e+00
     184  1.4000000000000e-02  7.0000000000000e-03  0.0000000000000e+00
     185  1.4000000000000e-02  8.0000000000000e-03  0.0000000000000e+00
     186  1.4000000000000e-02  9.0000000000000e-03  0.0000000000000e+00
     187  1.5000000000000e-02  1.0000000000000e-03  0.0000000000000e+00
     188  1.5000000000000e-02  2.0000000000000e-03  0.0000000000000e+00
     189  1.5000000000000e-02  3.0000000000000e-03  0.0000000000000e+00
     190  1.5000000000000e-02  4.0000000000000e-03  0.0000000000000e+00
     191  1.5000000000000e-02  5.0000000000000e-03  0.0000000000000e+00
     192  1.5000000000000e-02  6.0000000000000e-03  0.0000000000000e+00
     193  1.5000000000000e-02  7.0000000000000e-03  0.0000000000000e+00
     194  1.5000000000000e-02  8.0000000000000e-03  0.0000000000000e+00
     195  1.5000000000000e-02  9.0000000000000e-03  0.0000000000000e+00
     196  1.6000000000000e-02  1.0000000000000e-03  0.0000000000000e+00
     197  1.6000000000000e-02  2.0000000000000e-03  0.0000000000000e+00
     198  1.6000000000000e-02  3.0000000000000e-03  0.0000000000000e+00
     199  1.6000000000000e-02  4.0000000000000e-03  0.0000000000000e+00
     200  1.6000000000000e-02  5.0000000000000e-03  0.0000000000000e+00
     201  1.6000000000000e-02  6.0000000000000e-03  0.0000000000000e+00
     202  1.6000000000000e-02  7.0000000000000e-03  0.0000000000000e+00
     203  1.6000000000000e-02  8.0000000000000e-03  0.0000000000000e+00
     204  1.6000000000000e-02  9.0000000000000e-03  0.0000000000000e+00
     205  1.7000000000000e-02  1.0000000000000e-03  0.0000000000000e+00
     206  1.7000000000000e-02  2.0000000000000e-03  0.0000000000000e+00
     207  1.7000000000000e-02  3.0000000000000e-03  0.0000000000000e+00
     208  1.7000000000000e-02  4.0000000000000e-03  0.0000000000000e+00
     209  1.7000000000000e-02  5.0000000000000e-03  0.0000000000000e+00
     210  1.7000000000000e-02  6.0000000000000e-03  0.0000000000000e+00
     211  1.7000000000000e-02  7.0000000000000e-03  0.0000000000000e+00
     212  1.7000000000000e-02  8.0000000000000e-03  0.0000000000000e+00
     213  1.7000000000000e-02  9.0000000000000e-03  0.0000000000000e+00
     214  1.8000000000000e-02  1.0000000000000e-03  0.0000000000000e+00
     215  1.8000000000000e-02  2.0000000000000e-03  0.0000000000000e+00
     216  1.8000000000000e-02  3.0000000000000e-03  0.0000000000000e+00
     217  1.8000000000000e-02  4.0000000000000e-03  0.0000000000000e+00
     218  1.8000000000000e-02  5.0000000000000e-03  0.0000000000000e+00
     219  1.8000000000000e-02  6.0000000000000e-03  0.0000000000000e+00
     220  1.8000000000000e-02  7.0000000000000e-03  0.0000000000000e+00
     221  1.8000000000000e-02  8.0000000000000e-03  0.0000000000000e+00
     222  1.8000000000000e-02  9.0000000000000e-03  0.0000000000000e+00
     223  1.9000000000000e-02  1.0000000000000e-03  0.0000000000000e+00
     224  1.9000000000000e-02  2.0000000000000e-03  0.0000000000000e+00
     225  1.9000000000000e-02  3.0000000000000e-03  0.0000000000000e+00
     226  1.9000000000000e-02  4.0000000000000e-03  0.0000000000000e+00
     227  1.9000000000000e-02  5.0000000000000e-03  0.0000000000000e+00
     228  1.9000000000000e-02  6.0000000000000e-03  0.0000000000000e+00
     229  1.9000000000000e-02  7.0000000000000e-03  0.0000000000000e+00
     230  1.9000000000000e-02  8.0000000000000e-03  0.0000000000000e+00
     231  1.9000000000000e-02  9.0000000000000e-03  0.0000000000000e+00
     232  0.0000000000000e+00  1.1000000000000e-02  0.0000000000000e+00
     233  5.0000000000000e-03  1.1000000000000e-02  0.0000000000000e+00
     234  1.0000000000000e-03  1.1000000000000e-02  0.0000000000000e+00
     235  2.0000000000000e-03  1.1000000000000e-02  0.0000000000000e+00
     236  3.0000000000000e-03  1.1000000000000e-02  0.0000000000000e+00
     237  4.0000000000000e-03  1.1000000000000e-02  0.0000000000000e+00
     238  5.0000000000000e-03  1.2000000000000e-02  0.0000000000000e+00
     239  0.0000000000000e+00  1.2000000000000e-02  0.0000000000000e+00
     240  4.0000000000000e-03  1.2000000000000e-02  0.0000000000000e+00
     241  3.0000000000000e-03  1.2000000000000e-02  0.0000000000000e+00
     242  2.0000000000000e-03  1.2000000000000e-02  0.0000000000000e+00
     243  1.0000000000000e-03  1.2000000000000e-02  0.0000000000000e+00
     244  5.0000000000000e-03  2.0000000000000e-02  0.0000000000000e+00
     245  5.0000000000000e-03  1.3000000000000e-02  0.0000000000000e+00
     246  5.0000000000000e-03  1.4000000000000e-02  0.0000000000000e+00
     247  5.0000000000000e-03  1.5000000000000e-02  0.0000000000000e+00
     248  5.0000000000000e-03  1.6000000000000e-02  0.0000000000000e+00
     249  5.0000000000000e-03  1.7000000000000e-02  0.0000000000000e+00
     250  5.0000000000000e-03  1.8000000000000e-02  0.0000000000000e+00
     251  5.0000000000000e-03  1.9000000000000e-02  0.0000000000000e+00
     252  0.0000000000000e+00  2.0000000000000e-02  0.0000000000000e+00
     253  4.0000000000000e-03  2.0000000000000e-02  0.0000000000000e+00
     254  3.0000000000000e-03  2.0000000000000e-02  0.0000000000000e+00
     255  2.0000000000000e-03  2.0000000000000e-02  0.0000000000000e+00
     256  1.0000000000000e-03  2.0000000000000e-02  0.0000000000000e+00
     257  0.0000000000000e+00  1.9000000000000e-02  0.0000000000000e+00
     258  0.0000000000000e+00  1.8000000000000e-02  0.0000000000000e+00
     259  0.0000000000000e+00  1.7000000000000e-02  0.0000000000000e+00
     260  0.0000000000000e+00  1.6000000000000e-02  0.0000000000000e+00
     261  0.0000000000000e+00  1.5000000000000e-02  0.0000000000000e+00
     262  0.0000000000000e+00  1.4000000000000e-02  0.0000000000000e+00
     263  0.0000000000000e+00  1.3000000000000e-02  0.0000000000000e+00
     264  1.0000000000000e-03  1.3000000000000e-02  0.0000000000000e+00
     265  1.0000000000000e-03  1.4000000000000e-02  0.0000000000000e+00
     266  1.0000000000000e-03  1.5000000000000e-02  0.0000000000000e+00
     267  1.0000000000000e-03  1.6000000000000e-02  0.0000000000000e+00
     268  1.0000000000000e-03  1.7000000000000e-02  0.0000000000000e+00
     269  1.0000000000000e-03  1.8000000000000e-02  0.0000000000000e+00
     270  1.0000000000000e-03  1.9000000000000e-02  0.0000000000000e+00
     271  2.0000000000000e-03  1.3000000000000e-02  0.0000000000000e+00
     272  2.0000000000000e-03  1.4000000000000e-02  0.0000000000000e+00
     273  2.0000000000000e-03  1.5000000000000e-02  0.0000000000000e+00
     274  2.0000000000000e-03  1.6000000000000e-02  0.0000000000000e+00
     275  2.0000000000000e-03  1.7000000000000e-02  0.0000000000000e+00
     276  2.0000000000000e-03  1.8000000000000e-02  0.0000000000000e+00
     277  2.0000000000000e-03  1.9000000000000e-02  0.0000000000000e+00
     278  3.0000000000000e-03  1.3000000000000e-02  0.0000000000000e+00
     279  3.0000000000000e-03  1.4000000000000e-02  0.0000000000000e+00
     280  3.0000000000000e-03  1.5000000000000e-02  0.0000000000000e+00
     281  3.0000000000000e-03  1.6000000000000e-02  0.0000000000000e+00
     282  3.0000000000000e-03  1.7000000000000e-02  0.0000000000000e+00
     283  3.0000000000000e-03  1.8000000000000e-02  0.0000000000000e+00
     284  3.0000000000000e-03  1.9000000000000e-02  0.0000000000000e+00
     285  4.0000000000000e-03  1.3000000000000e-02  0.0000000000000e+00
     286  4.0000000000000e-03  1.4000000000000e-02  0.0000000000000e+00
     287  4.0000000000000e-03  1.5000000000000e-02  0.0000000000000e+00
     288  4.0000000000000e-03  1.6000000000000e-02  0.0000000000000e+00
     289  4.0000000000000e-03  1.7000000000000e-02  0.0000000000000e+00
     290  4.0000000000000e-03  1.8000000000000e-02  0.0000000000000e+00
     291  4.0000000000000e-03  1.9000000000000e-02  0.0000000000000e+00
     292  2.0000000000000e-02  3.0000000000000e-02  0.0000000000000e+00
     293  2.0000000000000e-02  1.1000000000000e-02  0.0000000000000e+00
     294  2.0000000000000e-02  1.2000000000000e-02  0.0000000000000e+00
     295  2.0000000000000e-02  1.3000000000000e-02  0.0000000000000e+00
     296  2.0000000000000e-02  1.4000000000000e-02  0.0000000000000e+00
     297  2.0000000000000e-02  1.5000000000000e-02  0.0000000000000e+00
     298  2.0000000000000e-02  1.6000000000000e-02  0.0000000000000e+00
     299  2.0000000000000e-02  1.7000000000000e-02  0.0000000000000e+00
     300  2.0000000000000e-02  1.8000000000000e-02  0.0000000000000e+00
     301  2.0000000000000e-02  1.9000000000000e-02  0.0000000000000e+00
     302  2.0000000000000e-02  2.0000000000000e-02  0.0000000000000e+00
     303  2.0000000000000e-02  2.1000000000000e-02  0.0000000000000e+00
     304  2.0000000000000e-02  2.2000000000000e-02  0.0000000000000e+00
     305  2.0000000000000e-02  2.3000000000000e-02  0.0000000000000e+00
     306  2.0000000000000e-02  2.4000000000000e-02  0.0000000000000e+00
     307  2.0000000000000e-02  2.5000000000000e-02  0.0000000000000e+00
     308  2.0000000000000e-02  2.6000000000000e-02  0.0000000000000e+00
     309  2.0000000000000e-02  2.7000000000000e-02  0.0000000000000e+00
     310  2.0000000000000e-02  2.8000000000000e-02  0.0000000000000e+00
     311  2.0000000000000e-02  2.9000000000000e-02  0.0000000000000e+00
     312  0.0000000000000e+00  3.0000000000000e-02  0.0000000000000e+00
     313  1.9000000000000e-02  3.0000000000000e-02  0.0000000000000e+00
     314  1.8000000000000e-02  3.0000000000000e-02  0.0000000000000e+00
     315  1.7000000000000e-02  3.0000000000000e-02  0.0000000000000e+00
     316  1.6000000000000e-02  3.0000000000000e-02  0.0000000000000e+00
     317  1.5000000000000e-02  3.0000000000000e-02  0.0000000000000e+00
     318  1.4000000000000e-02  3.0000000000000e-02  0.0000000000000e+00
     319  1.3000000000000e-02  3.0000000000000e-02  0.0000000000000e+00
     320  1.2000000000000e-02  3.0000000000000e-02  0.0000000000000e+00
     321  1.1000000000000e-02  3.0000000000000e-02  0.0000000000000e+00
     322  1.0000000000000e-02  3.0000000000000e-02  0.0000000000000e+00
     323  9.0000000000000e-03  3.0000000000000e-02  0.0000000000000e+00
     324  8.0000000000000e-03  3.0000000000000e-02  0.0000000000000e+00
     325  7.0000000000000e-03  3.0000000000000e-02  0.0000000000000e+00
     326  6.0000000000000e-03  3.0000000000000e-02  0.0000000000000e+00
     327  5.0000000000000e-03  3.0000000000000e-02  0.0000000000000e+00
     328  4.0000000000000e-03  3.0000000000000e-02  0.0000000000000e+00
     329  3.0000000000000e-03  3.0000000000000e-02  0.0000000000000e+00
     330  2.0000000000000e-03  3.0000000000000e-02  0.0000000000000e+00
     331  1.0000000000000e-03  3.0000000000000e-02  0.0000000000000e+00
     332  0.0000000000000e+00  2.9000000000000e-02  0.0000000000000e+00
     333  0.0000000000000e+00  2.8000000000000e-02  0.0000000000000e+00
     334  0.0000000000000e+00  2.7000000000000e-02  0.0000000000000e+00
     335  0.0000000000000e+00  2.6000000000000e-02  0.0000000000000e+00
     336  0.0000000000000e+00  2.5000000000000e-02  0.0000000000000e+00
     337  0.0000000000000e+00  2.4000000000000e-02  0.0000000000000e+00
     338  0.0000000000000e+00  2.3000000000000e-02  0.0000000000000e+00
     339  0.0000000000000e+00  2.2000000000000e-02  0.0000000000000e+00
     340  0.0000000000000e+00  2.1000000000000e-02  0.0000000000000e+00
     341  9.9999999999780e-04  2.2000000000000e-02  0.0000000000000e+00
     342  9.9999999999690e-04  2.3000000000000e-02  0.0000000000000e+00
     343  9.9999999999590e-04  2.4000000000000e-02  0.0000000000000e+00
     344  9.9999999999680e-04  2.5000000000000e-02  0.0000000000000e+00
     345  9.9999999999810e-04  2.6000000000000e-02  0.0000000000000e+00
     346  9.9999999999930e-04  2.7000000000000e-02  0.0000000000000e+00
     347  9.9999999999920e-04  2.8000000000000e-02  0.0000000000000e+00
     348  9.9999999999950e-04  2.9000000000000e-02  0.0000000000000e+00
     349  2.0000000000010e-03  2.9000000000000e-02  0.0000000000000e+00
     350  3.0000000000010e-03  2.9000000000000e-02  0.0000000000000e+00
     351  4.0000000000020e-03  2.9000000000010e-02  0.0000000000000e+00
     352  5.0000000000030e-03  2.9000000000010e-02  0.0000000000000e+00
     353  6.0000000000030e-03  2.9000000000010e-02  0.0000000000000e+00
     354  7.0000000000030e-03  2.9000000000010e-02  0.0000000000000e+00
     355  8.0000000000030e-03  2.9000000000010e-02  0.0000000000000e+00
     356  9.0000000000030e-03  2.9000000000010e-02  0.0000000000000e+00
     357  1.0000000000000e-02  2.9000000000010e-02  0.0000000000000e+00
     358  1.1000000000000e-02  2.9000000000010e-02  0.0000000000000e+00
     359  1.2000000000000e-02  2.9000000000010e-02  0.0000000000000e+00
     360  1.3000000000000e-02  2.9000000000010e-02  0.0000000000000e+00
     361  1.4000000000000e-02  2.9000000000010e-02  0.0000000000000e+00
     362  1.5000000000000e-02  2.9000000000000e-02  0.0000000000000e+00
     363  1.6000000000000e-02  2.9000000000000e-02  0.0000000000000e+00
     364  1.7000000000000e-02  2.9000000000000e-02  0.0000000000000e+00
     365  1.8000000000000e-02  2.9000000000000e-02  0.0000000000000e+00
     366  1.9000000000000e-02  2.9000000000000e-02  0.0000000000000e+00
     367  1.9000000000000e-02  2.8000000000000e-02  0.0000000000000e+00
     368  1.9000000000000e-02  2.7000000000000e-02  0.0000000000000e+00
     369  1.9000000000000e-02  2.6000000000000e-02  0.0000000000000e+00
     370  1.9000000000010e-02  2.5000000000000e-02  0.0000000000000e+00
     371  1.9000000000010e-02  2.4000000000000e-02  0.0000000000000e+00
     372  1.9000000000010e-02  2.3000000000000e-02  0.0000000000000e+00
     373  1.9000000000010e-02  2.2000000000000e-02  0.0000000000000e+00
     374  1.9000000000010e-02  2.1000000000000e-02  0.0000000000000e+00
     375  1.9000000000010e-02  2.0000000000000e-02  0.0000000000000e+00
     376  1.9000000000010e-02  1.9000000000000e-02  0.0000000000000e+00
     377  1.9000000000010e-02  1.8000000000000e-02  0.0000000000000e+00
     378  1.9000000000010e-02  1.7000000000000e-02  0.0000000000000e+00
     379  1.9000000000010e-02  1.6000000000000e-02  0.0000000000000e+00
     380  1.9000000000010e-02  1.5000000000000e-02  0.0000000000000e+00
     381  1.9000000000000e-02  1.4000000000000e-02  0.0000000000000e+00
     382  1.9000000000000e-02  1.3000000000000e-02  0.0000000000000e+00
     383  1.9000000000000e-02  1.2000000000000e-02  0.0000000000000e+00
     384  1.9000000000000e-02  1.1000000000000e-02  0.0000000000000e+00
     385  1.9999999999970e-03  2.1000000000000e-02  0.0000000000000e+00
     386  2.9999999999960e-03  2.1000000000000e-02  0.0000000000000e+00
     387  3.9999999999940e-03  2.1000000000000e-02  0.0000000000000e+00
     388  4.9969179726920e-03  2.0999205467430e-02  0.0000000000000e+00
     389  5.9936594458470e-03  1.9997736691220e-02  0.0000000000000e+00
     390  5.9916837512300e-03  1.8997944023570e-02  0.0000000000000e+00
     391  5.9999999999920e-03  1.8000000000000e-02  0.0000000000000e+00
     392  5.9999999999930e-03  1.7000000000000e-02  0.0000000000000e+00
     393  5.9999999999930e-03  1.6000000000000e-02  0.0000000000000e+00
     394  5.9999999999950e-03  1.5000000000000e-02  0.0000000000000e+00
     395  5.9999999999960e-03  1.4000000000000e-02  0.0000000000000e+00
     396  5.9999999999970e-03  1.3000000000000e-02  0.0000000000000e+00
     397  5.9999999999980e-03  1.2000000000000e-02  0.0000000000000e+00
     398  5.9999999999990e-03  1.1000000000000e-02  0.0000000000000e+00
     399  6.9999999999990e-03  1.1000000000000e-02  0.0000000000000e+00
     400  7.9999999999980e-03  1.1000000000000e-02  0.0000000000000e+00
     401  8.9999999999980e-03  1.1000000000000e-02  0.0000000000000e+00
     402  9.9999999999980e-03  1.0999999999990e-02  0.0000000000000e+00
     403  1.1000000000000e-02  1.0999999999990e-02  0.0000000000000e+00
     404  1.2000000000000e-02  1.0999999999990e-02  0.0000000000000e+00
     405  1.3000000000000e-02  1.0999999999990e-02  0.0000000000000e+00
     406  1.4000000000000e-02  1.0999999999990e-02  0.0000000000000e+00
     407  1.5000000000000e-02  1.0999999999990e-02  0.0000000000000e+00
     408  1.5995064304990e-02  1.1003781725680e-02  0.0000000000000e+00
     409  1.7000000000000e-02  1.1000000000000e-02  0.0000000000000e+00
     410  1.8000000000000e-02  1.1000000000000e-02  0.0000000000000e+00
     411  5.9937604429060e-03  2.0997195980040e-02  0.0000000000000e+00
     412  1.9999999999960e-03  2.2000000000000e-02  0.0000000000000e+00
     413  1.9999480639490e-03  2.2999999437120e-02  0.0000000000000e+00
     414  1.9999536738320e-03  2.3999997845490e-02  0.0000000000000e+00
     415  1.9999979562560e-03  2.5000000106660e-02  0.0000000000000e+00
     416  1.9999999999970e-03  2.6000000000000e-02  0.0000000000000e+00
     417  1.9999999999990e-03  2.7000000000000e-02  0.0000000000000e+00
     418  1.9999999999990e-03  2.8000000000000e-02  0.0000000000000e+00
     419  3.0000000000000e-03  2.8000000000010e-02  0.0000000000000e+00
     420  3.9999986433370e-03  2.7999998521050e-02  0.0000000000000e+00
     421  4.9999984963180e-03  2.7999998024750e-02  0.0000000000000e+00
     422  5.9999998526590e-03  2.7999999937750e-02  0.0000000000000e+00
     423  7.0000000000050e-03  2.8000000000010e-02  0.0000000000000e+00
     424  8.0000000000050e-03  2.8000000000010e-02  0.0000000000000e+00
     425  9.0000000000050e-03  2.8000000000020e-02  0.0000000000000e+00
     426  1.0000000000000e-02  2.8000000000010e-02  0.0000000000000e+00
     427  1.1000000000000e-02  2.8000000000010e-02  0.0000000000000e+00
     428  1.2000000000000e-02  2.8000000000010e-02  0.0000000000000e+00
     429  1.3000000000000e-02  2.8000000000010e-02  0.0000000000000e+00
     430  1.4000000000000e-02  2.8000000000010e-02  0.0000000000000e+00
     431  1.5000000000000e-02  2.8000000000010e-02  0.0000000000000e+00
     432  1.6000000000000e-02  2.8000000000010e-02  0.0000000000000e+00
     433  1.7000000000000e-02  2.8000000000000e-02  0.0000000000000e+00
     434  1.8000000000000e-02  2.8000000000000e-02  0.0000000000000e+00
     435  1.8000000000000e-02  2.7000000000000e-02  0.0000000000000e+00
     436  1.7999923108180e-02  2.5999946690580e-02  0.0000000000000e+00
     437  1.7999846536340e-02  2.4999941133930e-02  0.0000000000000e+00
     438  1.7999715655710e-02  2.3999883161540e-02  0.0000000000000e+00
     439  1.7999650460340e-02  2.2999760603230e-02  0.0000000000000e+00
     440  1.7999664899630e-02  2.1999581281260e-02  0.0000000000000e+00
     441  1.7999846502150e-02  2.0999348218600e-02  0.0000000000000e+00
     442  1.8000308656020e-02  1.9999081213220e-02  0.0000000000000e+00
     443  1.8001168820960e-02  1.8998823966680e-02  0.0000000000000e+00
     444  1.8002538548980e-02  1.7998640422170e-02  0.0000000000000e+00
     445  1.8004462544400e-02  1.6998599401960e-02  0.0000000000000e+00
     446  1.8006797074370e-02  1.5998737303240e-02  0.0000000000000e+00
     447  1.8008843957600e-02  1.4999024697430e-02  0.0000000000000e+00
     448  1.7939261522570e-02  1.4006242478780e-02  0.0000000000000e+00
     449  1.7974579494670e-02  1.3005297468970e-02  0.0000000000000e+00
     450  1.8000000000000e-02  1.2000000000000e-02  0.0000000000000e+00
     451  2.9999372464460e-03  2.1999998675110e-02  0.0000000000000e+00
     452  3.9992751386130e-03  2.1999891034990e-02  0.0000000000000e+00
     453  4.9969803953080e-03  2.1998562983590e-02  0.0000000000000e+00
     454  6.9915023955210e-03  1.8998922772380e-02  0.0000000000000e+00
     455  6.9912969405860e-03  1.9997814724900e-02  0.0000000000000e+00
     456  6.9966672529220e-03  1.8000007353750e-02  0.0000000000000e+00
     457  6.9990949570570e-03  1.7000140875440e-02  0.0000000000000e+00
     458  7.0000343881800e-03  1.6000092933210e-02  0.0000000000000e+00
     459  6.9999995841450e-03  1.5000000055430e-02  0.0000000000000e+00
     460  6.9999999184870e-03  1.4000000050240e-02  0.0000000000000e+00
     461  6.9999999999960e-03  1.3000000000000e-02  0.0000000000000e+00
     462  6.9999999999970e-03  1.2000000000000e-02  0.0000000000000e+00
     463  7.9999999999970e-03  1.2000000000000e-02  0.0000000000000e+00
     464  8.9999999999970e-03  1.1999999999990e-02  0.0000000000000e+00
     465  9.9999999999970e-03  1.1999999999990e-02  0.0000000000000e+00
     466  1.1000000000000e-02  1.1999999999990e-02  0.0000000000000e+00
     467  1.2000042851780e-02  1.2000010269090e-02  0.0000000000000e+00
     468  1.3000164872160e-02  1.2000050936890e-02  0.0000000000000e+00
     469  1.4000453953980e-02  1.2000142954860e-02  0.0000000000000e+00
     470  1.4995098680260e-02  1.1999546722130e-02  0.0000000000000e+00
     471  1.5992750920490e-02  1.2001766720660e-02  0.0000000000000e+00
     472  1.6991306383900e-02  1.2001469941100e-02  0.0000000000000e+00
     473  5.9949052163270e-03  2.1997292520410e-02  0.0000000000000e+00
     474  2.9998262585890e-03  2.2999978972320e-02  0.0000000000000e+00
     475  2.9996339526240e-03  2.3999923191520e-02  0.0000000000000e+00
     476  2.9998030914340e-03  2.4999931973200e-02  0.0000000000000e+00
     477  2.9998939913360e-03  2.5999941513630e-02  0.0000000000000e+00
     478  2.9999924004860e-03  2.6999996096610e-02  0.0000000000000e+00
     479  3.9999470637650e-03  2.6999944721690e-02  0.0000000000000e+00
     480  4.9999472104020e-03  2.6999914479980e-02  0.0000000000000e+00
     481  5.9999610145610e-03  2.6999931097600e-02  0.0000000000000e+00
     482  6.9999832235410e-03  2.6999990863490e-02  0.0000000000000e+00
     483  7.9999992814430e-03  2.7000000826600e-02  0.0000000000000e+00
     484  9.0000026273110e-03  2.7000005860490e-02  0.0000000000000e+00
     485  1.0000001662580e-02  2.7000011540390e-02  0.0000000000000e+00
     486  1.0999998838990e-02  2.7000019114810e-02  0.0000000000000e+00
     487  1.1999993248130e-02  2.7000027714650e-02  0.0000000000000e+00
     488  1.2999984350230e-02  2.7000035161450e-02  0.0000000000000e+00
     489  1.3999972563010e-02  2.7000037044140e-02  0.0000000000000e+00
     490  1.4999960592540e-02  2.7000027877650e-02  0.0000000000000e+00
     491  1.6999974876910e-02  2.6999990788410e-02  0.0000000000000e+00
     492  1.6999894505730e-02  2.5999944418160e-02  0.0000000000000e+00
     493  1.6999754487560e-02  2.4999759451430e-02  0.0000000000000e+00
     494  1.6999644812520e-02  2.3999543495600e-02  0.0000000000000e+00
     495  1.6999660805350e-02  2.2999283071110e-02  0.0000000000000e+00
     496  1.7000048547970e-02  2.1999043555720e-02  0.0000000000000e+00
     497  1.7000754299430e-02  2.0998879113510e-02  0.0000000000000e+00
     498  1.7001746867370e-02  1.9998884357890e-02  0.0000000000000e+00
     499  1.7002819728610e-02  1.8999163265970e-02  0.0000000000000e+00
     500  1.7003495907620e-02  1.7999799441330e-02  0.0000000000000e+00
     501  1.7002904883340e-02  1.7000802561260e-02  0.0000000000000e+00
     502  1.6999478765520e-02  1.6002010796180e-02  0.0000000000000e+00
     503  1.6989981433260e-02  1.5002944341540e-02  0.0000000000000e+00
     504  1.6968676198180e-02  1.3005999963760e-02  0.0000000000000e+00
     505  3.9989170897940e-03  2.2999600292620e-02  0.0000000000000e+00
     506  5.9968603332380e-03  2.2997836966810e-02  0.0000000000000e+00
     507  7.9917028932300e-03  1.9000464350180e-02  0.0000000000000e+00
     508  7.9948098082100e-03  1.9988069491530e-02  0.0000000000000e+00
     509  6.9919993791360e-03  2.0997364312990e-02  0.0000000000000e+00
     510  8.0000525543560e-03  1.4000246176590e-02  0.0000000000000e+00
     511  7.9999998777350e-03  1.3000000301470e-02  0.0000000000000e+00
     512  9.0000263548740e-03  1.3000090279060e-02  0.0000000000000e+00
     513  1.0000035301420e-02  1.3000075743120e-02  0.0000000000000e+00
     514  1.0999760846400e-02  1.2999743924770e-02  0.0000000000000e+00
     515  1.1994489450880e-02  1.2998475152440e-02  0.0000000000000e+00
     516  1.2991826427680e-02  1.2997332047160e-02  0.0000000000000e+00
     517  1.3991454422810e-02  1.2998529965730e-02  0.0000000000000e+00
     518  1.4984999480660e-02  1.3000184996610e-02  0.0000000000000e+00
     519  1.5974178755050e-02  1.3005321436780e-02  0.0000000000000e+00
     520  6.9978068929410e-03  2.1996723644440e-02  0.0000000000000e+00
     521  3.9992756761390e-03  2.3999610680010e-02  0.0000000000000e+00
     522  3.9996217112400e-03  2.4999681014260e-02  0.0000000000000e+00
     523  3.9998491191800e-03  2.5999854346890e-02  0.0000000000000e+00
     524  4.9997946080090e-03  2.5999659044590e-02  0.0000000000000e+00
     525  5.9998568648550e-03  2.5999448532630e-02  0.0000000000000e+00
     526  6.9998438046380e-03  2.5999434378160e-02  0.0000000000000e+00
     527  7.9998917496580e-03  2.5999625919490e-02  0.0000000000000e+00
     528  8.9999911432840e-03  2.5999986022910e-02  0.0000000000000e+00
     529  9.9999861658630e-03  2.6000050348980e-02  0.0000000000000e+00
     530  1.0999960472400e-02  2.6000063644700e-02  0.0000000000000e+00
     531  1.1999930391650e-02  2.6000051821380e-02  0.0000000000000e+00
     532  1.2999892861200e-02  2.6000006547760e-02  0.0000000000000e+00
     533  1.3999854862300e-02  2.5999921607590e-02  0.0000000000000e+00
     534  1.4999832038890e-02  2.5999842435670e-02  0.0000000000000e+00
     535  1.5999956071650e-02  2.7000007738930e-02  0.0000000000000e+00
     536  1.5999835175170e-02  2.5999884482660e-02  0.0000000000000e+00
     537  1.5999808529270e-02  2.3999344686300e-02  0.0000000000000e+00
     538  1.6000098852130e-02  2.2999115764060e-02  0.0000000000000e+00
     539  1.6000898855660e-02  2.1998842655650e-02  0.0000000000000e+00
     540  1.6001903066330e-02  2.0998881559490e-02  0.0000000000000e+00
     541  1.6002874594550e-02  1.9999221951710e-02  0.0000000000000e+00
     542  1.6003364282890e-02  1.8999895724980e-02  0.0000000000000e+00
     543  1.6002755358390e-02  1.8000806262040e-02  0.0000000000000e+00
     544  1.6000361456550e-02  1.7001765653520e-02  0.0000000000000e+00
     545  1.5995590856810e-02  1.6002513406750e-02  0.0000000000000e+00
     546  1.5987568009430e-02  1.5002937417410e-02  0.0000000000000e+00
     547  1.6963232860300e-02  1.4002503411370e-02  0.0000000000000e+00
     548  4.9978731498840e-03  2.2998571524330e-02  0.0000000000000e+00
     549  7.9957597853070e-03  1.8001436411830e-02  0.0000000000000e+00
     550  7.9949908237080e-03  2.0989576370980e-02  0.0000000000000e+00
     551  7.9986250282530e-03  1.7001507482970e-02  0.0000000000000e+00
     552  7.9999424024850e-03  1.6001006544420e-02  0.0000000000000e+00
     553  8.0001059100840e-03  1.5000522424130e-02  0.0000000000000e+00
     554  8.9997660643050e-03  1.4000270528480e-02  0.0000000000000e+00
     555  9.9985263404480e-03  1.3999942761090e-02  0.0000000000000e+00
     556  1.0997061210330e-02  1.3998744658050e-02  0.0000000000000e+00
     557  1.1994860001880e-02  1.3997242358030e-02  0.0000000000000e+00
     558  1.2991695549540e-02  1.3997594772250e-02  0.0000000000000e+00
     559  1.3988563098920e-02  1.3999160640630e-02  0.0000000000000e+00
     560  1.5974036359520e-02  1.4003180612870e-02  0.0000000000000e+00
     561  4.9987350250260e-03  2.3998801060410e-02  0.0000000000000e+00
     562  8.9928809602230e-03  1.7996529762550e-02  0.0000000000000e+00
     563  8.9875470873280e-03  1.8984870588360e-02  0.0000000000000e+00
     564  8.9902971798110e-03  1.9985998462490e-02  0.0000000000000e+00
     565  8.9961470288680e-03  1.6999671295550e-02  0.0000000000000e+00
     566  8.9995398823950e-03  1.6001593413050e-02  0.0000000000000e+00
     567  8.9999203446720e-03  1.5000706877100e-02  0.0000000000000e+00
     568  9.9999999999870e-04  2.1000000000000e-02  0.0000000000000e+00
     569  1.5999725230750e-02  2.4999644437840e-02  0.0000000000000e+00
     570  1.4982743873890e-02  1.4001584071400e-02  0.0000000000000e+00
     571  1.1992251717860e-02  1.8998830400840e-02  0.0000000000000e+00
     572  1.1995048121060e-02  2.0997702016250e-02  0.0000000000000e+00
     573  1.1997513860590e-02  2.1997761039840e-02  0.0000000000000e+00
     574  1.0995969296660e-02  2.1994177626780e-02  0.0000000000000e+00
     575  1.0992975920510e-02  2.0993507317460e-02  0.0000000000000e+00
     576  1.0983687499100e-02  1.8992360424080e-02  0.0000000000000e+00
     577  1.1993644585930e-02  1.8001979764900e-02  0.0000000000000e+00
     578  1.2998353909870e-02  1.8004771252780e-02  0.0000000000000e+00
     579  1.2996646325260e-02  1.9001934371280e-02  0.0000000000000e+00
     580  1.2996145511710e-02  1.9999698264450e-02  0.0000000000000e+00
     581  1.2997907736010e-02  2.1000463902380e-02  0.0000000000000e+00
     582  1.2998641998310e-02  2.1999655905560e-02  0.0000000000000e+00
     583  1.2999449830780e-02  2.2998649413430e-02  0.0000000000000e+00
     584  1.1999465598550e-02  2.2997699167340e-02  0.0000000000000e+00
     585  1.0998076724500e-02  2.2995045709230e-02  0.0000000000000e+00
     586  9.9979066602290e-03  2.2992497791770e-02  0.0000000000000e+00
     587  1.3004009265240e-02  1.7006576473520e-02  0.0000000000000e+00
     588  9.9951454244120e-03  2.1992382769810e-02  0.0000000000000e+00
     589  9.9909684616760e-03  2.0988086964420e-02  0.0000000000000e+00
     590  9.9732297010870e-03  1.8980279718080e-02  0.0000000000000e+00
     591  1.0991407090240e-02  1.7995886389210e-02  0.0000000000000e+00
     592  1.1008876472480e-02  1.7014277835710e-02  0.0000000000000e+00
     593  1.3996952741640e-02  1.7002036498490e-02  0.0000000000000e+00
     594  1.4002296121760e-02  1.8002921634350e-02  0.0000000000000e+00
     595  1.3999480925020e-02  1.9003005469650e-02  0.0000000000000e+00
     596  1.3999577758400e-02  2.0001247252850e-02  0.0000000000000e+00
     597  1.4000486771290e-02  2.1000672398030e-02  0.0000000000000e+00
     598  1.4000039639440e-02  2.1999952244780e-02  0.0000000000000e+00
     599  1.4000606640730e-02  2.2999446420620e-02  0.0000000000000e+00
     600  1.4000041252640e-02  2.3999365993880e-02  0.0000000000000e+00
     601  1.3000244557450e-02  2.3999507803210e-02  0.0000000000000e+00
     602  1.2000622738630e-02  2.3999407700570e-02  0.0000000000000e+00
     603  1.1000409165700e-02  2.3998143766200e-02  0.0000000000000e+00
     604  1.0000358692400e-02  2.3996650896300e-02  0.0000000000000e+00
     605  1.3991650407850e-02  1.6002405420490e-02  0.0000000000000e+00
     606  1.2992712696280e-02  1.6001745131690e-02  0.0000000000000e+00
     607  1.1995199845480e-02  1.6002405235490e-02  0.0000000000000e+00
     608  1.0994585475420e-02  1.6000199715600e-02  0.0000000000000e+00
     609  9.9978720472980e-03  1.5997693472340e-02  0.0000000000000e+00
     610  8.9989479891040e-03  2.2993838525640e-02  0.0000000000000e+00
     611  8.9953094673320e-03  2.1990791123580e-02  0.0000000000000e+00
     612  9.9862507905990e-03  1.9984831618740e-02  0.0000000000000e+00
     613  9.9920129309600e-03  1.7971797031620e-02  0.0000000000000e+00
     614  9.9929884858380e-03  1.6995926896650e-02  0.0000000000000e+00
     615  1.4994799446550e-02  1.6001234316900e-02  0.0000000000000e+00
     616  1.4998788487840e-02  1.7001229556330e-02  0.0000000000000e+00
     617  1.5001491941390e-02  1.8000854492680e-02  0.0000000000000e+00
     618  1.5002938521840e-02  1.9000217838000e-02  0.0000000000000e+00
     619  1.5003180231760e-02  1.9999615556160e-02  0.0000000000000e+00
     620  1.5002600189110e-02  2.0999217476940e-02  0.0000000000000e+00
     621  1.5001376612450e-02  2.1999167678000e-02  0.0000000000000e+00
     622  1.5000472105870e-02  2.2999185192160e-02  0.0000000000000e+00
     623  1.3999794469510e-02  2.4999522186300e-02  0.0000000000000e+00
     624  1.2999824601090e-02  2.4999655243470e-02  0.0000000000000e+00
     625  1.1999876005640e-02  2.4999814744310e-02  0.0000000000000e+00
     626  1.0999875483480e-02  2.4999835261610e-02  0.0000000000000e+00
     627  9.9999700218770e-03  2.4999299540090e-02  0.0000000000000e+00
     628  9.0001472104750e-03  2.3995362748580e-02  0.0000000000000e+00
     629  7.9993803306420e-03  2.3996771469010e-02  0.0000000000000e+00
     630  1.3991346280500e-02  1.5000056882150e-02  0.0000000000000e+00
     631  1.2991255949590e-02  1.5001506663380e-02  0.0000000000000e+00
     632  1.1992494733350e-02  1.4999208152290e-02  0.0000000000000e+00
     633  1.0997728082010e-02  1.4997933833560e-02  0.0000000000000e+00
     634  9.9991716523140e-03  1.5000524262210e-02  0.0000000000000e+00
     635  7.9993524806730e-03  2.2994451695620e-02  0.0000000000000e+00
     636  8.9909054521230e-03  2.0987735925310e-02  0.0000000000000e+00
     637  6.9983171554420e-03  2.3998120292660e-02  0.0000000000000e+00
     638  5.9982515912360e-03  2.3998399732210e-02  0.0000000000000e+00
     639  1.4989034844910e-02  1.5000991281420e-02  0.0000000000000e+00
     640  1.4999870127830e-02  2.3999320520910e-02  0.0000000000000e+00
     641  1.4999730368890e-02  2.4999586082800e-02  0.0000000000000e+00
     642  8.9997810005830e-03  2.4998826483270e-02  0.0000000000000e+00
     643  7.9994073746860e-03  2.4998652687200e-02  0.0000000000000e+00
     644  6.9992418163010e-03  2.4998543310460e-02  0.0000000000000e+00
     645  5.9995113621900e-03  2.4999115989130e-02  0.0000000000000e+00
     646  4.9995730453050e-03  2.4999227195060e-02  0.0000000000000e+00
     647  6.9988115285070e-03  2.2997363859220e-02  0.0000000000000e+00
     648  7.9980503989510e-03  2.1991979970850e-02  0.0000000000000e+00
     649  1.0989999553530e-02  1.9992843452620e-02  0.0000000000000e+00
     650  1.1999983187960e-02  1.7005791165750e-02  0.0000000000000e+00
     651  1.1992924629510e-02  1.9998310340550e-02  0.0000000000000e+00

[3D Elements]
#ElemNr  ElemType  NrOfNodes  Level
#Node1 Node2 ... NodeNrOfNodes

[2D Elements]
#ElemNr  ElemType  NrOfNodes  Level
#Node1 Node2 ... NodeNrOfNodes
1 6 4 material
1 3 61 60
2 6 4 material
3 4 70 61
3 6 4 material
4 5 79 70
4 6 4 material
5 6 88 79
5 6 4 material
6 7 97 88
6 6 4 material
7 8 106 97
7 6 4 material
8 9 115 106
8 6 4 material
9 10 124 115
9 6 4 material
10 11 133 124
10 6 4 material
11 12 142 133
11 6 4 material
12 13 151 142
12 6 4 material
13 14 160 151
13 6 4 material
14 15 169 160
14 6 4 material
15 16 178 169
15 6 4 material
16 17 187 178
16 6 4 material
17 18 196 187
17 6 4 material
18 19 205 196
18 6 4 material
19 20 214 205
19 6 4 material
20 21 223 214
20 6 4 material
21 2 23 223
21 6 4 material
60 61 62 59
22 6 4 material
61 70 71 62
23 6 4 material
70 79 80 71
24 6 4 material
79 88 89 80
25 6 4 material
88 97 98 89
26 6 4 material
97 106 107 98
27 6 4 material
106 115 116 107
28 6 4 material
115 124 125 116
29 6 4 material
124 133 134 125
30 6 4 material
133 142 143 134
31 6 4 material
142 151 152 143
32 6 4 material
151 160 161 152
33 6 4 material
160 169 170 161
34 6 4 material
169 178 179 170
35 6 4 material
178 187 188 179
36 6 4 material
187 196 197 188
37 6 4 material
196 205 206 197
38 6 4 material
205 214 215 206
39 6 4 material
214 223 224 215
40 6 4 material
223 23 24 224
41 6 4 material
59 62 63 58
42 6 4 material
62 71 72 63
43 6 4 material
71 80 81 72
44 6 4 material
80 89 90 81
45 6 4 material
89 98 99 90
46 6 4 material
98 107 108 99
47 6 4 material
107 116 117 108
48 6 4 material
116 125 126 117
49 6 4 material
125 134 135 126
50 6 4 material
134 143 144 135
51 6 4 material
143 152 153 144
52 6 4 material
152 161 162 153
53 6 4 material
161 170 171 162
54 6 4 material
170 179 180 171
55 6 4 material
179 188 189 180
56 6 4 material
188 197 198 189
57 6 4 material
197 206 207 198
58 6 4 material
206 215 216 207
59 6 4 material
215 224 225 216
60 6 4 material
224 24 25 225
61 6 4 material
58 63 64 57
62 6 4 material
63 72 73 64
63 6 4 material
72 81 82 73
64 6 4 material
81 90 91 82
65 6 4 material
90 99 100 91
66 6 4 material
99 108 109 100
67 6 4 material
108 117 118 109
68 6 4 material
117 126 127 118
69 6 4 material
126 135 136 127
70 6 4 material
135 144 145 136
71 6 4 material
144 153 154 145
72 6 4 material
153 162 163 154
73 6 4 material
162 171 172 163
74 6 4 material
171 180 181 172
75 6 4 material
180 189 190 181
76 6 4 material
189 198 199 190
77 6 4 material
198 207 208 199
78 6 4 material
207 216 217 208
79 6 4 material
216 225 226 217
80 6 4 material
225 25 26 226
81 6 4 material
57 64 65 56
82 6 4 material
64 73 74 65
83 6 4 material
73 82 83 74
84 6 4 material
82 91 92 83
85 6 4 material
91 100 101 92
86 6 4 material
100 109 110 101
87 6 4 material
109 118 119 110
88 6 4 material
118 127 128 119
89 6 4 material
127 136 137 128
90 6 4 material
136 145 146 137
91 6 4 material
145 154 155 146
92 6 4 material
154 163 164 155
93 6 4 material
163 172 173 164
94 6 4 material
172 181 182 173
95 6 4 material
181 190 191 182
96 6 4 material
190 199 200 191
97 6 4 material
199 208 209 200
98 6 4 material
208 217 218 209
99 6 4 material
217 226 227 218
100 6 4 material
226 26 27 227
101 6 4 material
56 65 66 55
102 6 4 material
65 74 75 66
103 6 4 material
74 83 84 75
104 6 4 material
83 92 93 84
105 6 4 material
92 101 102 93
106 6 4 material
101 110 111 102
107 6 4 material
110 119 120 111
108 6 4 material
119 128 129 120
109 6 4 material
128 137 138 129
110 6 4 material
137 146 147 138
111 6 4 material
146 155 156 147
112 6 4 material
155 164 165 156
113 6 4 material
164 173 174 165
114 6 4 material
173 182 183 174
115 6 4 material
182 191 192 183
116 6 4 material
191 200 201 192
117 6 4 material
200 209 210 201
118 6 4 material
209 218 219 210
119 6 4 material
218 227 228 219
120 6 4 material
227 27 28 228
121 6 4 material
55 66 67 54
122 6 4 material
66 75 76 67
123 6 4 material
75 84 85 76
124 6 4 material
84 93 94 85
125 6 4 material
93 102 103 94
126 6 4 material
102 111 112 103
127 6 4 material
111 120 121 112
128 6 4 material
120 129 130 121
129 6 4 material
129 138 139 130
130 6 4 material
138 147 148 139
131 6 4 material
147 156 157 148
132 6 4 material
156 165 166 157
133 6 4 material
165 174 175 166
134 6 4 material
174 183 184 175
135 6 4 material
183 192 193 184
136 6 4 material
192 201 202 193
137 6 4 material
201 210 211 202
138 6 4 material
210 219 220 211
139 6 4 material
219 228 229 220
140 6 4 material
228 28 29 229
141 6 4 material
54 67 68 53
142 6 4 material
67 76 77 68
143 6 4 material
76 85 86 77
144 6 4 material
85 94 95 86
145 6 4 material
94 103 104 95
146 6 4 material
103 112 113 104
147 6 4 material
112 121 122 113
148 6 4 material
121 130 131 122
149 6 4 material
130 139 140 131
150 6 4 material
139 148 149 140
151 6 4 material
148 157 158 149
152 6 4 material
157 166 167 158
153 6 4 material
166 175 176 167
154 6 4 material
175 184 185 176
155 6 4 material
184 193 194 185
156 6 4 material
193 202 203 194
157 6 4 material
202 211 212 203
158 6 4 material
211 220 221 212
159 6 4 material
220 229 230 221
160 6 4 material
229 29 30 230
161 6 4 material
53 68 69 52
162 6 4 material
68 77 78 69
163 6 4 material
77 86 87 78
164 6 4 material
86 95 96 87
165 6 4 material
95 104 105 96
166 6 4 material
104 113 114 105
167 6 4 material
113 122 123 114
168 6 4 material
122 131 132 123
169 6 4 material
131 140 141 132
170 6 4 material
140 149 150 141
171 6 4 material
149 158 159 150
172 6 4 material
158 167 168 159
173 6 4 material
167 176 177 168
174 6 4 material
176 185 186 177
175 6 4 material
185 194 195 186
176 6 4 material
194 203 204 195
177 6 4 material
203 212 213 204
178 6 4 material
212 221 222 213
179 6 4 material
221 230 231 222
180 6 4 material
230 30 31 231
181 6 4 material
52 69 51 32
182 6 4 material
69 78 50 51
183 6 4 material
78 87 49 50
184 6 4 material
87 96 48 49
185 6 4 material
96 105 47 48
186 6 4 material
105 114 46 47
187 6 4 material
114 123 45 46
188 6 4 material
123 132 44 45
189 6 4 material
132 141 43 44
190 6 4 material
141 150 42 43
191 6 4 material
150 159 41 42
192 6 4 material
159 168 40 41
193 6 4 material
168 177 39 40
194 6 4 material
177 186 38 39
195 6 4 material
186 195 37 38
196 6 4 material
195 204 36 37
197 6 4 material
204 213 35 36
198 6 4 material
213 222 34 35
199 6 4 material
222 231 33 34
200 6 4 material
231 31 22 33
201 6 4 coil
232 234 243 239
202 6 4 coil
234 235 242 243
203 6 4 coil
235 236 241 242
204 6 4 coil
236 237 240 241
205 6 4 coil
237 233 238 240
206 6 4 perm
239 243 264 263
207 6 4 perm
243 242 271 264
208 6 4 perm
242 241 278 271
209 6 4 perm
241 240 285 278
210 6 4 perm
240 238 245 285
211 6 4 perm
263 264 265 262
212 6 4 perm
264 271 272 265
213 6 4 perm
271 278 279 272
214 6 4 perm
278 285 286 279
215 6 4 perm
285 245 246 286
216 6 4 perm
262 265 266 261
217 6 4 perm
265 272 273 266
218 6 4 perm
272 279 280 273
219 6 4 perm
279 286 287 280
220 6 4 perm
286 246 247 287
221 6 4 perm
261 266 267 260
222 6 4 perm
266 273 274 267
223 6 4 perm
273 280 281 274
224 6 4 perm
280 287 288 281
225 6 4 perm
287 247 248 288
226 6 4 perm
260 267 268 259
227 6 4 perm
267 274 275 268
228 6 4 perm
274 281 282 275
229 6 4 perm
281 288 289 282
230 6 4 perm
288 248 249 289
231 6 4 perm
259 268 269 258
232 6 4 perm
268 275 276 269
233 6 4 perm
275 282 283 276
234 6 4 perm
282 289 290 283
235 6 4 perm
289 249 250 290
236 6 4 perm
258 269 270 257
237 6 4 perm
269 276 277 270
238 6 4 perm
276 283 284 277
239 6 4 perm
283 290 291 284
240 6 4 perm
290 250 251 291
241 6 4 perm
257 270 256 252
242 6 4 perm
270 277 255 256
243 6 4 perm
277 284 254 255
244 6 4 perm
284 291 253 254
245 6 4 perm
291 251 244 253
246 6 4 air
564 508 507 563
247 6 4 air
563 507 549 562
248 6 4 air
562 549 551 565
249 6 4 air
565 551 552 566
250 6 4 air
566 552 553 567
251 6 4 air
567 553 510 554
252 6 4 air
509 455 508 550
253 6 4 air
570 518 519 560
254 6 4 air
559 517 518 570
255 6 4 air
558 516 517 559
256 6 4 air
557 515 516 558
257 6 4 air
556 514 515 557
258 6 4 air
555 513 514 556
259 6 4 air
554 512 513 555
260 6 4 air
510 511 512 554
261 6 4 air
473 411 509 520
262 6 4 air
569 493 492 536
263 6 4 air
537 494 493 569
264 6 4 air
538 495 494 537
265 6 4 air
539 496 495 538
266 6 4 air
540 497 496 539
267 6 4 air
541 498 497 540
268 6 4 air
542 499 498 541
269 6 4 air
543 500 499 542
270 6 4 air
544 501 500 543
271 6 4 air
545 502 501 544
272 6 4 air
546 503 502 545
273 6 4 air
560 547 503 546
274 6 4 air
519 504 547 560
275 6 4 air
548 453 473 506
276 6 4 air
524 480 479 523
277 6 4 air
525 481 480 524
278 6 4 air
526 482 481 525
279 6 4 air
527 483 482 526
280 6 4 air
528 484 483 527
281 6 4 air
529 485 484 528
282 6 4 air
530 486 485 529
283 6 4 air
531 487 486 530
284 6 4 air
532 488 487 531
285 6 4 air
533 489 488 532
286 6 4 air
534 490 489 533
287 6 4 air
536 535 490 534
288 6 4 air
492 491 535 536
289 6 4 air
521 505 548 561
290 6 4 air
521 475 474 505
291 6 4 air
522 476 475 521
292 6 4 air
523 477 476 522
293 6 4 air
479 478 477 523
294 6 4 air
508 455 454 507
295 6 4 air
507 454 456 549
296 6 4 air
549 456 457 551
297 6 4 air
551 457 458 552
298 6 4 air
552 458 459 553
299 6 4 air
553 459 460 510
300 6 4 air
510 460 461 511
301 6 4 air
411 389 455 509
302 6 4 air
519 471 472 504
303 6 4 air
518 470 471 519
304 6 4 air
517 469 470 518
305 6 4 air
516 468 469 517
306 6 4 air
515 467 468 516
307 6 4 air
514 466 467 515
308 6 4 air
513 465 466 514
309 6 4 air
512 464 465 513
310 6 4 air
511 463 464 512
311 6 4 air
461 462 463 511
312 6 4 air
453 388 411 473
313 6 4 air
492 436 435 491
314 6 4 air
493 437 436 492
315 6 4 air
494 438 437 493
316 6 4 air
495 439 438 494
317 6 4 air
496 440 439 495
318 6 4 air
497 441 440 496
319 6 4 air
498 442 441 497
320 6 4 air
499 443 442 498
321 6 4 air
500 444 443 499
322 6 4 air
501 445 444 500
323 6 4 air
502 446 445 501
324 6 4 air
503 447 446 502
325 6 4 air
547 448 447 503
326 6 4 air
504 449 448 547
327 6 4 air
472 450 449 504
328 6 4 air
505 452 453 548
329 6 4 air
474 451 452 505
330 6 4 air
474 413 412 451
331 6 4 air
475 414 413 474
332 6 4 air
476 415 414 475
333 6 4 air
477 416 415 476
334 6 4 air
478 417 416 477
335 6 4 air
478 419 418 417
336 6 4 air
479 420 419 478
337 6 4 air
480 421 420 479
338 6 4 air
481 422 421 480
339 6 4 air
482 423 422 481
340 6 4 air
483 424 423 482
341 6 4 air
484 425 424 483
342 6 4 air
485 426 425 484
343 6 4 air
486 427 426 485
344 6 4 air
487 428 427 486
345 6 4 air
488 429 428 487
346 6 4 air
489 430 429 488
347 6 4 air
490 431 430 489
348 6 4 air
535 432 431 490
349 6 4 air
491 433 432 535
350 6 4 air
435 434 433 491
351 6 4 air
455 389 390 454
352 6 4 air
454 390 391 456
353 6 4 air
456 391 392 457
354 6 4 air
457 392 393 458
355 6 4 air
458 393 394 459
356 6 4 air
459 394 395 460
357 6 4 air
460 395 396 461
358 6 4 air
461 396 397 462
359 6 4 air
388 244 389 411
360 6 4 air
472 409 410 450
361 6 4 air
471 408 409 472
362 6 4 air
470 407 408 471
363 6 4 air
469 406 407 470
364 6 4 air
468 405 406 469
365 6 4 air
467 404 405 468
366 6 4 air
466 403 404 467
367 6 4 air
465 402 403 466
368 6 4 air
464 401 402 465
369 6 4 air
463 400 401 464
370 6 4 air
462 399 400 463
371 6 4 air
397 398 399 462
372 6 4 air
452 387 388 453
373 6 4 air
451 386 387 452
374 6 4 air
412 385 386 451
375 6 4 air
412 341 568 385
376 6 4 air
413 342 341 412
377 6 4 air
414 343 342 413
378 6 4 air
415 344 343 414
379 6 4 air
416 345 344 415
380 6 4 air
417 346 345 416
381 6 4 air
418 347 346 417
382 6 4 air
418 349 348 347
383 6 4 air
419 350 349 418
384 6 4 air
420 351 350 419
385 6 4 air
421 352 351 420
386 6 4 air
422 353 352 421
387 6 4 air
423 354 353 422
388 6 4 air
424 355 354 423
389 6 4 air
425 356 355 424
390 6 4 air
426 357 356 425
391 6 4 air
427 358 357 426
392 6 4 air
428 359 358 427
393 6 4 air
429 360 359 428
394 6 4 air
430 361 360 429
395 6 4 air
431 362 361 430
396 6 4 air
432 363 362 431
397 6 4 air
433 364 363 432
398 6 4 air
434 365 364 433
399 6 4 air
434 367 366 365
400 6 4 air
435 368 367 434
401 6 4 air
436 369 368 435
402 6 4 air
437 370 369 436
403 6 4 air
438 371 370 437
404 6 4 air
439 372 371 438
405 6 4 air
440 373 372 439
406 6 4 air
441 374 373 440
407 6 4 air
442 375 374 441
408 6 4 air
443 376 375 442
409 6 4 air
444 377 376 443
410 6 4 air
445 378 377 444
411 6 4 air
446 379 378 445
412 6 4 air
447 380 379 446
413 6 4 air
448 381 380 447
414 6 4 air
449 382 381 448
415 6 4 air
450 383 382 449
416 6 4 air
410 384 383 450
417 6 4 air
389 244 251 390
418 6 4 air
390 251 250 391
419 6 4 air
391 250 249 392
420 6 4 air
392 249 248 393
421 6 4 air
393 248 247 394
422 6 4 air
394 247 246 395
423 6 4 air
395 246 245 396
424 6 4 air
396 245 238 397
425 6 4 air
397 238 233 398
426 6 4 air
387 253 244 388
427 6 4 air
386 254 253 387
428 6 4 air
385 255 254 386
429 6 4 air
568 256 255 385
430 6 4 air
568 340 252 256
431 6 4 air
341 339 340 568
432 6 4 air
342 338 339 341
433 6 4 air
343 337 338 342
434 6 4 air
344 336 337 343
435 6 4 air
345 335 336 344
436 6 4 air
346 334 335 345
437 6 4 air
347 333 334 346
438 6 4 air
348 332 333 347
439 6 4 air
348 331 312 332
440 6 4 air
349 330 331 348
441 6 4 air
350 329 330 349
442 6 4 air
351 328 329 350
443 6 4 air
352 327 328 351
444 6 4 air
353 326 327 352
445 6 4 air
354 325 326 353
446 6 4 air
355 324 325 354
447 6 4 air
356 323 324 355
448 6 4 air
357 322 323 356
449 6 4 air
358 321 322 357
450 6 4 air
359 320 321 358
451 6 4 air
360 319 320 359
452 6 4 air
361 318 319 360
453 6 4 air
362 317 318 361
454 6 4 air
363 316 317 362
455 6 4 air
364 315 316 363
456 6 4 air
365 314 315 364
457 6 4 air
366 313 314 365
458 6 4 air
366 311 292 313
459 6 4 air
367 310 311 366
460 6 4 air
368 309 310 367
461 6 4 air
369 308 309 368
462 6 4 air
370 307 308 369
463 6 4 air
371 306 307 370
464 6 4 air
372 305 306 371
465 6 4 air
373 304 305 372
466 6 4 air
374 303 304 373
467 6 4 air
375 302 303 374
468 6 4 air
376 301 302 375
469 6 4 air
377 300 301 376
470 6 4 air
378 299 300 377
471 6 4 air
379 298 299 378
472 6 4 air
380 297 298 379
473 6 4 air
381 296 297 380
474 6 4 air
382 295 296 381
475 6 4 air
383 294 295 382
476 6 4 air
384 293 294 383
477 6 4 air
384 33 22 293
478 6 4 air
410 34 33 384
479 6 4 air
409 35 34 410
480 6 4 air
408 36 35 409
481 6 4 air
407 37 36 408
482 6 4 air
406 38 37 407
483 6 4 air
405 39 38 406
484 6 4 air
404 40 39 405
485 6 4 air
403 41 40 404
486 6 4 air
402 42 41 403
487 6 4 air
401 43 42 402
488 6 4 air
400 44 43 401
489 6 4 air
399 45 44 400
490 6 4 air
398 46 45 399
491 6 4 air
233 47 46 398
492 6 4 air
233 237 48 47
493 6 4 air
237 236 49 48
494 6 4 air
236 235 50 49
495 6 4 air
235 234 51 50
496 6 4 air
234 232 32 51
497 6 4 air
522 521 561 646
498 6 4 air
524 523 522 646
499 6 4 air
561 548 506 638
500 6 4 air
569 536 534 641
501 6 4 air
641 534 533 623
502 6 4 air
623 533 532 624
503 6 4 air
624 532 531 625
504 6 4 air
625 531 530 626
505 6 4 air
626 530 529 627
506 6 4 air
627 529 528 642
507 6 4 air
642 528 527 643
508 6 4 air
643 527 526 644
509 6 4 air
644 526 525 645
510 6 4 air
645 525 524 646
511 6 4 air
645 646 561 638
512 6 4 air
506 473 520 647
513 6 4 air
570 560 546 639
514 6 4 air
639 546 545 615
515 6 4 air
615 545 544 616
516 6 4 air
616 544 543 617
517 6 4 air
617 543 542 618
518 6 4 air
618 542 541 619
519 6 4 air
619 541 540 620
520 6 4 air
620 540 539 621
521 6 4 air
621 539 538 622
522 6 4 air
622 538 537 640
523 6 4 air
640 537 569 641
524 6 4 air
520 509 550 648
525 6 4 air
567 554 555 634
526 6 4 air
634 555 556 633
527 6 4 air
633 556 557 632
528 6 4 air
632 557 558 631
529 6 4 air
631 558 559 630
530 6 4 air
630 559 570 639
531 6 4 air
550 508 564 636
532 6 4 air
609 566 567 634
533 6 4 air
614 565 566 609
534 6 4 air
613 562 565 614
535 6 4 air
590 563 562 613
536 6 4 air
612 564 563 590
537 6 4 air
644 645 638 637
538 6 4 air
637 638 506 647
539 6 4 air
640 641 623 600
540 6 4 air
600 623 624 601
541 6 4 air
601 624 625 602
542 6 4 air
602 625 626 603
543 6 4 air
603 626 627 604
544 6 4 air
604 627 642 628
545 6 4 air
628 642 643 629
546 6 4 air
629 643 644 637
547 6 4 air
647 520 648 635
548 6 4 air
629 637 647 635
549 6 4 air
630 639 615 605
550 6 4 air
605 615 616 593
551 6 4 air
593 616 617 594
552 6 4 air
594 617 618 595
553 6 4 air
595 618 619 596
554 6 4 air
596 619 620 597
555 6 4 air
597 620 621 598
556 6 4 air
598 621 622 599
557 6 4 air
599 622 640 600
558 6 4 air
648 550 636 611
559 6 4 air
609 634 633 608
560 6 4 air
608 633 632 607
561 6 4 air
607 632 631 606
562 6 4 air
606 631 630 605
563 6 4 air
636 564 612 589
564 6 4 air
592 614 609 608
565 6 4 air
591 613 614 592
566 6 4 air
576 590 613 591
567 6 4 air
649 612 590 576
568 6 4 air
628 629 635 610
569 6 4 air
610 635 648 611
570 6 4 air
599 600 601 583
571 6 4 air
583 601 602 584
572 6 4 air
584 602 603 585
573 6 4 air
585 603 604 586
574 6 4 air
586 604 628 610
575 6 4 air
606 605 593 587
576 6 4 air
587 593 594 578
577 6 4 air
578 594 595 579
578 6 4 air
579 595 596 580
579 6 4 air
580 596 597 581
580 6 4 air
581 597 598 582
581 6 4 air
582 598 599 583
582 6 4 air
611 636 589 588
583 6 4 air
586 610 611 588
584 6 4 air
592 608 607 650
585 6 4 air
650 607 606 587
586 6 4 air
589 612 649 575
587 6 4 air
577 591 592 650
588 6 4 air
577 650 587 578
589 6 4 air
571 576 591 577
590 6 4 air
571 577 578 579
591 6 4 air
651 649 576 571
592 6 4 air
651 571 579 580
593 6 4 air
582 583 584 573
594 6 4 air
573 584 585 574
595 6 4 air
574 585 586 588
596 6 4 air
574 588 589 575
597 6 4 air
575 649 651 572
598 6 4 air
573 574 575 572
599 6 4 air
581 582 573 572
600 6 4 air
572 651 580 581

[1D Elements]
#ElemNr  ElemType  NrOfNodes  Level
#Node1 Node2 ... NodeNrOfNodes

[Node BC]
#NodeNr Level
       1 fix_uxuy
       2 fix_uxuy
       3 fix_uxuy
       4 fix_uxuy
       5 fix_uxuy
       6 fix_uxuy
       7 fix_uxuy
       8 fix_uxuy
       9 fix_uxuy
      10 fix_uxuy
      11 fix_uxuy
      12 fix_uxuy
      13 fix_uxuy
      14 fix_uxuy
      15 fix_uxuy
      16 fix_uxuy
      17 fix_uxuy
      18 fix_uxuy
      19 fix_uxuy
      20 fix_uxuy
      21 fix_uxuy
      32 fix_ux
      52 fix_ux
      53 fix_ux
      54 fix_ux
      55 fix_ux
      56 fix_ux
      57 fix_ux
      58 fix_ux
      59 fix_ux
      60 fix_ux
       1 fix_az
       2 fix_az
       3 fix_az
       4 fix_az
       5 fix_az
       6 fix_az
       7 fix_az
       8 fix_az
       9 fix_az
      10 fix_az
      11 fix_az
      12 fix_az
      13 fix_az
      14 fix_az
      15 fix_az
      16 fix_az
      17 fix_az
      18 fix_az
      19 fix_az
      20 fix_az
      21 fix_az
      22 fix_az
      23 fix_az
      24 fix_az
      25 fix_az
      26 fix_az
      27 fix_az
      28 fix_az
      29 fix_az
      30 fix_az
      31 fix_az
      32 fix_az
      52 fix_az
      53 fix_az
      54 fix_az
      55 fix_az
      56 fix_az
      57 fix_az
      58 fix_az
      59 fix_az
      60 fix_az
     232 fix_az
     239 fix_az
     252 fix_az
     257 fix_az
     258 fix_az
     259 fix_az
     260 fix_az
     261 fix_az
     262 fix_az
     263 fix_az
     292 fix_az
     293 fix_az
     294 fix_az
     295 fix_az
     296 fix_az
     297 fix_az
     298 fix_az
     299 fix_az
     300 fix_az
     301 fix_az
     302 fix_az
     303 fix_az
     304 fix_az
     305 fix_az
     306 fix_az
     307 fix_az
     308 fix_az
     309 fix_az
     310 fix_az
     311 fix_az
     312 fix_az
     313 fix_az
     314 fix_az
     315 fix_az
     316 fix_az
     317 fix_az
     318 fix_az
     319 fix_az
     320 fix_az
     321 fix_az
     322 fix_az
     323 fix_az
     324 fix_az
     325 fix_az
     326 fix_az
     327 fix_az
     328 fix_az
     329 fix_az
     330 fix_az
     331 fix_az
     332 fix_az
     333 fix_az
     334 fix_az
     335 fix_az
     336 fix_az
     337 fix_az
     338 fix_az
     339 fix_az
     340 fix_az

[Save Nodes]
#NodeNr Level

[Save Elements]
#ElemNr Level

