
0                         0
2.999999999949375E-4      179.08343858517378
5.999999999949459E-4      357.62044870826145
8.999999999949543E-4      535.0662691915608
0.0011999999999949627     710.8794683536456
0.0014999999999949706     884.5235960500185
0.001799999999994979      1055.4688205169907
0.0020999999999949874     1223.1935450212134
0.0023999999999949955     1387.1859993820638
0.002699999999995004      1546.9458015107527
0.0029999999999950127     1701.9854842015034
0.003299999999995021      1851.8319825162312
0.003599999999995028      1996.0280772242604
0.003899999999995038      2134.133789892763
0.004199999999995046      2265.727725371282
0.004499999999995054      2390.4083575739996
0.0047999999999950626     2507.7952546364672
0.005099999999995069      2617.530239708547
0.005399999999995078      2719.278483841844
0.005699999999995085      2812.7295276366776
0.005999999999995094      2897.5982285316286
0.006299999999995104      2973.6256308449424
0.006599999999995111      3040.579755913207
0.006899999999995119      3098.2563099164263
0.007199999999995125      3146.479307229652
0.0074999999999951356     3185.1016073992823
0.0077999999999951415     3214.0053641054806
0.008099999999995153      3233.1023847407982
0.00839999999999516       3242.334399507941
0.008699999999995165      3241.6732392155373
0.008999999999995173      3231.1209212294075
0.00929999999999518       3210.709643317074
0.009599999999995194      3180.501685404275
0.009899999999995199      3140.5892195433044
0.010199999999995206      3091.0940286729924
0.010499999999995216      3032.1671350284396
0.010799999999995225      2963.9883393343116
0.011099999999995237      2886.7656721877074
0.011399999999995242      2800.7347593047552
0.01169999999999525       2706.15810256735
0.011999999999995258      2603.3242790642066
0.012299999999995268      2492.547060569838
0.012599999999995276      2374.164456148118
0.012899999999995285      2248.537680801972
0.013199999999995292      2116.050053315812
0.0134999999999953        1977.1058266538605
0.013799999999995309      1832.128954482971
0.014099999999995314      1681.5617975837504
0.014399999999995328      1525.8637740969002
0.014699999999995333      1365.5099577234075
0.014999999999995343      1200.989628155469
0.015299999999995354      1032.8047781613873
0.015599999999995364      861.4685818799667
0.015899999999995366      687.503828997673
0.01619999999999538       511.4413295860543
0.016499999999995393      333.8182944671298
0.016799999999995395      155.17669604858196
0.017099999999995407      -23.93838536995558
0.017399999999995416      -202.98042477345246
0.017699999999995417      -381.403120016446
0.017999999999995433      -558.6620587278525
0.01829999999999544       -734.2163794493753
0.018599999999995443      -907.5304219395625
0.01889999999999546       -1078.0753616073307
0.01919999999999546       -1245.3308230887121
0.01949999999999548       -1408.786468041955
0.019799999999995484      -1567.9435523184948
0.020099999999995486      -1722.316447756008
0.020399999999995495      -1871.4341239511307
0.02069999999999551       -2014.8415854923232
0.020999999999995522      -2152.1012602646197
0.021299999999995527      -2282.7943345907383
0.021599999999995536      -2406.522031137927
0.021899999999995545      -2522.9068256877904
0.022199999999995546      -2631.593599055789
0.022499999999995562      -2732.2507206502355
0.02279999999999557       -2824.571060360072
0.023099999999995572      -2908.2729256853845
0.023399999999995588      -2983.100921252175
0.02369999999999559       -3048.826728087689
0.023999999999995608      -3105.249800278873
0.024299999999995613      -3152.197976887899
0.024599999999995615      -3189.5280072586183
0.024899999999995624      -3217.125988110117
0.02519999999999564       -3234.9077110843787
0.02549999999999564       -3242.818919687226
0.025799999999995656      -3240.8354748380452
0.026099999999995665      -3228.963428524263
0.026399999999995677      -3207.2390053353547
0.026699999999995682      -3175.72849193246
0.026999999999995684      -3134.5280347912385
0.0272999999999957        -3083.7633468348245
0.0275999999999957        -3023.589323852079
0.02789999999999572       -2954.189571871931
0.02819999999999573       -2875.775846935399
0.028499999999995727      -2788.587408974889
0.02879999999999574       -2692.8902917714613
0.029099999999995737      -2588.9764912192545
0.029399999999995763      -2477.1630743732967
0.029699999999995765      -2357.7912119983343
0.02999999999999577       -2231.2251375713636
0.03029999999999579       -2097.8510359137267
0.03059999999999579       -1958.0758648445744
0.03089999999999581       -1812.3261134504514
0.031199999999995814      -1661.0465007602268
0.03149999999999581       -1504.6986187958926
0.031799999999995825      -1343.759524139455
0.03209999999999584       -1178.7202823138214
0.03239999999999585       -1010.0844694187952
0.032699999999995864      -838.3666355940712
0.03299999999999586       -664.0907349978742
0.033299999999995875      -487.7885270913692
0.03359999999999586       -309.99795410733884
0.03389999999999589       -131.26149965345874
0.0341999999999959        47.87546654105898
0.0344999999999959        226.86635268526382
0.034799999999995904      405.1650127151093
0.035099999999995926      582.2274127219398
0.035399999999995935      757.5132909363018
0.035699999999995936      930.4878062021454
0.03599999999999594       1100.6231699111718
0.036299999999995954      1267.400256418213
0.03659999999999597       1430.3101870237122
0.03689999999999598       1588.8558826902047
0.03719999999999599       1742.5535807550762
0.03749999999999599       1890.9343110117547
0.037799999999996         2033.5453266556267
0.03809999999999601       2169.951485728035
0.03839999999999602       2299.7365788420066
0.03869999999999603       2422.5045991430034
0.03899999999999604       2537.8809506247517
0.03929999999999604       2645.5135911156094
0.039599999999996055      2745.0741064476297
0.03989999999999606       2836.258712530056
0.040199999999996065      2918.789182270936
0.04049999999999606       2992.4136945180117
0.04079999999999608       3056.907602428138
0.04109999999999608       3112.074118920456
0.04139999999999611       3157.7449171234985
0.04169999999999611       3193.7806439828087
0.0419999999999961        3220.0713454621477
0.04229999999999613       3236.536802041026
0.04259999999999614       3243.1267734839603
0.04289999999999615       3239.821152135666
0.04319999999999616       3226.630024275302
0.04349999999999617       3203.593639340672
0.04379999999999617       3170.7822871173034
0.044099999999996184      3128.296083266585
0.044399999999996186      3076.2646638472015
0.0446999999999962        3014.8467897631535
0.04499999999999619       2944.229862344621
0.04529999999999621       2864.6293515399643
0.045599999999996206      2776.288138462817
0.045899999999996235      2679.475774300148
0.046199999999996244      2574.487657844309
0.04649999999999623       2461.6441341576115
0.04679999999999626       2341.289517119159
0.04709999999999627       2213.791038837068
0.04739999999999628       2079.537729130803
0.04769999999999629       1938.9392285035935
0.047999999999996296      1792.4245382266513
0.04829999999999628       1640.4407113488016
0.04859999999999631       1483.45148862595
0.048899999999996314      1321.935883531628
0.04919999999999632       1156.3867206665918
0.04949999999999634       987.309132027538
0.04979999999999634       815.2190157227828
0.050099999999996335      640.6414618376804
0.050399999999996364      464.1091502532083
0.050699999999996366      286.1607253061099
0.05099999999999638       107.33915225004363
0.05129999999999638       -71.809939467592
0.0515999999999964        -250.73992105787835
0.05189999999999641       -428.904832291792
0.052199999999996416      -605.7610473617885
0.052499999999996404      -780.7689336203878
0.052799999999996426      -953.3944981346398
0.05309999999999644       -1123.1110170324573
0.05339999999999644       -1289.4006426692365
0.05369999999999645       -1451.7559837107026
0.053999999999996474      -1609.681653311207
0.05429999999999647       -1762.6957806631094
0.054599999999996464      -1910.3314813054521
0.05489999999999649       -2052.138281705425
0.055199999999996495      -2187.6834937660938
0.05549999999999652       -2316.5535350662217
0.05579999999999651       -2438.355190803944
0.05609999999999653       -2552.71681359375
0.05639999999999652       -2659.2894574558986
0.056699999999996545      -2757.747942538631
0.05699999999999654       -2847.791847321934
0.05729999999999655       -2929.1464252788346
0.05759999999999655       -3001.5634431973
0.057899999999996565      -3064.8219386017754
0.05819999999999659       -3118.7288939647383
0.0584999999999966        -3163.119825651685
0.05879999999999659       -3197.8592858019115
0.05909999999999659       -3222.841275613867
0.05939999999999661       -3237.989568773975
0.05969999999999662       -3243.2579440423624
0.05999999999999662       -3238.6303262854044
0.060299999999996655      -3224.1208355249305
0.06059999999999666       -3199.7737438545987
0.06089999999999665       -3165.6633403546884
0.061199999999996674      -3121.8937044172026
0.06149999999999667       -3068.5983881737566
0.06179999999999668       -3005.940008994601
0.0620999999999967        -2934.1097533021893
0.062399999999996694      -2853.3267932135127
0.06269999999999668       -2763.8376177910477
0.06299999999999673       -2665.915280942561
0.06329999999999672       -2559.8585682653943
0.06359999999999671       -2445.9910853770334
0.06389999999999675       -2324.66027051263
0.06419999999999676       -2196.2363344041946
0.06449999999999675       -2061.111130675024
0.06479999999999676       -1919.696960195577
0.06509999999999679       -1772.4253130503607
0.06539999999999678       -1619.7455519538084
0.06569999999999679       -1462.1235411319165
0.06599999999999681       -1300.0402248531034
0.0662999999999968        -1133.9901599472591
0.06659999999999681       -964.4800067888297
0.06689999999999682       -792.0269833486441
0.0671999999999968        -617.1572870326959
0.06749999999999687       -440.40448912173287
0.06779999999999685       -262.30790671166005
0.06809999999999684       -83.41095712160497
0.06839999999999687       95.74050020834908
0.06869999999999689       274.59982927118074
0.0689999999999969        452.6212854164275
0.06929999999999689       629.261680553952
0.06959999999999691       803.9820405570489
0.06989999999999692       976.2492498073648
0.07019999999999692       1145.537677864652
0.07049999999999694       1311.3307832966943
0.07079999999999693       1473.1226897769006
0.07109999999999694       1630.4197296396917
0.07139999999999697       1782.7419501843349
0.07169999999999696       1929.6245781310774
0.07199999999999697       2070.6194377608863
0.07229999999999698       2205.2963184112778
0.07259999999999699       2333.244287157859
0.072899999999997         2454.072942673352
0.07319999999999702       2567.413606439671
0.07349999999999698       2672.9204476787163
0.07379999999999702       2770.2715385691513
0.07409999999999704       2859.169836528251
0.07439999999999702       2939.3440905635175
0.07469999999999705       3010.549668927325
0.07499999999999703       3072.5693055496245
0.0752999999999971        3125.2137629721456
0.07559999999999707       3168.3224097585266
0.0758999999999971        3201.7637106204174
0.0761999999999971        3225.435627765081
0.07649999999999714       3239.265932239521
0.07679999999999713       3243.2124243173967
0.07709999999999716       3237.263062262145
0.07739999999999715       3221.435999068296
0.07769999999999715       3195.7795270735996
0.07799999999999717       3160.3719306063763
0.0782999999999972        3115.3212471191264
0.07859999999999719       3060.7649375407727
0.07889999999999721       2996.869466848518
0.07919999999999726       2923.8297961409066
0.07949999999999727       2841.86878776323
0.07979999999999729       2751.2365252986706
0.08009999999999726       2652.2095505000325
0.0803999999999973        2545.090019492197
0.0806999999999973        2430.2047808182206
0.08099999999999731       2307.9043781408573
0.0812999999999973        2178.5619806475934
0.08159999999999734       2042.5722444174014
0.08189999999999734       1900.3501082261448
0.08219999999999737       1752.329527464415
0.08249999999999737       1598.9621500308301
0.0827999999999974        1440.7159382409095
0.08309999999999743       1278.0737409570554
0.08339999999999743       1111.5318202954188
0.08369999999999743       941.598337405534
0.08399999999999744       768.7918019434452
0.08429999999999745       593.6394899689918
0.08459999999999746       416.6758350942668
0.08489999999999749       238.44079779222582
0.08519999999999749       59.478217842608124
0.08549999999999751       -119.66584505966992
0.08579999999999749       -298.44477746987894
0.08609999999999753       -476.31308004799166
0.08639999999999755       -652.7280320136693
0.08669999999999756       -827.1513471238245
0.08699999999999757       -999.0508161188111
0.08729999999999759       -1167.9019306258629
0.08759999999999755       -1333.1894835660773
0.08789999999999763       -1494.409141180318
0.08819999999999761       -1651.0689818776136
0.08849999999999762       -1802.6909972118392
0.08879999999999764       -1948.8125504048128
0.08909999999999767       -2088.98778796718
0.08939999999999769       -2222.7890001090186
0.08969999999999766       -2349.807925790076
0.08999999999999768       -2469.6569984264784
0.09029999999999773       -2581.9705284531656
0.09059999999999771       -2686.4058191345543
0.09089999999999773       -2782.6442122183184
0.09119999999999774       -2870.392060241615
0.09149999999999776       -2949.3816225232044
0.09179999999999779       -3019.371882106989
0.09209999999999775       -3080.1492811653347
0.0923999999999978        -3131.528372617658
0.09269999999999781       -3173.3523859757047
0.09299999999999782       -3205.493705690448
0.09329999999999782       -3227.8542605380812
0.09359999999999785       -3240.365822860441
0.09389999999999789       -3242.990216744751
0.09419999999999787       -3235.7194345076887
0.09449999999999786       -3218.575661128571
0.0947999999999979        -3191.611206557237
0.0950999999999979        -3154.908346103683
0.09539999999999793       -3108.579069396188
0.09569999999999795       -3052.764738671812
0.09599999999999793       -2987.6356574456127
0.09629999999999797       -2913.390550871209
0.09659999999999794       -2830.255959381171
0.096899999999998         -2738.485547455345
0.097199999999998         -2638.3593296257127
0.09749999999999799       -2530.182816083094
0.097799999999998         -2414.2860804879792
0.09809999999999802       -2291.022752834609
0.09839999999999807       -2160.768940436473
0.09869999999999807       -2023.9220803275202
0.09899999999999805       -1880.8997265830392
0.09929999999999808       -1732.138276257891
0.0995999999999981        -1578.0916378298334
0.09989999999999812       -1419.2298462098506
0.10019999999999812       -1256.0376285484822
0.10049999999999812       -1089.012925211723
0.10079999999999815       -918.6653704400288
0.10109999999999819       -745.5147373265113
0.10139999999999819       -570.0893518589784
0.10169999999999815       -392.9244808650146
0.10199999999999822       -214.56069877848225
0.10229999999999823       -35.54223821160747
0.10259999999999822       143.58467063538708
0.10289999999999824       322.2734666593995
0.10319999999999824       499.9789255494033
0.10349999999999827       676.1588234030813
0.10379999999999827       850.2755911871328
0.10409999999999828       1021.7979549945575
0.10439999999999831       1190.2025570957992
0.10469999999999834       1354.9755528338949
0.10499999999999836       1515.6141784936667
0.10529999999999835       1671.6282853594118
0.10559999999999835       1822.541835282066
0.10589999999999837       1967.8943531903342
0.10619999999999838       2107.2423321157753
0.10649999999999837       2240.1605864441945
0.10679999999999842       2366.2435492630325
0.10709999999999843       2485.1065098481154
0.10739999999999844       2596.386787512659
0.10769999999999842       2699.7448382367256
0.10799999999999844       2794.865290701639
0.10829999999999847       2881.4579085656096
0.10859999999999849       2959.2584760493514
0.1088999999999985        3028.0296041249353
0.10919999999999853       3087.561454848332
0.10949999999999852       3137.672381627799
0.10979999999999852       3178.2094834737723
0.11009999999999853       3209.0490715380433
0.11039999999999858       3230.0970465204064
0.11069999999999858       3241.2891857883837
0.1109999999999986        3242.5913393379496
0.1112999999999986        3233.9995339945444
0.11159999999999858       3215.539985537158
0.11189999999999861       3187.2690187033827
0.11219999999999862       3149.2728953334786
0.11249999999999864       3101.6675511641442
0.11279999999999867       3044.598242082302
0.11309999999999866       2978.239100910117
0.11339999999999864       2902.792606085168
0.11369999999999872       2818.4889638486625
0.11399999999999873       2725.585405830797
0.11429999999999875       2624.3654041755226
0.11459999999999873       2515.1378065981457
0.11489999999999873       2398.235894014719
0.11519999999999873       2274.0163636211914
0.11549999999999878       2142.858240526268
0.11579999999999879       2005.1617212521421
0.11609999999999875       1861.3469526421363
0.11639999999999881       1711.852749890912
0.1166999999999988        1557.1352576179706
0.11699999999999881       1397.6665580627384
0.11729999999999882       1233.933230651385
0.11759999999999883       1066.4348673306986
0.11789999999999884       895.6825482014333
0.11819999999999883       722.1972820974019
0.11849999999999883       546.5084168731275
0.11879999999999885       369.152024249335
0.11909999999999885       190.66926414535538
0.11939999999999888       11.604733488980019
0.1196999999999989        -167.49519545575362
0.11999999999999891       -346.0840421733826
0.12029999999999892       -523.6168853071289
0.1205999999999989        -699.5520253052432
0.12089999999999892       -873.3526372291709
0.12119999999999895       -1044.4884086805118
0.12149999999999896       -1212.4371578449404
0.12179999999999899       -1376.686426717942
0.12209999999999899       -1536.7350446471864
0.12239999999999902       -1692.0946574186385
0.12269999999999903       -1842.2912172191348
0.12299999999999899       -1986.8664289257604
0.12329999999999901       -2125.379148305979
0.12359999999999906       -2257.406727858818
0.12389999999999905       -2382.5463061858327
0.12419999999999906       -2500.4160369521237
0.12449999999999907       -2610.656253683179
0.12479999999999908       -2712.9305668361008
0.12509999999999913       -2806.9268897875145
0.1253999999999991        -2892.3583906044964
0.12569999999999912       -2968.9643666771867
0.12599999999999914       -3036.5110395371385
0.12629999999999914       -3094.7922674205392
0.12659999999999913       -3143.630173386382
0.12689999999999915       -3182.8756870552834
0.12719999999999915       -3212.408998292644
0.12749999999999917       -3232.1399214311664
0.12779999999999922       -3242.0081688898645
0.12809999999999921       -3241.983533325538
0.1283999999999992        -3232.06597771841
0.1286999999999992        -3212.2856330802933
0.12899999999999925       -3182.702703740106
0.12929999999999922       -3143.4072804389975
0.12959999999999927       -3094.5190617411045
0.1298999999999993        -3036.18698453641
0.13019999999999932       -2968.588764677007
0.13049999999999928       -2891.9303490511666
0.1307999999999993        -2806.44528065583
0.1310999999999993        -2712.3939784732297
0.13139999999999932       -2610.062934210292
0.13169999999999935       -2499.7638281775307
0.13199999999999937       -2381.832566820648
0.13229999999999936       -2256.6282446224272
0.13259999999999936       -2124.5320332954097
0.13289999999999932       -1985.9460013777857
0.13319999999999937       -1841.2918675145709
0.13349999999999937       -1691.0096908685389
0.1337999999999994        -1535.5565022513579
0.1340999999999994        -1375.4048796911977
0.1343999999999994        -1211.0414722663736
0.13469999999999946       -1042.9654761276931
0.13499999999999945       -871.6870667073105
0.1352999999999995        -697.7257911686878
0.13559999999999947       -521.6089251909021
0.1358999999999995        -343.8697981966448
0.13619999999999952       -165.0460911385345
0.13649999999999954       14.321889062667116
0.13679999999999953       193.69295436418884
0.13709999999999956       372.52679571509145
0.13739999999999952       550.2857544765424
0.13769999999999954       726.4366012481195
0.1379999999999996        900.4523182583912
0.1382999999999996        1071.8138815284142
0.1385999999999996        1240.0120390414831
0.1388999999999996        1404.549081142168
0.1391999999999996        1564.9405993154276
0.13949999999999962       1720.717229343434
0.13979999999999965       1871.426374561132
0.14009999999999967       2016.6339044911106
0.1403999999999997        2155.9258234778663
0.1406999999999997        2288.909902985221
0.14099999999999963       2415.2172698788536
0.14129999999999973       2534.5039411735443
0.14159999999999975       2646.452293240519
0.1418999999999997        2750.772450164204
0.14219999999999974       2847.2035716085556
0.14249999999999974       2935.5150149561537
0.14279999999999976       3015.5073393393072
0.14309999999999978       3087.0131102114005
0.1433999999999998        3149.897452024982
0.1436999999999998        3204.05828319479
0.14399999999999985       3249.426151776399
0.14429999999999985       3285.9635724495297
0.14459999999999978       3313.66374622925
0.14489999999999983       3332.5485254299533
0.14519999999999983       3342.665470559315
0.14549999999999985       3344.0838373852857
0.1457999999999999        3336.889337761445
0.1460999999999999        3321.1775453081327
0.14639999999999992       3297.0458765903936
0.14669999999999989       3264.584179627365
0.14699999999999996       3223.8641101360354
0.14729999999999993       3174.9276679756604
0.14759999999999995       3117.775480646755
0.14789999999999995       3052.35561151625
0.14819999999999997       2978.5537650675865
0.1485                    2896.185666741988
0.14880000000000002       2804.9920342481796
0.14909999999999998       2704.6358731728237
0.1494                    2594.700990320113
0.14970000000000006       2474.68946044986
0.15                      2344.0157781684816
