[Info]
Version 1
Dimension 2
NumNodes 81
Num3DElements 0
Num2DElements 64
Num1DElements 0
NumNodeBC 40
NumSaveNodes 0
NumSaveElements 0
Num 2d-line      : 0
Num 2d-line,quad : 0
Num 3d-line      : 0
Num 3d-line,quad : 0
Num triangle     : 0
Num triangle,quad: 0
Num quadr        : 64
Num quadr,quad   : 0
Num tetra        : 0
Num tetra,quad   : 0
Num brick        : 0
Num brick,quad   : 0
Num pyramid      : 0
Num pyramid,quad : 0
Num wedge        : 0
Num wedge,quad   : 0

[Nodes]
#NodeNr x-coord y-coord z-coord
1  0.0  0.0  0.0
2  0.125  0.0  0.0
3  0.25  0.0  0.0
4  0.375  0.0  0.0
5  0.5  0.0  0.0
6  0.625  0.0  0.0
7  0.75  0.0  0.0
8  0.875  0.0  0.0
9  1.0  0.0  0.0
10  0.0  0.125  0.0
11  0.125  0.125  0.0
12  0.25  0.125  0.0
13  0.375  0.125  0.0
14  0.5  0.125  0.0
15  0.625  0.125  0.0
16  0.75  0.125  0.0
17  0.875  0.125  0.0
18  1.0  0.125  0.0
19  0.0  0.25  0.0
20  0.125  0.25  0.0
21  0.25  0.25  0.0
22  0.375  0.25  0.0
23  0.5  0.25  0.0
24  0.625  0.25  0.0
25  0.75  0.25  0.0
26  0.875  0.25  0.0
27  1.0  0.25  0.0
28  0.0  0.375  0.0
29  0.125  0.375  0.0
30  0.25  0.375  0.0
31  0.375  0.375  0.0
32  0.5  0.375  0.0
33  0.625  0.375  0.0
34  0.75  0.375  0.0
35  0.875  0.375  0.0
36  1.0  0.375  0.0
37  0.0  0.5  0.0
38  0.125  0.5  0.0
39  0.25  0.5  0.0
40  0.375  0.5  0.0
41  0.5  0.5  0.0
42  0.625  0.5  0.0
43  0.75  0.5  0.0
44  0.875  0.5  0.0
45  1.0  0.5  0.0
46  0.0  0.625  0.0
47  0.125  0.625  0.0
48  0.25  0.625  0.0
49  0.375  0.625  0.0
50  0.5  0.625  0.0
51  0.625  0.625  0.0
52  0.75  0.625  0.0
53  0.875  0.625  0.0
54  1.0  0.625  0.0
55  0.0  0.75  0.0
56  0.125  0.75  0.0
57  0.25  0.75  0.0
58  0.375  0.75  0.0
59  0.5  0.75  0.0
60  0.625  0.75  0.0
61  0.75  0.75  0.0
62  0.875  0.75  0.0
63  1.0  0.75  0.0
64  0.0  0.875  0.0
65  0.125  0.875  0.0
66  0.25  0.875  0.0
67  0.375  0.875  0.0
68  0.5  0.875  0.0
69  0.625  0.875  0.0
70  0.75  0.875  0.0
71  0.875  0.875  0.0
72  1.0  0.875  0.0
73  0.0  1.0  0.0
74  0.125  1.0  0.0
75  0.25  1.0  0.0
76  0.375  1.0  0.0
77  0.5  1.0  0.0
78  0.625  1.0  0.0
79  0.75  1.0  0.0
80  0.875  1.0  0.0
81  1.0  1.0  0.0

[1D Elements]
#ElemNr  ElemType  NrOfNodes  Level
#Node1 Node2 ... NodeNrOfNodes

[2D Elements]
#ElemNr  ElemType  NrOfNodes  Level
#Node1 Node2 ... NodeNrOfNodes
1 6 4 mech
1 2 11 10
2 6 4 mech
2 3 12 11
3 6 4 mech
3 4 13 12
4 6 4 mech
4 5 14 13
5 6 4 mech
5 6 15 14
6 6 4 mech
6 7 16 15
7 6 4 mech
7 8 17 16
8 6 4 mech
8 9 18 17
9 6 4 mech
10 11 20 19
10 6 4 mech
11 12 21 20
11 6 4 mech
12 13 22 21
12 6 4 mech
13 14 23 22
13 6 4 mech
14 15 24 23
14 6 4 mech
15 16 25 24
15 6 4 mech
16 17 26 25
16 6 4 mech
17 18 27 26
17 6 4 mech
19 20 29 28
18 6 4 mech
20 21 30 29
19 6 4 mech
21 22 31 30
20 6 4 mech
22 23 32 31
21 6 4 mech
23 24 33 32
22 6 4 mech
24 25 34 33
23 6 4 mech
25 26 35 34
24 6 4 mech
26 27 36 35
25 6 4 mech
28 29 38 37
26 6 4 mech
29 30 39 38
27 6 4 mech
30 31 40 39
28 6 4 mech
31 32 41 40
29 6 4 mech
32 33 42 41
30 6 4 mech
33 34 43 42
31 6 4 mech
34 35 44 43
32 6 4 mech
35 36 45 44
33 6 4 mech
37 38 47 46
34 6 4 mech
38 39 48 47
35 6 4 mech
39 40 49 48
36 6 4 mech
40 41 50 49
37 6 4 mech
41 42 51 50
38 6 4 mech
42 43 52 51
39 6 4 mech
43 44 53 52
40 6 4 mech
44 45 54 53
41 6 4 mech
46 47 56 55
42 6 4 mech
47 48 57 56
43 6 4 mech
48 49 58 57
44 6 4 mech
49 50 59 58
45 6 4 mech
50 51 60 59
46 6 4 mech
51 52 61 60
47 6 4 mech
52 53 62 61
48 6 4 mech
53 54 63 62
49 6 4 mech
55 56 65 64
50 6 4 mech
56 57 66 65
51 6 4 mech
57 58 67 66
52 6 4 mech
58 59 68 67
53 6 4 mech
59 60 69 68
54 6 4 mech
60 61 70 69
55 6 4 mech
61 62 71 70
56 6 4 mech
62 63 72 71
57 6 4 mech
64 65 74 73
58 6 4 mech
65 66 75 74
59 6 4 mech
66 67 76 75
60 6 4 mech
67 68 77 76
61 6 4 mech
68 69 78 77
62 6 4 mech
69 70 79 78
63 6 4 mech
70 71 80 79
64 6 4 mech
71 72 81 80

[3D Elements]
#ElemNr  ElemType  NrOfNodes  Level
#Node1 Node2 ... NodeNrOfNodes

[Node BC]
#NodeNr Level
1 south
2 south
3 south
4 south
5 south
6 south
7 south
8 south
9 south
73 north
74 north
75 north
76 north
77 north
78 north
79 north
80 north
81 north
1 west
10 west
19 west
28 west
37 west
46 west
55 west
64 west
73 west
9 east
18 east
27 east
36 east
45 east
54 east
63 east
72 east
81 east
1 south_west
9 south_east
73 north_west
81 north_east

[Save Nodes]
#NodeNr Level

[Save Elements]
#ElemNr Level

 
