^C:\USERS\JULIA\DOWNLOADS\FLUX GAMES\BUILDS\UWP\BUILD\OBJ\FIND JOG\WIN32\RELEASE\APP.OBJ|C:\USERS\JULIA\DOWNLOADS\FLUX GAMES\BUILDS\UWP\BUILD\OBJ\FIND JOG\WIN32\RELEASE\MAIN.OBJ|C:\USERS\JULIA\DOWNLOADS\FLUX GAMES\BUILDS\UWP\BUILD\OBJ\FIND JOG\WIN32\RELEASE\PCH.OBJ|C:\USERS\JULIA\DOWNLOADS\FLUX GAMES\BUILDS\UWP\BUILD\OBJ\FIND JOG\WIN32\RELEASE\UNITYGENERATED.OBJ|C:\USERS\JULIA\DOWNLOADS\FLUX GAMES\BUILDS\UWP\FIND JOG\RESOURCE.RES
/OUT:"C:\USERS\JULIA\DOWNLOADS\FLUX GAMES\BUILDS\UWP\BUILD\BIN\WIN32\RELEASE\FIND JOG.EXE" /NOLOGO WINDOWSAPP.LIB "C:\USERS\JULIA\DOWNLOADS\FLUX GAMES\BUILDS\UWP\BUILD\BIN\WIN32\RELEASE\GAMEASSEMBLY.LIB" WINDOWSAPP.LIB /MANIFEST:NO /DEBUG:FULL /PDB:"C:\USERS\JULIA\DOWNLOADS\FLUX GAMES\BUILDS\UWP\BUILD\BIN\WIN32\RELEASE\FIND JOG.PDB" /SUBSYSTEM:WINDOWS /OPT:REF /OPT:ICF /LTCG:incremental /LTCGOUT:"C:\USERS\JULIA\DOWNLOADS\FLUX GAMES\BUILDS\UWP\BUILD\OBJ\FIND JOG\WIN32\RELEASE\FIND JOG.IOBJ" /TLBID:1 /APPCONTAINER /WINMD /WINMDFILE:"C:\USERS\JULIA\DOWNLOADS\FLUX GAMES\BUILDS\UWP\BUILD\BIN\WIN32\RELEASE\FIND_JOG.WINMD" /DYNAMICBASE /NXCOMPAT /MACHINE:X86 /SAFESEH "C:\USERS\JULIA\DOWNLOADS\FLUX GAMES\BUILDS\UWP\BUILD\OBJ\FIND JOG\WIN32\RELEASE\APP.OBJ"
"C:\USERS\JULIA\DOWNLOADS\FLUX GAMES\BUILDS\UWP\BUILD\OBJ\FIND JOG\WIN32\RELEASE\MAIN.OBJ"
"C:\USERS\JULIA\DOWNLOADS\FLUX GAMES\BUILDS\UWP\BUILD\OBJ\FIND JOG\WIN32\RELEASE\PCH.OBJ"
"C:\USERS\JULIA\DOWNLOADS\FLUX GAMES\BUILDS\UWP\BUILD\OBJ\FIND JOG\WIN32\RELEASE\UNITYGENERATED.OBJ"
"C:\USERS\JULIA\DOWNLOADS\FLUX GAMES\BUILDS\UWP\FIND JOG\RESOURCE.RES"
