^C:\Users\julia\Downloads\Flux Games\Builds\UWP\Find Jog\Find Jog.vcxproj
C:\Program Files\Unity\Hub\Editor\2018.4.11f1\Editor\Data\PlaybackEngines\MetroSupport\Players\UAP\il2cpp\x86\Release\UnityPlayer.winmd
C:\Program Files\Unity\Hub\Editor\2018.4.11f1\Editor\Data\PlaybackEngines\MetroSupport\Players\UAP\il2cpp\x86\Release\UnityPlayer.dll
C:\Program Files\Unity\Hub\Editor\2018.4.11f1\Editor\Data\PlaybackEngines\MetroSupport\Players\UAP\il2cpp\x86\Release\UnityPlayer_UAP_x86_Release_il2cpp.pdb
