^C:\Users\julia\Downloads\Flux Games\Builds\UWP\Find Jog\Find Jog.vcxproj
C:\Users\julia\Downloads\Flux Games\Builds\UWP\build\bin\Win32\Release\Find_Jog.winmd
^C:\Users\julia\Downloads\Flux Games\Builds\UWP\Find Jog\Find Jog.vcxproj
C:\Users\julia\Downloads\Flux Games\Builds\UWP\build\obj\Find Jog\Win32\Release\Find Jog.vcxprojAssemblyReference.cache
C:\Users\julia\Downloads\Flux Games\Builds\UWP\build\obj\Find Jog\Win32\Release\Find Jog.vcxproj.CopyComplete
C:\Users\julia\Downloads\Flux Games\Builds\UWP\build\obj\Find Jog\Win32\Release\ResourceHandlingTask.state
C:\Users\julia\Downloads\Flux Games\Builds\UWP\build\obj\Find Jog\Win32\Release\Find Jog.vcxproj.GenerateResource.Cache
C:\Users\julia\Downloads\Flux Games\Builds\UWP\build\obj\Find Jog\Win32\Release\priconfig.xml
C:\Users\julia\Downloads\Flux Games\Builds\UWP\build\obj\Find Jog\Win32\Release\priconfig.xml.intermediate
C:\Users\julia\Downloads\Flux Games\Builds\UWP\build\obj\Find Jog\Win32\Release\unfiltered.layout.resfiles
C:\Users\julia\Downloads\Flux Games\Builds\UWP\build\obj\Find Jog\Win32\Release\unfiltered.layout.resfiles.intermediate
C:\Users\julia\Downloads\Flux Games\Builds\UWP\build\obj\Find Jog\Win32\Release\filtered.layout.resfiles
C:\Users\julia\Downloads\Flux Games\Builds\UWP\build\obj\Find Jog\Win32\Release\filtered.layout.resfiles.intermediate
C:\Users\julia\Downloads\Flux Games\Builds\UWP\build\obj\Find Jog\Win32\Release\excluded.layout.resfiles
C:\Users\julia\Downloads\Flux Games\Builds\UWP\build\obj\Find Jog\Win32\Release\excluded.layout.resfiles.intermediate
C:\Users\julia\Downloads\Flux Games\Builds\UWP\build\obj\Find Jog\Win32\Release\resources.resfiles
C:\Users\julia\Downloads\Flux Games\Builds\UWP\build\obj\Find Jog\Win32\Release\resources.resfiles.intermediate
C:\Users\julia\Downloads\Flux Games\Builds\UWP\build\obj\Find Jog\Win32\Release\pri.resfiles
C:\Users\julia\Downloads\Flux Games\Builds\UWP\build\obj\Find Jog\Win32\Release\pri.resfiles.intermediate
C:\Users\julia\Downloads\Flux Games\Builds\UWP\build\bin\Win32\Release\resources.pri
C:\Users\julia\Downloads\Flux Games\Builds\UWP\build\obj\Find Jog\Win32\Release\qualifiers.txt
C:\Users\julia\Downloads\Flux Games\Builds\UWP\build\obj\Find Jog\Win32\Release\qualifiers.txt.intermediate
C:\Users\julia\Downloads\Flux Games\Builds\UWP\build\obj\Find Jog\Win32\Release\MultipleQualifiersPerDimensionFound.txt
C:\Users\julia\Downloads\Flux Games\Builds\UWP\build\obj\Find Jog\Win32\Release\ProjectArchitectures.txt
C:\Users\julia\Downloads\Flux Games\Builds\UWP\build\obj\Find Jog\Win32\Release\.winmd_cache\$UnityPlayer.winmd_637503403320000000.json
C:\Users\julia\Downloads\Flux Games\Builds\UWP\build\bin\Win32\Release\AppxManifest.xml
C:\Users\julia\Downloads\Flux Games\Builds\UWP\build\bin\Win32\Release\Find Jog.build.appxrecipe
C:\Users\julia\Downloads\Flux Games\Builds\UWP\build\obj\Find Jog\Win32\Release\package.map.txt
C:\Users\julia\Downloads\Flux Games\Builds\UWP\AppPackages\Find Jog\Find Jog_1.0.0.0_Win32_Test\Find Jog_1.0.0.0_Win32.appx
C:\Users\julia\Downloads\Flux Games\Builds\UWP\build\obj\Find Jog\Win32\Release\_pkginfo.txt
C:\Users\julia\Downloads\Flux Games\Builds\UWP\build\obj\Find Jog\Win32\Release\Symbols\Find Jog.pdb
C:\Users\julia\Downloads\Flux Games\Builds\UWP\build\obj\Find Jog\Win32\Release\Symbols\UnityPlayer_UAP_x86_Release_il2cpp.pdb
C:\Users\julia\Downloads\Flux Games\Builds\UWP\build\obj\Find Jog\Win32\Release\Symbols\GameAssembly.pdb
C:\Users\julia\Downloads\Flux Games\Builds\UWP\build\obj\Find Jog\Win32\Release\Symbols\baselib_UAP_x86_Release_il2cpp.pdb
C:\Users\julia\Downloads\Flux Games\Builds\UWP\build\obj\Find Jog\Win32\Release\_installerinfo.log
^C:\Users\julia\Downloads\Flux Games\Builds\UWP\Find Jog\Find Jog.vcxproj
C:\Users\julia\Downloads\Flux Games\Builds\UWP\build\bin\Win32\Release\Find_Jog.winmd
^C:\Users\julia\Downloads\Flux Games\Builds\UWP\Find Jog\Find Jog.vcxproj
C:\Users\julia\Downloads\Flux Games\Builds\UWP\build\obj\Find Jog\Win32\Release\Find Jog.vcxprojAssemblyReference.cache
C:\Users\julia\Downloads\Flux Games\Builds\UWP\build\obj\Find Jog\Win32\Release\Find Jog.vcxproj.CopyComplete
C:\Users\julia\Downloads\Flux Games\Builds\UWP\build\obj\Find Jog\Win32\Release\ResourceHandlingTask.state
C:\Users\julia\Downloads\Flux Games\Builds\UWP\build\obj\Find Jog\Win32\Release\Find Jog.vcxproj.GenerateResource.Cache
C:\Users\julia\Downloads\Flux Games\Builds\UWP\build\obj\Find Jog\Win32\Release\priconfig.xml
C:\Users\julia\Downloads\Flux Games\Builds\UWP\build\obj\Find Jog\Win32\Release\priconfig.xml.intermediate
C:\Users\julia\Downloads\Flux Games\Builds\UWP\build\obj\Find Jog\Win32\Release\unfiltered.layout.resfiles
C:\Users\julia\Downloads\Flux Games\Builds\UWP\build\obj\Find Jog\Win32\Release\unfiltered.layout.resfiles.intermediate
C:\Users\julia\Downloads\Flux Games\Builds\UWP\build\obj\Find Jog\Win32\Release\filtered.layout.resfiles
C:\Users\julia\Downloads\Flux Games\Builds\UWP\build\obj\Find Jog\Win32\Release\filtered.layout.resfiles.intermediate
C:\Users\julia\Downloads\Flux Games\Builds\UWP\build\obj\Find Jog\Win32\Release\excluded.layout.resfiles
C:\Users\julia\Downloads\Flux Games\Builds\UWP\build\obj\Find Jog\Win32\Release\excluded.layout.resfiles.intermediate
C:\Users\julia\Downloads\Flux Games\Builds\UWP\build\obj\Find Jog\Win32\Release\resources.resfiles
C:\Users\julia\Downloads\Flux Games\Builds\UWP\build\obj\Find Jog\Win32\Release\resources.resfiles.intermediate
C:\Users\julia\Downloads\Flux Games\Builds\UWP\build\obj\Find Jog\Win32\Release\pri.resfiles
C:\Users\julia\Downloads\Flux Games\Builds\UWP\build\obj\Find Jog\Win32\Release\pri.resfiles.intermediate
C:\Users\julia\Downloads\Flux Games\Builds\UWP\build\bin\Win32\Release\resources.pri
C:\Users\julia\Downloads\Flux Games\Builds\UWP\build\obj\Find Jog\Win32\Release\qualifiers.txt
C:\Users\julia\Downloads\Flux Games\Builds\UWP\build\obj\Find Jog\Win32\Release\qualifiers.txt.intermediate
C:\Users\julia\Downloads\Flux Games\Builds\UWP\build\obj\Find Jog\Win32\Release\MultipleQualifiersPerDimensionFound.txt
C:\Users\julia\Downloads\Flux Games\Builds\UWP\build\obj\Find Jog\Win32\Release\ProjectArchitectures.txt
C:\Users\julia\Downloads\Flux Games\Builds\UWP\build\obj\Find Jog\Win32\Release\.winmd_cache\$UnityPlayer.winmd_637503403320000000.json
C:\Users\julia\Downloads\Flux Games\Builds\UWP\build\bin\Win32\Release\AppxManifest.xml
C:\Users\julia\Downloads\Flux Games\Builds\UWP\build\bin\Win32\Release\Find Jog.build.appxrecipe
^C:\Users\julia\Downloads\Flux Games\Builds\UWP\Find Jog\Find Jog.vcxproj
C:\Users\julia\Downloads\Flux Games\Builds\UWP\build\obj\Find Jog\Win32\Release\Find Jog.vcxprojAssemblyReference.cache
C:\Users\julia\Downloads\Flux Games\Builds\UWP\build\obj\Find Jog\Win32\Release\Find Jog.vcxproj.CopyComplete
C:\Users\julia\Downloads\Flux Games\Builds\UWP\build\obj\Find Jog\Win32\Release\ResourceHandlingTask.state
C:\Users\julia\Downloads\Flux Games\Builds\UWP\build\obj\Find Jog\Win32\Release\Find Jog.vcxproj.GenerateResource.Cache
C:\Users\julia\Downloads\Flux Games\Builds\UWP\build\obj\Find Jog\Win32\Release\priconfig.xml
C:\Users\julia\Downloads\Flux Games\Builds\UWP\build\obj\Find Jog\Win32\Release\priconfig.xml.intermediate
C:\Users\julia\Downloads\Flux Games\Builds\UWP\build\obj\Find Jog\Win32\Release\unfiltered.layout.resfiles
C:\Users\julia\Downloads\Flux Games\Builds\UWP\build\obj\Find Jog\Win32\Release\unfiltered.layout.resfiles.intermediate
C:\Users\julia\Downloads\Flux Games\Builds\UWP\build\obj\Find Jog\Win32\Release\filtered.layout.resfiles
C:\Users\julia\Downloads\Flux Games\Builds\UWP\build\obj\Find Jog\Win32\Release\filtered.layout.resfiles.intermediate
C:\Users\julia\Downloads\Flux Games\Builds\UWP\build\obj\Find Jog\Win32\Release\excluded.layout.resfiles
C:\Users\julia\Downloads\Flux Games\Builds\UWP\build\obj\Find Jog\Win32\Release\excluded.layout.resfiles.intermediate
C:\Users\julia\Downloads\Flux Games\Builds\UWP\build\obj\Find Jog\Win32\Release\resources.resfiles
C:\Users\julia\Downloads\Flux Games\Builds\UWP\build\obj\Find Jog\Win32\Release\resources.resfiles.intermediate
C:\Users\julia\Downloads\Flux Games\Builds\UWP\build\obj\Find Jog\Win32\Release\pri.resfiles
C:\Users\julia\Downloads\Flux Games\Builds\UWP\build\obj\Find Jog\Win32\Release\pri.resfiles.intermediate
C:\Users\julia\Downloads\Flux Games\Builds\UWP\build\bin\Win32\Release\resources.pri
C:\Users\julia\Downloads\Flux Games\Builds\UWP\build\obj\Find Jog\Win32\Release\qualifiers.txt
C:\Users\julia\Downloads\Flux Games\Builds\UWP\build\obj\Find Jog\Win32\Release\qualifiers.txt.intermediate
C:\Users\julia\Downloads\Flux Games\Builds\UWP\build\obj\Find Jog\Win32\Release\MultipleQualifiersPerDimensionFound.txt
C:\Users\julia\Downloads\Flux Games\Builds\UWP\build\obj\Find Jog\Win32\Release\ProjectArchitectures.txt
C:\Users\julia\Downloads\Flux Games\Builds\UWP\build\obj\Find Jog\Win32\Release\.winmd_cache\$UnityPlayer.winmd_637503403320000000.json
C:\Users\julia\Downloads\Flux Games\Builds\UWP\build\bin\Win32\Release\AppxManifest.xml
C:\Users\julia\Downloads\Flux Games\Builds\UWP\build\bin\Win32\Release\Find Jog.build.appxrecipe
